%YAML 1.1
%TAG !u! tag:unity3d.com,2011:
--- !u!1 &4615364402666367216
GameObject:
  m_ObjectHideFlags: 0
  m_CorrespondingSourceObject: {fileID: 0}
  m_PrefabInstance: {fileID: 0}
  m_PrefabAsset: {fileID: 0}
  serializedVersion: 6
  m_Component:
  - component: {fileID: 4615364402666367215}
  - component: {fileID: 4615364402666367208}
  - component: {fileID: 4615364402666367209}
  - component: {fileID: 4615364402666367210}
  - component: {fileID: 4615364402666367211}
  - component: {fileID: 4615364402666367220}
  - component: {fileID: 4615364402666367221}
  - component: {fileID: 4615364402666367222}
  - component: {fileID: 4615364402666367223}
  - component: {fileID: 448610659}
  - component: {fileID: 623073080}
  m_Layer: 6
  m_Name: Player
  m_TagString: Player
  m_Icon: {fileID: 0}
  m_NavMeshLayer: 0
  m_StaticEditorFlags: 0
  m_IsActive: 1
--- !u!4 &4615364402666367215
Transform:
  m_ObjectHideFlags: 0
  m_CorrespondingSourceObject: {fileID: 0}
  m_PrefabInstance: {fileID: 0}
  m_PrefabAsset: {fileID: 0}
  m_GameObject: {fileID: 4615364402666367216}
  m_LocalRotation: {x: 0, y: 0, z: 0, w: 1}
  m_LocalPosition: {x: 1.0817454, y: -1.9985787, z: 0}
  m_LocalScale: {x: 9.841915, y: 9.841915, z: 9.841915}
  m_ConstrainProportionsScale: 0
  m_Children:
  - {fileID: 4615364403448587681}
  m_Father: {fileID: 0}
  m_RootOrder: 0
  m_LocalEulerAnglesHint: {x: 0, y: 0, z: 0}
--- !u!212 &4615364402666367208
SpriteRenderer:
  m_ObjectHideFlags: 0
  m_CorrespondingSourceObject: {fileID: 0}
  m_PrefabInstance: {fileID: 0}
  m_PrefabAsset: {fileID: 0}
  m_GameObject: {fileID: 4615364402666367216}
  m_Enabled: 1
  m_CastShadows: 0
  m_ReceiveShadows: 0
  m_DynamicOccludee: 1
  m_StaticShadowCaster: 0
  m_MotionVectors: 1
  m_LightProbeUsage: 1
  m_ReflectionProbeUsage: 1
  m_RayTracingMode: 0
  m_RayTraceProcedural: 0
  m_RenderingLayerMask: 1
  m_RendererPriority: 0
  m_Materials:
  - {fileID: 10754, guid: 0000000000000000f000000000000000, type: 0}
  m_StaticBatchInfo:
    firstSubMesh: 0
    subMeshCount: 0
  m_StaticBatchRoot: {fileID: 0}
  m_ProbeAnchor: {fileID: 0}
  m_LightProbeVolumeOverride: {fileID: 0}
  m_ScaleInLightmap: 1
  m_ReceiveGI: 1
  m_PreserveUVs: 0
  m_IgnoreNormalsForChartDetection: 0
  m_ImportantGI: 0
  m_StitchLightmapSeams: 1
  m_SelectedEditorRenderState: 0
  m_MinimumChartSize: 4
  m_AutoUVMaxDistance: 0.5
  m_AutoUVMaxAngle: 89
  m_LightmapParameters: {fileID: 0}
  m_SortingLayerID: -1987061333
  m_SortingLayer: 1
  m_SortingOrder: 1
  m_Sprite: {fileID: -605311552, guid: 47141e764a817034faad59f37dbb72dd, type: 3}
  m_Color: {r: 1, g: 1, b: 1, a: 1}
  m_FlipX: 0
  m_FlipY: 0
  m_DrawMode: 0
  m_Size: {x: 1, y: 1}
  m_AdaptiveModeThreshold: 0.5
  m_SpriteTileMode: 0
  m_WasSpriteAssigned: 1
  m_MaskInteraction: 0
  m_SpriteSortPoint: 0
--- !u!61 &4615364402666367209
BoxCollider2D:
  m_ObjectHideFlags: 0
  m_CorrespondingSourceObject: {fileID: 0}
  m_PrefabInstance: {fileID: 0}
  m_PrefabAsset: {fileID: 0}
  m_GameObject: {fileID: 4615364402666367216}
  m_Enabled: 1
  m_Density: 1
  m_Material: {fileID: 6200000, guid: a4a3b7e1dfd87be41ba665008dc94ca5, type: 2}
  m_IsTrigger: 0
  m_UsedByEffector: 0
  m_UsedByComposite: 0
  m_Offset: {x: -0.00009118579, y: -0.010938734}
  m_SpriteTilingProperty:
    border: {x: 0, y: 0, z: 0, w: 0}
    pivot: {x: 0.5, y: 0.5}
    oldSize: {x: 0.16, y: 0.22}
    newSize: {x: 1, y: 1}
    adaptiveTilingThreshold: 0.5
    drawMode: 0
    adaptiveTiling: 0
  m_AutoTiling: 0
  serializedVersion: 2
  m_Size: {x: 0.1232004, y: 0.207549}
  m_EdgeRadius: 0
--- !u!50 &4615364402666367210
Rigidbody2D:
  serializedVersion: 4
  m_ObjectHideFlags: 0
  m_CorrespondingSourceObject: {fileID: 0}
  m_PrefabInstance: {fileID: 0}
  m_PrefabAsset: {fileID: 0}
  m_GameObject: {fileID: 4615364402666367216}
  m_BodyType: 0
  m_Simulated: 1
  m_UseFullKinematicContacts: 0
  m_UseAutoMass: 0
  m_Mass: 1
  m_LinearDrag: 0
  m_AngularDrag: 0.05
  m_GravityScale: 0
  m_Material: {fileID: 6200000, guid: a4a3b7e1dfd87be41ba665008dc94ca5, type: 2}
  m_Interpolate: 0
  m_SleepingMode: 1
  m_CollisionDetection: 0
  m_Constraints: 4
--- !u!114 &4615364402666367211
MonoBehaviour:
  m_ObjectHideFlags: 0
  m_CorrespondingSourceObject: {fileID: 0}
  m_PrefabInstance: {fileID: 0}
  m_PrefabAsset: {fileID: 0}
  m_GameObject: {fileID: 4615364402666367216}
  m_Enabled: 1
  m_EditorHideFlags: 0
  m_Script: {fileID: 11500000, guid: f31d04c200ff3be418d491e66e0e35b9, type: 3}
  m_Name: 
  m_EditorClassIdentifier: 
  currentState: {fileID: 11400000, guid: 1d64ab597c7e60e428e8d64f16482fc2, type: 2}
  getDamaged: {fileID: 0}
  Stop: {fileID: 11400000, guid: ec68754575a263a47a81af901ebd1937, type: 2}
  Walk: {fileID: 11400000, guid: 1d64ab597c7e60e428e8d64f16482fc2, type: 2}
  DashAction: {fileID: 11400000, guid: 7b16bc4da61fb034c8e015ef7c9b7aea, type: 2}
  _playerDataSO: {fileID: 11400000, guid: e25446c7cb2760a4bade900ff47e2a14, type: 2}
  _playerStatsSO: {fileID: 11400000, guid: 900a3e6767725bc4388667676b5109d8, type: 2}
--- !u!114 &4615364402666367220
MonoBehaviour:
  m_ObjectHideFlags: 0
  m_CorrespondingSourceObject: {fileID: 0}
  m_PrefabInstance: {fileID: 0}
  m_PrefabAsset: {fileID: 0}
  m_GameObject: {fileID: 4615364402666367216}
  m_Enabled: 1
  m_EditorHideFlags: 0
  m_Script: {fileID: 11500000, guid: 3f5189eff67e26b40a103f9cbfdfd043, type: 3}
  m_Name: 
  m_EditorClassIdentifier: 
  inventory: {fileID: 11400000, guid: 62fbf13d0f435494381f5abe52e9a112, type: 2}
  firstWeapon: {fileID: 11400000, guid: a14b32f2525907a4b86afff92cef1497, type: 2}
  _bombs: {fileID: 2697207267220131333, guid: c7c285cdb97c0804180f01403afd18f6, type: 3}
--- !u!114 &4615364402666367221
MonoBehaviour:
  m_ObjectHideFlags: 0
  m_CorrespondingSourceObject: {fileID: 0}
  m_PrefabInstance: {fileID: 0}
  m_PrefabAsset: {fileID: 0}
  m_GameObject: {fileID: 4615364402666367216}
  m_Enabled: 1
  m_EditorHideFlags: 0
  m_Script: {fileID: 11500000, guid: d200b6357f3e53c48bdb5b29f3e14a74, type: 3}
  m_Name: 
  m_EditorClassIdentifier: 
--- !u!114 &4615364402666367222
MonoBehaviour:
  m_ObjectHideFlags: 0
  m_CorrespondingSourceObject: {fileID: 0}
  m_PrefabInstance: {fileID: 0}
  m_PrefabAsset: {fileID: 0}
  m_GameObject: {fileID: 4615364402666367216}
  m_Enabled: 1
  m_EditorHideFlags: 0
  m_Script: {fileID: 11500000, guid: fff6ceab6658b8545acb0b4a14b0613c, type: 3}
  m_Name: 
  m_EditorClassIdentifier: 
--- !u!95 &4615364402666367223
Animator:
  serializedVersion: 5
  m_ObjectHideFlags: 0
  m_CorrespondingSourceObject: {fileID: 0}
  m_PrefabInstance: {fileID: 0}
  m_PrefabAsset: {fileID: 0}
  m_GameObject: {fileID: 4615364402666367216}
  m_Enabled: 1
  m_Avatar: {fileID: 0}
  m_Controller: {fileID: 9100000, guid: b598b3196e31d0945968fc33a991efee, type: 2}
  m_CullingMode: 0
  m_UpdateMode: 0
  m_ApplyRootMotion: 0
  m_LinearVelocityBlending: 0
  m_StabilizeFeet: 0
  m_WarningMessage: 
  m_HasTransformHierarchy: 1
  m_AllowConstantClipSamplingOptimization: 1
  m_KeepAnimatorStateOnDisable: 0
--- !u!114 &448610659
MonoBehaviour:
  m_ObjectHideFlags: 0
  m_CorrespondingSourceObject: {fileID: 0}
  m_PrefabInstance: {fileID: 0}
  m_PrefabAsset: {fileID: 0}
  m_GameObject: {fileID: 4615364402666367216}
  m_Enabled: 1
  m_EditorHideFlags: 0
  m_Script: {fileID: 11500000, guid: e0ebd387d3c973e4689c0bc703ed712d, type: 3}
  m_Name: 
  m_EditorClassIdentifier: 
  playerStats: {fileID: 11400000, guid: 900a3e6767725bc4388667676b5109d8, type: 2}
--- !u!114 &623073080
MonoBehaviour:
  m_ObjectHideFlags: 0
  m_CorrespondingSourceObject: {fileID: 0}
  m_PrefabInstance: {fileID: 0}
  m_PrefabAsset: {fileID: 0}
  m_GameObject: {fileID: 4615364402666367216}
  m_Enabled: 1
  m_EditorHideFlags: 0
  m_Script: {fileID: 11500000, guid: 8f13bbc465a885e45aa480ac753888ac, type: 3}
  m_Name: 
  m_EditorClassIdentifier: 
  _stats: {fileID: 11400000, guid: 900a3e6767725bc4388667676b5109d8, type: 2}
--- !u!1 &4615364403448587682
GameObject:
  m_ObjectHideFlags: 0
  m_CorrespondingSourceObject: {fileID: 0}
  m_PrefabInstance: {fileID: 0}
  m_PrefabAsset: {fileID: 0}
  serializedVersion: 6
  m_Component:
  - component: {fileID: 4615364403448587681}
  - component: {fileID: 4615364403448587687}
  - component: {fileID: 4615364403448587680}
  - component: {fileID: 8581335152496445680}
  m_Layer: 3
  m_Name: PlayerHands_1
  m_TagString: Item
  m_Icon: {fileID: 0}
  m_NavMeshLayer: 0
  m_StaticEditorFlags: 0
  m_IsActive: 1
--- !u!4 &4615364403448587681
Transform:
  m_ObjectHideFlags: 0
  m_CorrespondingSourceObject: {fileID: 0}
  m_PrefabInstance: {fileID: 0}
  m_PrefabAsset: {fileID: 0}
  m_GameObject: {fileID: 4615364403448587682}
  m_LocalRotation: {x: 0, y: 0, z: 0, w: 1}
  m_LocalPosition: {x: 0.09369, y: -0.02021, z: 0}
  m_LocalScale: {x: 1.0276091, y: 1.0276091, z: 1.0276091}
  m_ConstrainProportionsScale: 0
  m_Children:
  - {fileID: 318602917719819697}
  m_Father: {fileID: 4615364402666367215}
  m_RootOrder: 0
  m_LocalEulerAnglesHint: {x: 0, y: 0, z: 0}
--- !u!212 &4615364403448587687
SpriteRenderer:
  m_ObjectHideFlags: 0
  m_CorrespondingSourceObject: {fileID: 0}
  m_PrefabInstance: {fileID: 0}
  m_PrefabAsset: {fileID: 0}
  m_GameObject: {fileID: 4615364403448587682}
  m_Enabled: 1
  m_CastShadows: 0
  m_ReceiveShadows: 0
  m_DynamicOccludee: 1
  m_StaticShadowCaster: 0
  m_MotionVectors: 1
  m_LightProbeUsage: 1
  m_ReflectionProbeUsage: 1
  m_RayTracingMode: 0
  m_RayTraceProcedural: 0
  m_RenderingLayerMask: 1
  m_RendererPriority: 0
  m_Materials:
  - {fileID: 10754, guid: 0000000000000000f000000000000000, type: 0}
  m_StaticBatchInfo:
    firstSubMesh: 0
    subMeshCount: 0
  m_StaticBatchRoot: {fileID: 0}
  m_ProbeAnchor: {fileID: 0}
  m_LightProbeVolumeOverride: {fileID: 0}
  m_ScaleInLightmap: 1
  m_ReceiveGI: 1
  m_PreserveUVs: 0
  m_IgnoreNormalsForChartDetection: 0
  m_ImportantGI: 0
  m_StitchLightmapSeams: 1
  m_SelectedEditorRenderState: 0
  m_MinimumChartSize: 4
  m_AutoUVMaxDistance: 0.5
  m_AutoUVMaxAngle: 89
  m_LightmapParameters: {fileID: 0}
  m_SortingLayerID: -1987061333
  m_SortingLayer: 1
  m_SortingOrder: 3
  m_Sprite: {fileID: -1300327856, guid: 1d4103240aaaa2a44b93b8e6042784af, type: 3}
  m_Color: {r: 1, g: 1, b: 1, a: 1}
  m_FlipX: 0
  m_FlipY: 0
  m_DrawMode: 0
  m_Size: {x: 0.11, y: 0.05}
  m_AdaptiveModeThreshold: 0.5
  m_SpriteTileMode: 0
  m_WasSpriteAssigned: 1
  m_MaskInteraction: 0
  m_SpriteSortPoint: 0
--- !u!114 &4615364403448587680
MonoBehaviour:
  m_ObjectHideFlags: 0
  m_CorrespondingSourceObject: {fileID: 0}
  m_PrefabInstance: {fileID: 0}
  m_PrefabAsset: {fileID: 0}
  m_GameObject: {fileID: 4615364403448587682}
  m_Enabled: 1
  m_EditorHideFlags: 0
  m_Script: {fileID: 11500000, guid: 0a2fe28061bca604495c438edae91c69, type: 3}
  m_Name: 
  m_EditorClassIdentifier: 
  _nearThePlayer: 5.5
--- !u!61 &8581335152496445680
BoxCollider2D:
  m_ObjectHideFlags: 0
  m_CorrespondingSourceObject: {fileID: 0}
  m_PrefabInstance: {fileID: 0}
  m_PrefabAsset: {fileID: 0}
  m_GameObject: {fileID: 4615364403448587682}
  m_Enabled: 1
  m_Density: 1
  m_Material: {fileID: 0}
  m_IsTrigger: 1
  m_UsedByEffector: 0
  m_UsedByComposite: 0
  m_Offset: {x: -0.0061552655, y: -0.0022233878}
  m_SpriteTilingProperty:
    border: {x: 0, y: 0, z: 0, w: 0}
    pivot: {x: 0.5, y: 0.5}
    oldSize: {x: 0.11, y: 0.05}
    newSize: {x: 0.11, y: 0.05}
    adaptiveTilingThreshold: 0.5
    drawMode: 0
    adaptiveTiling: 0
  m_AutoTiling: 0
  serializedVersion: 2
  m_Size: {x: 0.010685604, y: 0.010770629}
  m_EdgeRadius: 0
--- !u!1001 &4447575525303974816
PrefabInstance:
  m_ObjectHideFlags: 0
  serializedVersion: 2
  m_Modification:
    m_TransformParent: {fileID: 4615364403448587681}
    m_Modifications:
    - target: {fileID: 829112854201792109, guid: e46e626879b952f4ba0c54bbd259107b, type: 3}
      propertyPath: weaponLayer.m_Bits
      value: 8
      objectReference: {fileID: 0}
    - target: {fileID: 3042614691060331097, guid: e46e626879b952f4ba0c54bbd259107b, type: 3}
      propertyPath: m_Enabled
      value: 0
      objectReference: {fileID: 0}
    - target: {fileID: 4166693640172813841, guid: e46e626879b952f4ba0c54bbd259107b, type: 3}
      propertyPath: m_RootOrder
      value: 0
      objectReference: {fileID: 0}
    - target: {fileID: 4166693640172813841, guid: e46e626879b952f4ba0c54bbd259107b, type: 3}
      propertyPath: m_LocalScale.x
      value: 0.09887636
      objectReference: {fileID: 0}
    - target: {fileID: 4166693640172813841, guid: e46e626879b952f4ba0c54bbd259107b, type: 3}
      propertyPath: m_LocalScale.y
      value: 0.09887636
      objectReference: {fileID: 0}
    - target: {fileID: 4166693640172813841, guid: e46e626879b952f4ba0c54bbd259107b, type: 3}
      propertyPath: m_LocalScale.z
      value: 0.09887636
      objectReference: {fileID: 0}
    - target: {fileID: 4166693640172813841, guid: e46e626879b952f4ba0c54bbd259107b, type: 3}
      propertyPath: m_LocalPosition.x
      value: 0.017
      objectReference: {fileID: 0}
    - target: {fileID: 4166693640172813841, guid: e46e626879b952f4ba0c54bbd259107b, type: 3}
      propertyPath: m_LocalPosition.y
      value: 0
      objectReference: {fileID: 0}
    - target: {fileID: 4166693640172813841, guid: e46e626879b952f4ba0c54bbd259107b, type: 3}
      propertyPath: m_LocalPosition.z
      value: 0
      objectReference: {fileID: 0}
    - target: {fileID: 4166693640172813841, guid: e46e626879b952f4ba0c54bbd259107b, type: 3}
      propertyPath: m_LocalRotation.w
      value: 1
      objectReference: {fileID: 0}
    - target: {fileID: 4166693640172813841, guid: e46e626879b952f4ba0c54bbd259107b, type: 3}
      propertyPath: m_LocalRotation.x
      value: -0
      objectReference: {fileID: 0}
    - target: {fileID: 4166693640172813841, guid: e46e626879b952f4ba0c54bbd259107b, type: 3}
      propertyPath: m_LocalRotation.y
      value: -0
      objectReference: {fileID: 0}
    - target: {fileID: 4166693640172813841, guid: e46e626879b952f4ba0c54bbd259107b, type: 3}
      propertyPath: m_LocalRotation.z
      value: -0
      objectReference: {fileID: 0}
    - target: {fileID: 4166693640172813841, guid: e46e626879b952f4ba0c54bbd259107b, type: 3}
      propertyPath: m_LocalEulerAnglesHint.x
      value: 0
      objectReference: {fileID: 0}
    - target: {fileID: 4166693640172813841, guid: e46e626879b952f4ba0c54bbd259107b, type: 3}
      propertyPath: m_LocalEulerAnglesHint.y
      value: 0
      objectReference: {fileID: 0}
    - target: {fileID: 4166693640172813841, guid: e46e626879b952f4ba0c54bbd259107b, type: 3}
      propertyPath: m_LocalEulerAnglesHint.z
      value: 0
      objectReference: {fileID: 0}
    - target: {fileID: 6576852303854823454, guid: e46e626879b952f4ba0c54bbd259107b, type: 3}
      propertyPath: m_Name
      value: Weapon
      objectReference: {fileID: 0}
    - target: {fileID: 6576852303854823454, guid: e46e626879b952f4ba0c54bbd259107b, type: 3}
      propertyPath: m_Layer
      value: 3
      objectReference: {fileID: 0}
    m_RemovedComponents: []
  m_SourcePrefab: {fileID: 100100000, guid: e46e626879b952f4ba0c54bbd259107b, type: 3}
--- !u!4 &318602917719819697 stripped
Transform:
  m_CorrespondingSourceObject: {fileID: 4166693640172813841, guid: e46e626879b952f4ba0c54bbd259107b, type: 3}
  m_PrefabInstance: {fileID: 4447575525303974816}
  m_PrefabAsset: {fileID: 0}
--- !u!1 &7421186937644323774 stripped
GameObject:
  m_CorrespondingSourceObject: {fileID: 6576852303854823454, guid: e46e626879b952f4ba0c54bbd259107b, type: 3}
  m_PrefabInstance: {fileID: 4447575525303974816}
  m_PrefabAsset: {fileID: 0}
--- !u!50 &1722024639
Rigidbody2D:
  serializedVersion: 4
  m_ObjectHideFlags: 0
  m_CorrespondingSourceObject: {fileID: 0}
  m_PrefabInstance: {fileID: 0}
  m_PrefabAsset: {fileID: 0}
  m_GameObject: {fileID: 7421186937644323774}
  m_BodyType: 1
  m_Simulated: 1
  m_UseFullKinematicContacts: 0
  m_UseAutoMass: 0
  m_Mass: 1
  m_LinearDrag: 0
  m_AngularDrag: 0.05
  m_GravityScale: 1
  m_Material: {fileID: 0}
  m_Interpolate: 0
  m_SleepingMode: 1
  m_CollisionDetection: 0
  m_Constraints: 0
--- !u!114 &1722024641
MonoBehaviour:
  m_ObjectHideFlags: 0
  m_CorrespondingSourceObject: {fileID: 0}
  m_PrefabInstance: {fileID: 0}
  m_PrefabAsset: {fileID: 0}
  m_GameObject: {fileID: 7421186937644323774}
  m_Enabled: 1
  m_EditorHideFlags: 0
  m_Script: {fileID: 11500000, guid: 15925639575cfb84b8435b6f1b5c1baf, type: 3}
  m_Name: 
  m_EditorClassIdentifier: 
