%YAML 1.1
%TAG !u! tag:unity3d.com,2011:
--- !u!114 &11400000
MonoBehaviour:
  m_ObjectHideFlags: 0
  m_CorrespondingSourceObject: {fileID: 0}
  m_PrefabInstance: {fileID: 0}
  m_PrefabAsset: {fileID: 0}
  m_GameObject: {fileID: 0}
  m_Enabled: 1
  m_EditorHideFlags: 0
  m_Script: {fileID: 11500000, guid: 03237355e1591fb498ffe729d4b30c46, type: 3}
  m_Name: Shoot7SO
  m_EditorClassIdentifier: 
  Proyectile: {fileID: 3751626071147199352, guid: f9efd1e0cef879d468881a9c93f6f848, type: 3}
  ProyectileDamage: 10
  ProyectileSpeed: 1500
  BulletsXShoot: 1
  TotalBullets: 6
  currentBullets: 6
  maxDistance: 0
  CadenceTime: 0.2
  Reload: 0
  ImpulseForce: 500
  proyectileUser: 0
  rangeAttack: 1
