%YAML 1.1
%TAG !u! tag:unity3d.com,2011:
--- !u!74 &7400000
AnimationClip:
  m_ObjectHideFlags: 0
  m_CorrespondingSourceObject: {fileID: 0}
  m_PrefabInstance: {fileID: 0}
  m_PrefabAsset: {fileID: 0}
  m_Name: FireballIdleAnimation
  serializedVersion: 6
  m_Legacy: 0
  m_Compressed: 0
  m_UseHighQualityCurve: 1
  m_RotationCurves: []
  m_CompressedRotationCurves: []
  m_EulerCurves: []
  m_PositionCurves: []
  m_ScaleCurves: []
  m_FloatCurves: []
  m_PPtrCurves:
  - curve:
    - time: 0
      value: {fileID: 1908105674, guid: 61875b9a3f5112a40be606dc41be915d, type: 3}
    - time: 0.1
      value: {fileID: -495925324, guid: 61875b9a3f5112a40be606dc41be915d, type: 3}
    - time: 0.2
      value: {fileID: 1423200262, guid: 61875b9a3f5112a40be606dc41be915d, type: 3}
    - time: 0.3
      value: {fileID: 120464955, guid: 61875b9a3f5112a40be606dc41be915d, type: 3}
    - time: 0.4
      value: {fileID: 834589874, guid: 61875b9a3f5112a40be606dc41be915d, type: 3}
    - time: 0.5
      value: {fileID: 518372127, guid: 61875b9a3f5112a40be606dc41be915d, type: 3}
    - time: 0.6
      value: {fileID: -1732179079, guid: 61875b9a3f5112a40be606dc41be915d, type: 3}
    - time: 0.7
      value: {fileID: 1852859173, guid: 61875b9a3f5112a40be606dc41be915d, type: 3}
    - time: 0.8
      value: {fileID: 1708960196, guid: 61875b9a3f5112a40be606dc41be915d, type: 3}
    - time: 0.9
      value: {fileID: -979502923, guid: 61875b9a3f5112a40be606dc41be915d, type: 3}
    - time: 1
      value: {fileID: -1914196039, guid: 61875b9a3f5112a40be606dc41be915d, type: 3}
    - time: 1.1
      value: {fileID: 1176238399, guid: 61875b9a3f5112a40be606dc41be915d, type: 3}
    - time: 1.2
      value: {fileID: 1232634245, guid: 61875b9a3f5112a40be606dc41be915d, type: 3}
    - time: 1.3
      value: {fileID: -163966948, guid: 61875b9a3f5112a40be606dc41be915d, type: 3}
    - time: 1.4
      value: {fileID: -753745191, guid: 61875b9a3f5112a40be606dc41be915d, type: 3}
    - time: 1.5
      value: {fileID: 1174051326, guid: 61875b9a3f5112a40be606dc41be915d, type: 3}
    - time: 1.6
      value: {fileID: 495581007, guid: 61875b9a3f5112a40be606dc41be915d, type: 3}
    - time: 1.7
      value: {fileID: -2041446777, guid: 61875b9a3f5112a40be606dc41be915d, type: 3}
    - time: 1.8
      value: {fileID: -629250021, guid: 61875b9a3f5112a40be606dc41be915d, type: 3}
    - time: 1.9
      value: {fileID: 1059690756, guid: 61875b9a3f5112a40be606dc41be915d, type: 3}
    - time: 2
      value: {fileID: 595633694, guid: 61875b9a3f5112a40be606dc41be915d, type: 3}
    - time: 2.1
      value: {fileID: -1773178004, guid: 61875b9a3f5112a40be606dc41be915d, type: 3}
    - time: 2.2
      value: {fileID: 274563305, guid: 61875b9a3f5112a40be606dc41be915d, type: 3}
    - time: 2.3
      value: {fileID: 94589486, guid: 61875b9a3f5112a40be606dc41be915d, type: 3}
    - time: 2.4
      value: {fileID: 1602356221, guid: 61875b9a3f5112a40be606dc41be915d, type: 3}
    - time: 2.5
      value: {fileID: -1171060011, guid: 61875b9a3f5112a40be606dc41be915d, type: 3}
    - time: 2.6
      value: {fileID: 559388547, guid: 61875b9a3f5112a40be606dc41be915d, type: 3}
    - time: 2.7
      value: {fileID: -1305279842, guid: 61875b9a3f5112a40be606dc41be915d, type: 3}
    - time: 2.8
      value: {fileID: -1835162197, guid: 61875b9a3f5112a40be606dc41be915d, type: 3}
    - time: 2.9
      value: {fileID: 2134050415, guid: 61875b9a3f5112a40be606dc41be915d, type: 3}
    - time: 3
      value: {fileID: -1104043990, guid: 61875b9a3f5112a40be606dc41be915d, type: 3}
    - time: 3.1
      value: {fileID: 1492858119, guid: 61875b9a3f5112a40be606dc41be915d, type: 3}
    - time: 3.2
      value: {fileID: -1445605557, guid: 61875b9a3f5112a40be606dc41be915d, type: 3}
    - time: 3.3
      value: {fileID: -1471093754, guid: 61875b9a3f5112a40be606dc41be915d, type: 3}
    - time: 3.4
      value: {fileID: 1546898311, guid: 61875b9a3f5112a40be606dc41be915d, type: 3}
    - time: 3.5
      value: {fileID: -1327008671, guid: 61875b9a3f5112a40be606dc41be915d, type: 3}
    - time: 3.6
      value: {fileID: 1909929585, guid: 61875b9a3f5112a40be606dc41be915d, type: 3}
    - time: 3.7
      value: {fileID: 1491088539, guid: 61875b9a3f5112a40be606dc41be915d, type: 3}
    - time: 3.8
      value: {fileID: 498273345, guid: 61875b9a3f5112a40be606dc41be915d, type: 3}
    - time: 3.9
      value: {fileID: -801597871, guid: 61875b9a3f5112a40be606dc41be915d, type: 3}
    - time: 4
      value: {fileID: 862902939, guid: 61875b9a3f5112a40be606dc41be915d, type: 3}
    - time: 4.1
      value: {fileID: -689849960, guid: 61875b9a3f5112a40be606dc41be915d, type: 3}
    - time: 4.2
      value: {fileID: 985042812, guid: 61875b9a3f5112a40be606dc41be915d, type: 3}
    - time: 4.3
      value: {fileID: -1672607076, guid: 61875b9a3f5112a40be606dc41be915d, type: 3}
    - time: 4.4
      value: {fileID: 1077396063, guid: 61875b9a3f5112a40be606dc41be915d, type: 3}
    - time: 4.5
      value: {fileID: -450694126, guid: 61875b9a3f5112a40be606dc41be915d, type: 3}
    - time: 4.6
      value: {fileID: 27984663, guid: 61875b9a3f5112a40be606dc41be915d, type: 3}
    - time: 4.7
      value: {fileID: 523362094, guid: 61875b9a3f5112a40be606dc41be915d, type: 3}
    - time: 4.8
      value: {fileID: 788969413, guid: 61875b9a3f5112a40be606dc41be915d, type: 3}
    - time: 4.9
      value: {fileID: 1129103397, guid: 61875b9a3f5112a40be606dc41be915d, type: 3}
    - time: 5
      value: {fileID: -850450213, guid: 61875b9a3f5112a40be606dc41be915d, type: 3}
    - time: 5.1
      value: {fileID: -1385076185, guid: 61875b9a3f5112a40be606dc41be915d, type: 3}
    - time: 5.2
      value: {fileID: -1738086426, guid: 61875b9a3f5112a40be606dc41be915d, type: 3}
    - time: 5.3
      value: {fileID: 1913944058, guid: 61875b9a3f5112a40be606dc41be915d, type: 3}
    - time: 5.4
      value: {fileID: -929644314, guid: 61875b9a3f5112a40be606dc41be915d, type: 3}
    - time: 5.5
      value: {fileID: 1644936069, guid: 61875b9a3f5112a40be606dc41be915d, type: 3}
    - time: 5.6
      value: {fileID: -1466043203, guid: 61875b9a3f5112a40be606dc41be915d, type: 3}
    - time: 5.7
      value: {fileID: 1022673635, guid: 61875b9a3f5112a40be606dc41be915d, type: 3}
    - time: 5.8
      value: {fileID: -216676026, guid: 61875b9a3f5112a40be606dc41be915d, type: 3}
    - time: 5.9
      value: {fileID: -1512098932, guid: 61875b9a3f5112a40be606dc41be915d, type: 3}
    attribute: m_Sprite
    path: 
    classID: 212
    script: {fileID: 0}
  m_SampleRate: 10
  m_WrapMode: 0
  m_Bounds:
    m_Center: {x: 0, y: 0, z: 0}
    m_Extent: {x: 0, y: 0, z: 0}
  m_ClipBindingConstant:
    genericBindings:
    - serializedVersion: 2
      path: 0
      attribute: 0
      script: {fileID: 0}
      typeID: 212
      customType: 23
      isPPtrCurve: 1
    pptrCurveMapping:
    - {fileID: 1908105674, guid: 61875b9a3f5112a40be606dc41be915d, type: 3}
    - {fileID: -495925324, guid: 61875b9a3f5112a40be606dc41be915d, type: 3}
    - {fileID: 1423200262, guid: 61875b9a3f5112a40be606dc41be915d, type: 3}
    - {fileID: 120464955, guid: 61875b9a3f5112a40be606dc41be915d, type: 3}
    - {fileID: 834589874, guid: 61875b9a3f5112a40be606dc41be915d, type: 3}
    - {fileID: 518372127, guid: 61875b9a3f5112a40be606dc41be915d, type: 3}
    - {fileID: -1732179079, guid: 61875b9a3f5112a40be606dc41be915d, type: 3}
    - {fileID: 1852859173, guid: 61875b9a3f5112a40be606dc41be915d, type: 3}
    - {fileID: 1708960196, guid: 61875b9a3f5112a40be606dc41be915d, type: 3}
    - {fileID: -979502923, guid: 61875b9a3f5112a40be606dc41be915d, type: 3}
    - {fileID: -1914196039, guid: 61875b9a3f5112a40be606dc41be915d, type: 3}
    - {fileID: 1176238399, guid: 61875b9a3f5112a40be606dc41be915d, type: 3}
    - {fileID: 1232634245, guid: 61875b9a3f5112a40be606dc41be915d, type: 3}
    - {fileID: -163966948, guid: 61875b9a3f5112a40be606dc41be915d, type: 3}
    - {fileID: -753745191, guid: 61875b9a3f5112a40be606dc41be915d, type: 3}
    - {fileID: 1174051326, guid: 61875b9a3f5112a40be606dc41be915d, type: 3}
    - {fileID: 495581007, guid: 61875b9a3f5112a40be606dc41be915d, type: 3}
    - {fileID: -2041446777, guid: 61875b9a3f5112a40be606dc41be915d, type: 3}
    - {fileID: -629250021, guid: 61875b9a3f5112a40be606dc41be915d, type: 3}
    - {fileID: 1059690756, guid: 61875b9a3f5112a40be606dc41be915d, type: 3}
    - {fileID: 595633694, guid: 61875b9a3f5112a40be606dc41be915d, type: 3}
    - {fileID: -1773178004, guid: 61875b9a3f5112a40be606dc41be915d, type: 3}
    - {fileID: 274563305, guid: 61875b9a3f5112a40be606dc41be915d, type: 3}
    - {fileID: 94589486, guid: 61875b9a3f5112a40be606dc41be915d, type: 3}
    - {fileID: 1602356221, guid: 61875b9a3f5112a40be606dc41be915d, type: 3}
    - {fileID: -1171060011, guid: 61875b9a3f5112a40be606dc41be915d, type: 3}
    - {fileID: 559388547, guid: 61875b9a3f5112a40be606dc41be915d, type: 3}
    - {fileID: -1305279842, guid: 61875b9a3f5112a40be606dc41be915d, type: 3}
    - {fileID: -1835162197, guid: 61875b9a3f5112a40be606dc41be915d, type: 3}
    - {fileID: 2134050415, guid: 61875b9a3f5112a40be606dc41be915d, type: 3}
    - {fileID: -1104043990, guid: 61875b9a3f5112a40be606dc41be915d, type: 3}
    - {fileID: 1492858119, guid: 61875b9a3f5112a40be606dc41be915d, type: 3}
    - {fileID: -1445605557, guid: 61875b9a3f5112a40be606dc41be915d, type: 3}
    - {fileID: -1471093754, guid: 61875b9a3f5112a40be606dc41be915d, type: 3}
    - {fileID: 1546898311, guid: 61875b9a3f5112a40be606dc41be915d, type: 3}
    - {fileID: -1327008671, guid: 61875b9a3f5112a40be606dc41be915d, type: 3}
    - {fileID: 1909929585, guid: 61875b9a3f5112a40be606dc41be915d, type: 3}
    - {fileID: 1491088539, guid: 61875b9a3f5112a40be606dc41be915d, type: 3}
    - {fileID: 498273345, guid: 61875b9a3f5112a40be606dc41be915d, type: 3}
    - {fileID: -801597871, guid: 61875b9a3f5112a40be606dc41be915d, type: 3}
    - {fileID: 862902939, guid: 61875b9a3f5112a40be606dc41be915d, type: 3}
    - {fileID: -689849960, guid: 61875b9a3f5112a40be606dc41be915d, type: 3}
    - {fileID: 985042812, guid: 61875b9a3f5112a40be606dc41be915d, type: 3}
    - {fileID: -1672607076, guid: 61875b9a3f5112a40be606dc41be915d, type: 3}
    - {fileID: 1077396063, guid: 61875b9a3f5112a40be606dc41be915d, type: 3}
    - {fileID: -450694126, guid: 61875b9a3f5112a40be606dc41be915d, type: 3}
    - {fileID: 27984663, guid: 61875b9a3f5112a40be606dc41be915d, type: 3}
    - {fileID: 523362094, guid: 61875b9a3f5112a40be606dc41be915d, type: 3}
    - {fileID: 788969413, guid: 61875b9a3f5112a40be606dc41be915d, type: 3}
    - {fileID: 1129103397, guid: 61875b9a3f5112a40be606dc41be915d, type: 3}
    - {fileID: -850450213, guid: 61875b9a3f5112a40be606dc41be915d, type: 3}
    - {fileID: -1385076185, guid: 61875b9a3f5112a40be606dc41be915d, type: 3}
    - {fileID: -1738086426, guid: 61875b9a3f5112a40be606dc41be915d, type: 3}
    - {fileID: 1913944058, guid: 61875b9a3f5112a40be606dc41be915d, type: 3}
    - {fileID: -929644314, guid: 61875b9a3f5112a40be606dc41be915d, type: 3}
    - {fileID: 1644936069, guid: 61875b9a3f5112a40be606dc41be915d, type: 3}
    - {fileID: -1466043203, guid: 61875b9a3f5112a40be606dc41be915d, type: 3}
    - {fileID: 1022673635, guid: 61875b9a3f5112a40be606dc41be915d, type: 3}
    - {fileID: -216676026, guid: 61875b9a3f5112a40be606dc41be915d, type: 3}
    - {fileID: -1512098932, guid: 61875b9a3f5112a40be606dc41be915d, type: 3}
  m_AnimationClipSettings:
    serializedVersion: 2
    m_AdditiveReferencePoseClip: {fileID: 0}
    m_AdditiveReferencePoseTime: 0
    m_StartTime: 0
    m_StopTime: 6
    m_OrientationOffsetY: 0
    m_Level: 0
    m_CycleOffset: 0
    m_HasAdditiveReferencePose: 0
    m_LoopTime: 1
    m_LoopBlend: 0
    m_LoopBlendOrientation: 0
    m_LoopBlendPositionY: 0
    m_LoopBlendPositionXZ: 0
    m_KeepOriginalOrientation: 0
    m_KeepOriginalPositionY: 1
    m_KeepOriginalPositionXZ: 0
    m_HeightFromFeet: 0
    m_Mirror: 0
  m_EditorCurves: []
  m_EulerEditorCurves: []
  m_HasGenericRootTransform: 0
  m_HasMotionFloatCurves: 0
  m_Events: []
