%YAML 1.1
%TAG !u! tag:unity3d.com,2011:
--- !u!1 &8766343710198081654
GameObject:
  m_ObjectHideFlags: 0
  m_CorrespondingSourceObject: {fileID: 0}
  m_PrefabInstance: {fileID: 0}
  m_PrefabAsset: {fileID: 0}
  serializedVersion: 6
  m_Component:
  - component: {fileID: 1347871268424807369}
  - component: {fileID: 5080256384779233149}
  m_Layer: 0
  m_Name: Bullet
  m_TagString: Untagged
  m_Icon: {fileID: 0}
  m_NavMeshLayer: 0
  m_StaticEditorFlags: 0
  m_IsActive: 1
--- !u!4 &1347871268424807369
Transform:
  m_ObjectHideFlags: 0
  m_CorrespondingSourceObject: {fileID: 0}
  m_PrefabInstance: {fileID: 0}
  m_PrefabAsset: {fileID: 0}
  m_GameObject: {fileID: 8766343710198081654}
  m_LocalRotation: {x: 0, y: 0, z: 0, w: 1}
  m_LocalPosition: {x: 349.924, y: 1.0719515, z: 231.36176}
  m_LocalScale: {x: 1, y: 1, z: 1}
  m_ConstrainProportionsScale: 0
  m_Children:
  - {fileID: 2773646444203388667}
  m_Father: {fileID: 0}
  m_RootOrder: 0
  m_LocalEulerAnglesHint: {x: 0, y: 0, z: 0}
--- !u!54 &5080256384779233149
Rigidbody:
  m_ObjectHideFlags: 0
  m_CorrespondingSourceObject: {fileID: 0}
  m_PrefabInstance: {fileID: 0}
  m_PrefabAsset: {fileID: 0}
  m_GameObject: {fileID: 8766343710198081654}
  serializedVersion: 2
  m_Mass: 1
  m_Drag: 0
  m_AngularDrag: 0.05
  m_UseGravity: 1
  m_IsKinematic: 0
  m_Interpolate: 0
  m_Constraints: 0
  m_CollisionDetection: 0
--- !u!1001 &2447497230991083792
PrefabInstance:
  m_ObjectHideFlags: 0
  serializedVersion: 2
  m_Modification:
    m_TransformParent: {fileID: 1347871268424807369}
    m_Modifications:
    - target: {fileID: -8679921383154817045, guid: da415f333b1fb2b4a923c2bd464d551a, type: 3}
      propertyPath: m_RootOrder
      value: 0
      objectReference: {fileID: 0}
    - target: {fileID: -8679921383154817045, guid: da415f333b1fb2b4a923c2bd464d551a, type: 3}
      propertyPath: m_LocalPosition.x
      value: -0.005
      objectReference: {fileID: 0}
    - target: {fileID: -8679921383154817045, guid: da415f333b1fb2b4a923c2bd464d551a, type: 3}
      propertyPath: m_LocalPosition.y
      value: 0
      objectReference: {fileID: 0}
    - target: {fileID: -8679921383154817045, guid: da415f333b1fb2b4a923c2bd464d551a, type: 3}
      propertyPath: m_LocalPosition.z
      value: 0
      objectReference: {fileID: 0}
    - target: {fileID: -8679921383154817045, guid: da415f333b1fb2b4a923c2bd464d551a, type: 3}
      propertyPath: m_LocalRotation.w
      value: 1
      objectReference: {fileID: 0}
    - target: {fileID: -8679921383154817045, guid: da415f333b1fb2b4a923c2bd464d551a, type: 3}
      propertyPath: m_LocalRotation.x
      value: 0
      objectReference: {fileID: 0}
    - target: {fileID: -8679921383154817045, guid: da415f333b1fb2b4a923c2bd464d551a, type: 3}
      propertyPath: m_LocalRotation.y
      value: -0
      objectReference: {fileID: 0}
    - target: {fileID: -8679921383154817045, guid: da415f333b1fb2b4a923c2bd464d551a, type: 3}
      propertyPath: m_LocalRotation.z
      value: -0
      objectReference: {fileID: 0}
    - target: {fileID: -8679921383154817045, guid: da415f333b1fb2b4a923c2bd464d551a, type: 3}
      propertyPath: m_LocalEulerAnglesHint.x
      value: 0
      objectReference: {fileID: 0}
    - target: {fileID: -8679921383154817045, guid: da415f333b1fb2b4a923c2bd464d551a, type: 3}
      propertyPath: m_LocalEulerAnglesHint.y
      value: 0
      objectReference: {fileID: 0}
    - target: {fileID: -8679921383154817045, guid: da415f333b1fb2b4a923c2bd464d551a, type: 3}
      propertyPath: m_LocalEulerAnglesHint.z
      value: 0
      objectReference: {fileID: 0}
    - target: {fileID: -7511558181221131132, guid: da415f333b1fb2b4a923c2bd464d551a, type: 3}
      propertyPath: m_Materials.Array.data[0]
      value: 
      objectReference: {fileID: 2100000, guid: 7b9130703b27f574cb3b49b20f95204b, type: 2}
    - target: {fileID: 919132149155446097, guid: da415f333b1fb2b4a923c2bd464d551a, type: 3}
      propertyPath: m_Name
      value: Bullet
      objectReference: {fileID: 0}
    m_RemovedComponents: []
  m_SourcePrefab: {fileID: 100100000, guid: da415f333b1fb2b4a923c2bd464d551a, type: 3}
--- !u!4 &2773646444203388667 stripped
Transform:
  m_CorrespondingSourceObject: {fileID: -8679921383154817045, guid: da415f333b1fb2b4a923c2bd464d551a, type: 3}
  m_PrefabInstance: {fileID: 2447497230991083792}
  m_PrefabAsset: {fileID: 0}
--- !u!1 &3257835439397336129 stripped
GameObject:
  m_CorrespondingSourceObject: {fileID: 919132149155446097, guid: da415f333b1fb2b4a923c2bd464d551a, type: 3}
  m_PrefabInstance: {fileID: 2447497230991083792}
  m_PrefabAsset: {fileID: 0}
--- !u!65 &5251737882145275177
BoxCollider:
  m_ObjectHideFlags: 0
  m_CorrespondingSourceObject: {fileID: 0}
  m_PrefabInstance: {fileID: 0}
  m_PrefabAsset: {fileID: 0}
  m_GameObject: {fileID: 3257835439397336129}
  m_Material: {fileID: 0}
  m_IsTrigger: 0
  m_Enabled: 1
  serializedVersion: 2
  m_Size: {x: 0.029152963, y: 0.009948976, z: 0.009948973}
  m_Center: {x: -0.0000000013969839, y: -0.0000000016298145, z: 0.0000000016298145}
