%YAML 1.1
%TAG !u! tag:unity3d.com,2011:
--- !u!74 &7400000
AnimationClip:
  m_ObjectHideFlags: 0
  m_CorrespondingSourceObject: {fileID: 0}
  m_PrefabInstance: {fileID: 0}
  m_PrefabAsset: {fileID: 0}
  m_Name: Player_Idle
  serializedVersion: 6
  m_Legacy: 0
  m_Compressed: 0
  m_UseHighQualityCurve: 1
  m_RotationCurves: []
  m_CompressedRotationCurves: []
  m_EulerCurves: []
  m_PositionCurves: []
  m_ScaleCurves: []
  m_FloatCurves:
  - curve:
      serializedVersion: 2
      m_Curve:
      - serializedVersion: 3
        time: 0
        value: 1
        inSlope: 0
        outSlope: 0
        tangentMode: 136
        weightedMode: 0
        inWeight: 0.33333334
        outWeight: 0.33333334
      - serializedVersion: 3
        time: 0.8333333
        value: 1
        inSlope: 0
        outSlope: 0
        tangentMode: 136
        weightedMode: 0
        inWeight: 0.33333334
        outWeight: 0.33333334
      m_PreInfinity: 2
      m_PostInfinity: 2
      m_RotationOrder: 4
    attribute: m_GravityScale
    path: 
    classID: 50
    script: {fileID: 0}
  m_PPtrCurves:
  - curve:
    - time: 0
      value: {fileID: 21300000, guid: a06e385f17338924aa8e98cd464d192f, type: 3}
    - time: 0.083333336
      value: {fileID: 21300000, guid: 03c5820e53a1e2e41a6c6ab73a9a5857, type: 3}
    - time: 0.16666667
      value: {fileID: 21300000, guid: 9ab38f0d97c1c404a979b8d23b8a20af, type: 3}
    - time: 0.25
      value: {fileID: 21300000, guid: b985ec58fb476714db8ac7ca998a9746, type: 3}
    - time: 0.33333334
      value: {fileID: 21300000, guid: a9c3b85bca418d24d89ed1121b2b41a3, type: 3}
    - time: 0.41666666
      value: {fileID: 21300000, guid: 52ff7d5962d3d10428e575e8a4ed537b, type: 3}
    - time: 0.5
      value: {fileID: 21300000, guid: 00bbdc3b4c78fc147ab587eefdd3a7cb, type: 3}
    - time: 0.5833333
      value: {fileID: 21300000, guid: 6021b172bf2db984a85020793bbbd107, type: 3}
    - time: 0.6666667
      value: {fileID: 21300000, guid: e13fca3a1fe659d40a5869b49ee74ca3, type: 3}
    - time: 0.75
      value: {fileID: 21300000, guid: a8115c725f85a82499f9c47c655b2df6, type: 3}
    attribute: m_Sprite
    path: 
    classID: 212
    script: {fileID: 0}
  m_SampleRate: 12
  m_WrapMode: 0
  m_Bounds:
    m_Center: {x: 0, y: 0, z: 0}
    m_Extent: {x: 0, y: 0, z: 0}
  m_ClipBindingConstant:
    genericBindings:
    - serializedVersion: 2
      path: 0
      attribute: 0
      script: {fileID: 0}
      typeID: 212
      customType: 23
      isPPtrCurve: 1
    - serializedVersion: 2
      path: 0
      attribute: 2336549521
      script: {fileID: 0}
      typeID: 50
      customType: 0
      isPPtrCurve: 0
    pptrCurveMapping:
    - {fileID: 21300000, guid: a06e385f17338924aa8e98cd464d192f, type: 3}
    - {fileID: 21300000, guid: 03c5820e53a1e2e41a6c6ab73a9a5857, type: 3}
    - {fileID: 21300000, guid: 9ab38f0d97c1c404a979b8d23b8a20af, type: 3}
    - {fileID: 21300000, guid: b985ec58fb476714db8ac7ca998a9746, type: 3}
    - {fileID: 21300000, guid: a9c3b85bca418d24d89ed1121b2b41a3, type: 3}
    - {fileID: 21300000, guid: 52ff7d5962d3d10428e575e8a4ed537b, type: 3}
    - {fileID: 21300000, guid: 00bbdc3b4c78fc147ab587eefdd3a7cb, type: 3}
    - {fileID: 21300000, guid: 6021b172bf2db984a85020793bbbd107, type: 3}
    - {fileID: 21300000, guid: e13fca3a1fe659d40a5869b49ee74ca3, type: 3}
    - {fileID: 21300000, guid: a8115c725f85a82499f9c47c655b2df6, type: 3}
  m_AnimationClipSettings:
    serializedVersion: 2
    m_AdditiveReferencePoseClip: {fileID: 0}
    m_AdditiveReferencePoseTime: 0
    m_StartTime: 0
    m_StopTime: 0.8333333
    m_OrientationOffsetY: 0
    m_Level: 0
    m_CycleOffset: 0
    m_HasAdditiveReferencePose: 0
    m_LoopTime: 1
    m_LoopBlend: 0
    m_LoopBlendOrientation: 0
    m_LoopBlendPositionY: 0
    m_LoopBlendPositionXZ: 0
    m_KeepOriginalOrientation: 0
    m_KeepOriginalPositionY: 1
    m_KeepOriginalPositionXZ: 0
    m_HeightFromFeet: 0
    m_Mirror: 0
  m_EditorCurves:
  - curve:
      serializedVersion: 2
      m_Curve:
      - serializedVersion: 3
        time: 0
        value: 1
        inSlope: 0
        outSlope: 0
        tangentMode: 136
        weightedMode: 0
        inWeight: 0.33333334
        outWeight: 0.33333334
      - serializedVersion: 3
        time: 0.8333333
        value: 1
        inSlope: 0
        outSlope: 0
        tangentMode: 136
        weightedMode: 0
        inWeight: 0.33333334
        outWeight: 0.33333334
      m_PreInfinity: 2
      m_PostInfinity: 2
      m_RotationOrder: 4
    attribute: m_GravityScale
    path: 
    classID: 50
    script: {fileID: 0}
  m_EulerEditorCurves: []
  m_HasGenericRootTransform: 0
  m_HasMotionFloatCurves: 0
  m_Events: []
