%YAML 1.1
%TAG !u! tag:unity3d.com,2011:
--- !u!1045 &1
EditorBuildSettings:
  m_ObjectHideFlags: 0
  serializedVersion: 2
  m_Scenes:
  - enabled: 0
    path: 
    guid: 2cda990e2423bbf4892e6590ba056729
  - enabled: 1
    path: Assets/Scenes/MainMenuScene.unity
    guid: fe7b7f874d6c7ed41b5d15371658383b
  - enabled: 1
    path: Assets/Scenes/Lvl1Scene.unity
    guid: 9a96552c0697037479216fa302c9c47f
  - enabled: 1
    path: Assets/Scenes/Lvl2Scene.unity
    guid: f0d6bd22a549af849879fbe87a8d3212
  - enabled: 1
    path: Assets/Scenes/WinScene.unity
    guid: 229a8de140bf2fa4cada507199600f20
  - enabled: 1
    path: Assets/Scenes/LoseScene.unity
    guid: 9e4bc77f7945bef488ad778e23691c9c
  m_configObjects: {}
