<?xml version="1.0" encoding="utf-8"?>
<!-- Generator: Adobe Illustrator 22.0.0, SVG Export Plug-In . SVG Version: 6.00 Build 0)  -->
<svg version="1.1" id="Capa_1" xmlns="http://www.w3.org/2000/svg" xmlns:xlink="http://www.w3.org/1999/xlink" x="0px" y="0px"
	 viewBox="0 0 75 75" style="enable-background:new 0 0 75 75;" xml:space="preserve">
<style type="text/css">
	.st0{fill:#D7782D;}
</style>
<g>
	<g>
		<path class="st0" d="M37.5,70C19.6,70,5,55.4,5,37.5C5,19.6,19.6,5,37.5,5C55.4,5,70,19.6,70,37.5C70,55.4,55.4,70,37.5,70z
			 M37.5,7.2C20.8,7.2,7.2,20.8,7.2,37.5c0,16.7,13.6,30.3,30.3,30.3c16.7,0,30.3-13.6,30.3-30.3C67.8,20.8,54.2,7.2,37.5,7.2z"/>
	</g>
	<g>
		<g>
			<path class="st0" d="M33.3,32.1l-0.2-0.3h-0.3c0-3.8,2-4.8,3.1-5.1c0.3-0.1,0.4-0.4,0.2-0.7c-2.1-2.8-4.5-3.3-5.7-3.3h-6.4h0H23
				c-0.5,0-0.9,0.4-0.9,0.9v2.1c0,0.5,0.4,0.9,0.9,0.9h1.1v0.1c0.4,0,0.8,0.1,1.2,0.2c-0.1,0.3-0.7,4.1-1.9,5.3
				c-1.2,1.2,0.7,1.7,1.6-0.3c0.8-1.8,2.1-2.4,2.6-2.4c0.4,1,0.6,2,0.6,2.3h-0.3v0.7c0,3.4-1.5,4.9-3.1,6.5
				c-1.4,1.4-2.9,2.9-3.2,5.7c-0.3,2.4,0,4.4,0.6,5.9c0.5,1.2,1.2,1.6,1.3,1.6l0.2,0.1h10.7l0.2-0.4c1-2.5,1.6-5,1.7-7.6
				c0.1-2.1-0.1-4.2-0.6-6.3C34.8,34.4,33.4,32.2,33.3,32.1z M30.2,40.6H25c0.2-0.2,0.5-0.5,0.7-0.7c1.5-1.5,3.3-3.2,3.5-6.8h1
				C30.7,36.2,30.5,38.7,30.2,40.6z M31.6,40.6c0.3-1.9,0.4-4.5,0-7.5h0.8v0c0.5,0.9,1.4,2.8,2,5.2c0.2,0.8,0.3,1.5,0.4,2.3H31.6z"
				/>
		</g>
		<g>
			<path class="st0" d="M46.9,28c0-0.5-0.4-0.9-0.9-1c0,0,0-0.1,0-0.1c0-0.1,0-0.2,0-0.3l-0.5-2.8c-0.1-0.5-0.6-0.9-1.1-0.9H41
				c-0.6,0-1,0.4-1.1,1l-0.5,2.9c0,0.1,0,0.2,0,0.3c-0.5,0.1-0.9,0.5-0.9,1l-1.7,23c0,0.3,0.1,0.6,0.3,0.9c0.2,0.2,0.5,0.4,0.8,0.4
				h9.4c0.6,0,1.1-0.5,1.1-1.1c0-0.1,0-0.1,0-0.2L46.9,28z"/>
			<path class="st0" d="M52.5,22.8c-0.1,0-0.2,0-0.3,0c-0.1,0-0.1,0-0.2,0h-1.6c-0.6,0-1,0.5-1,1c0,0.4,0.2,0.7,0.5,0.9
				c-0.3,0.2-0.5,0.5-0.5,0.9s0.2,0.7,0.5,0.9c-0.3,0.2-0.5,0.5-0.5,0.9c0,0.4,0.2,0.7,0.5,0.9c-0.3,0.2-0.5,0.5-0.5,0.9
				c0,0.6,0.5,1,1,1h1v0.5l-1.7,5c0,0.1-0.1,0.2-0.1,0.3v15.4c0,0.6,0.5,1,1,1c0.6,0,1-0.5,1-1V36l1.7-5c0-0.1,0.1-0.2,0.1-0.3v-6.8
				C53.5,23.3,53,22.8,52.5,22.8z"/>
		</g>
	</g>
</g>
</svg>
