<?xml version="1.0" encoding="utf-8"?>
<!-- Generator: Adobe Illustrator 19.2.0, SVG Export Plug-In . SVG Version: 6.00 Build 0)  -->
<svg version="1.1" id="Capa_1" xmlns="http://www.w3.org/2000/svg" xmlns:xlink="http://www.w3.org/1999/xlink" x="0px" y="0px"
	 width="800px" height="800px" viewBox="0 0 800 800" style="enable-background:new 0 0 800 800;" xml:space="preserve">
<style type="text/css">
	.st0{fill:url(#SVGID_1_);}
	.st1{fill:url(#SVGID_2_);}
	.st2{fill:url(#SVGID_3_);}
	.st3{fill:url(#SVGID_4_);}
	.st4{fill:url(#SVGID_5_);}
	.st5{fill:url(#SVGID_6_);}
	.st6{fill:url(#SVGID_7_);}
	.st7{fill:url(#SVGID_8_);}
	.st8{fill:url(#SVGID_9_);}
	.st9{fill:url(#SVGID_10_);}
</style>
<g>
	<g>
		<g>
			<linearGradient id="SVGID_1_" gradientUnits="userSpaceOnUse" x1="393.9624" y1="353.904" x2="393.9624" y2="458.1049">
				<stop  offset="0" style="stop-color:#8FFF3C"/>
				<stop  offset="1" style="stop-color:#8FFFFF"/>
			</linearGradient>
			<path class="st0" d="M393.9,406L393.9,406L393.9,406L393.9,406l0.2,0h0l0,0c0,0,0,0,0,0C394,406,393.9,406,393.9,406
				C393.8,406,393.9,406,393.9,406z"/>
			<linearGradient id="SVGID_2_" gradientUnits="userSpaceOnUse" x1="591.5108" y1="65.8909" x2="591.5108" y2="189.4926">
				<stop  offset="0" style="stop-color:#8FFF3C"/>
				<stop  offset="1" style="stop-color:#8FFFFF"/>
			</linearGradient>
			<polygon class="st1" points="591.5,216.1 591.5,216.1 591.5,216.1 			"/>
			<linearGradient id="SVGID_3_" gradientUnits="userSpaceOnUse" x1="196.076" y1="65.8909" x2="196.076" y2="189.4926">
				<stop  offset="0" style="stop-color:#8FFF3C"/>
				<stop  offset="1" style="stop-color:#8FFFFF"/>
			</linearGradient>
			<path class="st2" d="M196.1,216.1C196.1,216.1,196.1,216.1,196.1,216.1C196.1,216.1,196.1,216.1,196.1,216.1L196.1,216.1z"/>
			<linearGradient id="SVGID_4_" gradientUnits="userSpaceOnUse" x1="393.6263" y1="353.904" x2="393.6263" y2="458.1049">
				<stop  offset="0" style="stop-color:#8FFF3C"/>
				<stop  offset="1" style="stop-color:#8FFFFF"/>
			</linearGradient>
			<path class="st3" d="M393.5,406L393.5,406L393.5,406l0.1,0h0.1h0v0c0,0,0.1,0,0.1,0C393.7,406,393.6,406,393.5,406
				C393.5,406,393.5,406,393.5,406z"/>
			<linearGradient id="SVGID_5_" gradientUnits="userSpaceOnUse" x1="393.7934" y1="65.8909" x2="393.7934" y2="380.0769">
				<stop  offset="0" style="stop-color:#8FFF3C"/>
				<stop  offset="1" style="stop-color:#8FFFFF"/>
			</linearGradient>
			<path class="st4" d="M427.1,455.3c0,0,0.2-0.2,0.3-0.4c4-4.1,7.7-8.9,10.4-14.5c2.8-5.8,4.5-12.2,4.8-18.7l0,0c0,0,0,0,0,0
				c0,0,0,0,0-0.1h0c0.4-7-0.9-14.1-3.7-20.6c-2.7-6.4-6.7-11.7-11.1-16.1l-34.2-34.2L359.6,385c-4.4,4.4-8.3,9.7-11.1,16.1
				c-2.8,6.4-4,13.5-3.7,20.6h0c0,0,0,0,0,0.1c0,0,0,0,0,0l0,0c0.3,6.5,2,13,4.8,18.7c2.7,5.6,6.4,10.4,10.4,14.5
				c0.2,0.2,0.3,0.4,0.3,0.4c4.2,4.2,9.1,7.7,14.8,10.3c5.7,2.6,11.8,4,17.8,4.3c0.2,0,0.5,0,0.7,0c0.2,0,0.5,0,0.7,0
				c6-0.3,12.1-1.7,17.8-4.3C418,463.1,423,459.5,427.1,455.3z"/>
			<linearGradient id="SVGID_6_" gradientUnits="userSpaceOnUse" x1="393.7934" y1="65.8909" x2="393.7934" y2="379.9156">
				<stop  offset="0" style="stop-color:#8FFF3C"/>
				<stop  offset="1" style="stop-color:#8FFFFF"/>
			</linearGradient>
			<path class="st5" d="M536.9,257.3L536.9,257.3l1.4-3.3c0,0,0-0.1,0-0.1l1.3-3.2l-0.1,0c6.6-17.8,10-36.1,10.1-54.7l0-0.1v-0.6
				c0-19.9-3.8-39.6-11.3-58.5l0,0l0-0.1c-7.6-19.2-19.1-36.5-34.2-51.5l0,0l-0.1-0.1l-0.3-0.3l0,0c-15-15-32.3-26.5-51.5-34.2
				c-19-7.6-38.5-11.5-58.4-11.6c-19.8,0.1-39.4,4-58.4,11.6c-19.2,7.7-36.5,19.2-51.5,34.2l0,0l-0.3,0.3l-0.1,0.1l0,0
				c-15.1,15.1-26.5,32.4-34.2,51.5l0,0.1l0,0c-7.5,19-11.3,38.6-11.3,58.5v0.6l0,0.1c0.1,18.6,3.5,36.9,10.1,54.7l-0.1,0l1.3,3.2
				c0,0,0,0.1,0,0.1l1.3,3.4l0.1,0c7.6,17.9,18.6,34.1,32.9,48.4l42.1,42.1c1.6,1.3,3.4,2.5,5.5,3.4l0,0c2.8,1.2,5.8,1.7,8.7,1.7
				c2.9,0,5.9-0.5,8.7-1.7c2.8-1.2,5.3-2.9,7.4-5c2-2,3.8-4.5,5.1-7.3c1.3-2.9,1.9-6,1.9-9.1v0c0-2.9-0.5-5.8-1.7-8.7
				c-1.1-2.7-2.8-5.1-4.7-7.1l0,0l-0.2-0.3l-43.1-43.1c-10.4-10.9-18-22.8-23-36c-5.1-13.4-7.5-27-7.2-41c0.2-14.1,3-27.6,8.5-40.9
				c5.4-13.1,13.2-24.9,23.9-35.6c10.9-10.9,23-19,36.5-24.5c13.7-5.5,27.3-8.2,41.4-8.1c0.2,0,0.3,0,0.5,0c0.2,0,0.3,0,0.5,0
				c14.1-0.1,27.7,2.5,41.4,8.1c13.5,5.5,25.6,13.6,36.5,24.5c10.7,10.7,18.5,22.4,23.9,35.6c5.4,13.3,8.2,26.9,8.5,40.9
				c0.2,14-2.2,27.6-7.2,41c-5,13.2-12.6,25.1-23,36l-43.1,43.1L431,314l0,0c-1.9,2-3.6,4.4-4.7,7.1c-1.2,2.8-1.7,5.8-1.7,8.7v0
				c0,3.1,0.6,6.2,1.9,9.1c1.3,2.9,3.1,5.3,5.1,7.3c2.1,2.1,4.6,3.8,7.4,5c2.8,1.2,5.8,1.7,8.7,1.7c2.9,0,5.9-0.5,8.7-1.7l0,0
				c2-0.8,3.8-2,5.5-3.4l42.1-42.1C518.3,291.4,529.3,275.2,536.9,257.3z"/>
		</g>
		<g>
			<g>
				<linearGradient id="SVGID_7_" gradientUnits="userSpaceOnUse" x1="393.7934" y1="65.8909" x2="393.7934" y2="380.0769">
					<stop  offset="0" style="stop-color:#8FFF3C"/>
					<stop  offset="1" style="stop-color:#8FFFFF"/>
				</linearGradient>
				<path class="st6" d="M416.4,278.1c0,0,0.1-0.1,0.2-0.3c2.7-2.8,5.2-6,7-9.8c1.9-3.9,3.1-8.2,3.3-12.7l0,0c0,0,0,0,0,0
					c0,0,0,0,0,0h0c0.3-4.7-0.6-9.6-2.5-13.9c-1.9-4.3-4.5-7.9-7.5-10.9l-23.2-23.2l-23.2,23.2c-3,3-5.6,6.6-7.5,10.9
					c-1.9,4.4-2.7,9.2-2.5,13.9h0c0,0,0,0,0,0c0,0,0,0,0,0l0,0c0.2,4.4,1.4,8.8,3.3,12.7c1.9,3.8,4.3,7.1,7,9.8
					c0.1,0.1,0.2,0.2,0.2,0.3c2.8,2.8,6.2,5.2,10,7c3.9,1.8,8,2.7,12.1,2.9c0.2,0,0.3,0,0.5,0c0.2,0,0.3,0,0.5,0
					c4.1-0.2,8.2-1.2,12.1-2.9C410.2,283.3,413.6,280.9,416.4,278.1z"/>
				<linearGradient id="SVGID_8_" gradientUnits="userSpaceOnUse" x1="393.7934" y1="65.8909" x2="393.7934" y2="380.0769">
					<stop  offset="0" style="stop-color:#8FFF3C"/>
					<stop  offset="1" style="stop-color:#8FFFFF"/>
				</linearGradient>
				<path class="st7" d="M371.2,115.5c0,0-0.1,0.1-0.2,0.3c-2.7,2.8-5.2,6-7,9.8c-1.9,3.9-3.1,8.2-3.3,12.7l0,0c0,0,0,0,0,0
					c0,0,0,0,0,0h0c-0.3,4.7,0.6,9.6,2.5,13.9c1.9,4.3,4.5,7.9,7.5,10.9l23.2,23.2l23.2-23.2c3-3,5.6-6.6,7.5-10.9
					c1.9-4.4,2.7-9.2,2.5-13.9h0c0,0,0,0,0,0c0,0,0,0,0,0l0,0c-0.2-4.4-1.4-8.8-3.3-12.7c-1.9-3.8-4.3-7.1-7-9.8
					c-0.1-0.1-0.2-0.2-0.2-0.3c-2.8-2.8-6.2-5.2-10-7c-3.9-1.8-8-2.7-12.1-2.9c-0.2,0-0.3,0-0.5,0c-0.2,0-0.3,0-0.5,0
					c-4.1,0.2-8.2,1.2-12.1,2.9C377.4,110.2,374,112.7,371.2,115.5z"/>
			</g>
			<g>
				<linearGradient id="SVGID_9_" gradientUnits="userSpaceOnUse" x1="342.9073" y1="65.8909" x2="342.9073" y2="380.0769">
					<stop  offset="0" style="stop-color:#8FFF3C"/>
					<stop  offset="1" style="stop-color:#8FFFFF"/>
				</linearGradient>
				<path class="st8" d="M312.5,219.4c0,0,0.1,0.1,0.3,0.2c2.8,2.7,6,5.2,9.8,7c3.9,1.9,8.2,3.1,12.7,3.3l0,0c0,0,0,0,0,0
					c0,0,0,0,0,0v0c4.7,0.3,9.6-0.6,13.9-2.5c4.3-1.9,7.9-4.5,10.9-7.5l23.2-23.2l-23.2-23.2c-3-3-6.6-5.6-10.9-7.5
					c-4.4-1.9-9.2-2.7-13.9-2.5v0c0,0,0,0,0,0c0,0,0,0,0,0l0,0c-4.4,0.2-8.8,1.4-12.7,3.3c-3.8,1.9-7.1,4.3-9.8,7
					c-0.1,0.1-0.2,0.2-0.3,0.2c-2.8,2.8-5.2,6.2-7,10c-1.8,3.9-2.7,8-2.9,12.1c0,0.2,0,0.3,0,0.5c0,0.2,0,0.3,0,0.5
					c0.2,4.1,1.2,8.2,2.9,12.1C307.2,213.2,309.7,216.6,312.5,219.4z"/>
				<linearGradient id="SVGID_10_" gradientUnits="userSpaceOnUse" x1="444.6795" y1="65.8909" x2="444.6795" y2="380.0769">
					<stop  offset="0" style="stop-color:#8FFF3C"/>
					<stop  offset="1" style="stop-color:#8FFFFF"/>
				</linearGradient>
				<path class="st9" d="M475.1,174.2c0,0-0.1-0.1-0.3-0.2c-2.8-2.7-6-5.2-9.8-7c-3.9-1.9-8.2-3.1-12.7-3.3l0,0c0,0,0,0,0,0
					c0,0,0,0,0,0v0c-4.7-0.3-9.6,0.6-13.9,2.5c-4.3,1.9-7.9,4.5-10.9,7.5l-23.2,23.2l23.2,23.2c3,3,6.6,5.6,10.9,7.5
					c4.4,1.9,9.2,2.7,13.9,2.5v0c0,0,0,0,0,0c0,0,0,0,0,0l0,0c4.4-0.2,8.8-1.4,12.7-3.3c3.8-1.9,7.1-4.3,9.8-7
					c0.1-0.1,0.2-0.2,0.3-0.2c2.8-2.8,5.2-6.2,7-10c1.8-3.9,2.7-8,2.9-12.1c0-0.2,0-0.3,0-0.5c0-0.2,0-0.3,0-0.5
					c-0.2-4.1-1.2-8.2-2.9-12.1C480.4,180.4,477.9,177,475.1,174.2z"/>
			</g>
		</g>
	</g>
	<g>
		<polygon points="274.5,582.9 274.5,582.9 274.5,582.9 		"/>
		<path d="M364,716.4L364,716.4c0-1.1-0.2-2.3-0.6-3.5c-0.4-1.3-1.1-2.5-2.1-3.5l-0.1-0.1l0,0l0,0l0,0l-0.1-0.1
			c-0.9-1-2-1.7-3.3-2.2l0,0l0,0l0,0l-0.2-0.1l-0.1,0l0,0l0,0l0,0c-1.3-0.5-2.6-0.7-3.9-0.7h-50.3c-1.6,0-3-0.3-4.4-0.8l0,0
			c-1.4-0.6-2.5-1.3-3.5-2.3l0,0l0,0c-1-1-1.7-2-2.3-3.5l0,0l0,0l0,0c-0.6-1.4-0.8-2.7-0.8-4.4l0-0.1l0,0h0l0-0.3c0-0.3,0-0.6,0-0.9
			V590.2l0-0.1l0-0.1l0,0c0-1.2-0.3-2.5-0.8-3.7v0l0,0l-0.1-0.1l0,0l0,0l0,0c-0.5-1.2-1.3-2.3-2.2-3.2l0,0l0,0l0,0l-0.1,0
			c-0.9-0.9-2.1-1.6-3.3-2.1l-0.1,0l0,0c-1.3-0.5-2.7-0.7-3.9-0.7c-1.3,0-2.6,0.2-3.8,0.7l0,0l0,0l0,0l-0.1,0l0,0l0,0
			c-1.3,0.5-2.4,1.3-3.3,2.2l0,0l0,0l0,0l0,0c-0.8,0.8-1.5,1.8-2,3l0,0l0,0l0,0l-0.1,0.2l0,0l0,0l0,0l-0.1,0.1l-0.1,0.3l0,0.1
			c-0.4,1.2-0.7,2.4-0.7,3.5l0,0.1v0v103.5c0,0.3,0,0.6,0,0.9l0,0.3l0,0l0,0.1l0,0.1c0,4.3,0.8,8.5,2.5,12.4l0,0.1l0,0.1l0,0
			c1.6,3.8,3.9,7.1,6.7,10l0,0l0,0c2.8,2.8,6.2,5.1,10,6.7l0,0l0.1,0l0.1,0c3.9,1.7,8.1,2.5,12.4,2.5h0.2h50.1c1.2,0,2.6-0.2,4-0.7
			l0,0l0,0c1.3-0.5,2.4-1.3,3.4-2.3l0.1-0.1l0,0l0,0l0.1-0.1l0.2-0.2l0,0v0l0,0l0-0.1c0.7-0.8,1.3-1.7,1.7-2.8l0,0l0,0l0,0l0.1-0.2
			l0,0l0,0l0-0.1l0,0l0,0l0,0c0.4-1,0.6-2.1,0.6-3.1l0-0.2v-0.3v0L364,716.4L364,716.4z"/>
		<polygon points="357.6,706.8 357.6,706.9 357.6,706.9 		"/>
		<polygon points="370.8,723.7 370.8,723.7 370.8,723.7 		"/>
		<polygon points="368.7,719.7 368.7,719.7 368.7,719.7 		"/>
		<path d="M513.6,716.5L513.6,716.5l0-0.1c0-0.7-0.1-1.3-0.2-1.9c0-0.3,0-0.7-0.2-1l-0.5-1.1l-56.4-126.6l-0.1-0.1l0-0.1l0,0
			c-0.8-1.6-2-3.1-3.8-4.2l-0.2-0.1l0,0l0,0l0,0l0,0c-1.7-1-3.6-1.4-5.3-1.4h0h0c-1.8,0-3.7,0.4-5.5,1.5l0,0l0,0l0,0l0,0
			c-1.8,1.1-3.1,2.6-4,4.3h0l0,0l0,0v0l0,0l0,0l-0.1,0.1l-34.5,77.6l-22,49.2l-0.1,0.2l-0.1,0.2l0,0c-0.4,1.1-0.5,2.3-0.5,3.4l0,0.2
			l0,0.2h0c0,1,0.2,2,0.4,2.9l0,0.1l0,0l0,0l0,0c0.4,1.4,1.1,2.7,2.1,3.8l0.1,0.1l0,0l0,0l0,0c1,1.1,2.2,1.9,3.4,2.4v0l0,0l0.1,0.1
			l0.1,0.1l0.1,0l0.1,0l0.1,0l0.2,0.1l0,0c1.3,0.4,2.5,0.6,3.6,0.6h0c1.8,0,3.7-0.4,5.5-1.6l0.1,0l0,0l0,0l0,0
			c1.8-1.1,3-2.7,3.8-4.2l0-0.1l0,0l0-0.1l10.6-23.7h72.1c0.3,0,0.5,0,0.8,0l10.6,23.8l0.1,0.1l0,0.1l0,0l0.1,0.2l0,0l0,0l0,0
			c0.8,1.5,1.9,2.9,3.5,3.9l0,0l0,0l0,0l0,0l0.1,0.1l0,0l0,0l0,0c1.8,1.1,3.7,1.5,5.5,1.6l0,0l0,0h0c0.5,0,1,0,1.6-0.1
			c0.5,0.2,1.1,0.1,1.6-0.2l1.1-0.6l0,0l1.3-0.6c0.4-0.2,0.7-0.4,0.9-0.8c0.3-0.3,0.6-0.5,0.9-0.8l0,0l0,0l0,0l0,0l0,0l0,0l0.2-0.3
			l0.1-0.1c0.8-1,1.5-2,1.9-3.1l0,0l0,0l0.1-0.2l0,0l0,0l0,0l0,0C513.4,719.1,513.6,717.9,513.6,716.5L513.6,716.5z M419.2,677.4
			l9.1-20.2l18.6-41.7l27.5,61.9H419.2z"/>
		<polygon points="664.7,583.1 664.7,583.1 664.7,583.1 		"/>
		<path d="M667.6,589.8L667.6,589.8L667.6,589.8L667.6,589.8l0-0.1c-0.1-1.2-0.4-2.4-0.9-3.5l0,0l0,0l0,0l0,0
			c-0.3-0.7-0.8-1.4-1.3-2c-0.2-0.2-0.4-0.5-0.6-0.7l0,0l0,0l0,0l-0.1-0.1l-0.1-0.1l0,0l0,0l0,0c-1-1.1-2.2-1.9-3.6-2.5l-0.1,0l0,0
			l0,0l0,0c-1.3-0.5-2.6-0.7-3.8-0.7h-89.5h-0.2c-4.3,0-8.5,0.8-12.4,2.5l-0.1,0v0l-0.1,0l0,0c-3.8,1.6-7.2,3.9-10,6.7
			c-2.8,2.8-5.1,6.2-6.7,10l0,0l0,0.1l0,0l0,0.1l0,0c-1.7,3.9-2.5,8.1-2.5,12.4v0v0v0.1l0,0c0,1.2,0.2,2.5,0.7,3.9l0,0l0,0
			c0.5,1.3,1.3,2.5,2.3,3.5l0,0l0,0l0,0l0,0l0,0c0.9,0.9,1.9,1.6,3.1,2.1l0.1,0l0,0l0,0l0.1,0.1l0.2,0l0,0l0,0l0,0
			c1.3,0.5,2.6,0.7,3.8,0.7c1.3,0,2.6-0.2,3.9-0.7l0,0l0,0l0.1-0.1l0,0l0,0l0,0c1.3-0.5,2.4-1.3,3.4-2.2l0,0c1-1,1.8-2.2,2.3-3.6
			c0.5-1.3,0.7-2.6,0.7-3.8h0l0,0l0-0.1c0-1.6,0.3-3,0.8-4.4l0,0c0.6-1.4,1.3-2.5,2.3-3.5l0,0c1-1,2-1.7,3.5-2.3l0,0
			c1.4-0.6,2.7-0.8,4.4-0.8h67L537,709.9c-0.2,0.3-0.4,0.6-0.5,0.9c-0.3,0.6-0.6,1.2-0.9,1.8c-0.5,1.3-0.6,2.6-0.6,3.8h0l0,0.1v0
			l0,0v0l0,0.1c0,1.2,0.2,2.5,0.7,3.7l0,0.1l0,0l0,0l0,0.1c0.4,1,1,1.9,1.6,2.6c0.2,0.3,0.4,0.5,0.6,0.8l0,0.1l0,0l0,0l0.1,0.1
			l0.1,0.1l0,0l0,0l0,0c1,1.1,2.2,1.9,3.6,2.5l0.1,0l0,0l0,0l0,0c1.3,0.5,2.6,0.7,3.8,0.7h89.5h0.2c4.3,0,8.5-0.8,12.4-2.5l0.1,0v0
			l0.1,0l0,0c3.8-1.6,7.2-3.9,10-6.7c2.8-2.8,5.1-6.2,6.7-10l0,0l0-0.1l0,0l0-0.1l0,0c1.7-3.9,2.5-8.1,2.5-12.4v0v0v-0.1l0,0
			c0-1.2-0.2-2.5-0.7-3.9l0,0l0,0c-0.5-1.3-1.3-2.5-2.3-3.5l0,0l0,0l0,0l0,0l0,0c-0.9-0.9-1.9-1.6-3.1-2.1l-0.1,0l0,0l0,0l-0.1-0.1
			l-0.2,0l0,0l0,0l0,0c-1.3-0.5-2.6-0.7-3.8-0.7c-1.3,0-2.6,0.2-3.9,0.7l0,0l0,0l-0.1,0.1l0,0l0,0l0,0c-1.3,0.5-2.4,1.3-3.4,2.2l0,0
			c-1,1-1.8,2.2-2.3,3.6c-0.5,1.3-0.7,2.6-0.7,3.8h0l0,0l0,0.1c0,1.6-0.3,3-0.8,4.4l0,0c-0.6,1.4-1.3,2.5-2.3,3.5l0,0
			c-1,1-2,1.7-3.5,2.3l0,0c-1.4,0.6-2.7,0.8-4.4,0.8h-67.3l0.4-0.3l97.2-109.8c0.2-0.2,0.4-0.5,0.5-0.8c0.2-0.3,0.4-0.7,0.6-1.1l0,0
			l0,0l0,0l0.1-0.1c0.5-1.1,0.7-2.3,0.8-3.5h0l0-0.1v-0.3c0-0.2,0-0.4,0-0.7L667.6,589.8z"/>
		<polygon points="666.6,582.2 666.6,582.2 666.6,582.2 		"/>
		<polygon points="671.9,587.5 671.9,587.5 671.9,587.5 		"/>
		<path d="M244.3,637.8c0-7.9-1.5-15.5-4.6-22.5l0,0l0,0l0,0l0,0l0-0.1l0,0l0,0c-3-6.9-7.1-13-12.4-18.3l-0.1-0.1l0,0
			c-4.9-4.8-10.6-8.7-16.9-11.6l-0.2-0.1l-1.1-0.5l-0.1,0l-1.2-0.5l-0.2,0c-6.7-2.7-13.8-4-21.2-4h-47.4c-1.3,0-2.6,0.2-4,0.7
			l-0.1,0.1l-0.1,0l0,0l-0.1,0.1c-1.2,0.5-2.3,1.3-3.2,2.2l-0.1,0.1l0,0l0,0l0,0h0v0l-0.1,0.1l0,0l0,0l0,0l0,0c-0.8,0.9-1.5,2-2,3.3
			c-0.5,1.2-0.7,2.5-0.7,3.7l0,0.1l0,0.1l0,0c0,1.1,0.2,2.3,0.6,3.5l0,0.1l0,0.1c0.4,1.2,1.1,2.4,2,3.4l0,0v0l0,0l0,0l0,0l0,0l0,0
			c1,1,2.1,1.8,3.4,2.4l0,0l0,0l0,0l0.2,0.1l0.1,0l0,0l0,0l0,0c1.3,0.5,2.6,0.7,3.9,0.7h47.4c5.3,0,10.1,1,14.6,2.9
			c4.6,2,8.5,4.6,11.8,8c3.4,3.4,6,7.4,8.1,12c1.9,4.5,2.9,9.2,2.9,14.4c0,5.2-1,10-2.9,14.5c-2,4.7-4.7,8.6-8.1,12.1
			c-3.3,3.4-7.2,6-11.8,8c-4.5,1.9-9.3,2.9-14.6,2.9c-5.1,0-9.8-0.9-14.2-2.8c-4.5-1.9-8.4-4.5-11.8-7.8c-3.4-3.3-6.1-7.1-8.1-11.5
			c-2-4.3-3-9-3.1-14.1v-21.8l0-0.1l0-0.1l0-0.1c0-1.2-0.3-2.5-0.8-3.7c-0.5-1.2-1.2-2.3-2.1-3.1l0,0l0,0l-0.2-0.2
			c-0.9-0.9-2.1-1.7-3.3-2.2l-0.1,0l0,0l-0.1,0l-0.1-0.1l-0.1,0l0,0l0,0l0,0c-1.3-0.5-2.6-0.7-3.8-0.7c-1.3,0-2.7,0.2-4,0.8l-0.1,0
			l0,0l0,0l0,0l-0.1,0c-1.2,0.5-2.3,1.3-3.1,2.1l0,0l0,0l0,0l0,0c-0.9,0.9-1.6,1.9-2.1,3.1l0,0l0,0l0,0l-0.1,0.1v0l0,0l0,0
			c-0.5,1.3-0.8,2.6-0.8,3.9l0,0.1v0v99.1l0,0c0,1.2,0.2,2.5,0.7,3.7l0,0.1l0,0l0,0l0,0.1v0l0,0l0,0l0,0c0.5,1.3,1.3,2.4,2.2,3.3
			l0,0l0,0l0,0l0,0c0.8,0.8,1.9,1.6,3.1,2.1l0.2,0.1l0.1,0.1l0.3,0.1l0.1,0c1.2,0.4,2.4,0.7,3.5,0.7c1.3,0,2.6-0.2,3.9-0.7l0,0
			l0.1-0.1l0.1,0l0,0l0.1,0c1.1-0.5,2.1-1.1,3-1.9l0,0l0.3-0.3c0.9-0.9,1.7-2,2.2-3.3l0,0c0.5-1.2,0.7-2.5,0.8-3.7h0l0-0.1v-34.2
			c2.4,2,4.9,3.9,7.7,5.6c8.8,5.4,18.8,8.1,29.5,8.1h0l0,0h0c7.9,0,15.6-1.5,22.6-4.6c7-3,13.2-7.2,18.4-12.4
			c5.3-5.3,9.4-11.5,12.4-18.5c3-7.1,4.6-14.7,4.6-22.5l0,0v-0.1L244.3,637.8L244.3,637.8L244.3,637.8z"/>
		<polygon points="161.5,723.9 161.5,723.9 161.5,723.9 		"/>
		<polygon points="150.1,726.2 150.1,726.2 150.1,726.2 		"/>
		<path d="M198.9,625.3L198.9,625.3L198.9,625.3c-1.8-2-4-3.5-6.5-4.5c-2.4-1-4.9-1.3-7.2-1.3l-18.3,0v18.3c0,2.3,0.4,4.8,1.3,7.2
			c1,2.5,2.5,4.7,4.5,6.5l0,0l0,0l0,0l0,0c1.8,1.7,4,2.9,6.3,3.7c2.2,0.8,4.5,1.1,6.7,1.1l0.2,0c2.2,0,4.5-0.4,6.7-1.2
			c2.2-0.8,4.2-2.1,5.9-3.6l0.2-0.2l0.2-0.2c1.5-1.7,2.8-3.7,3.6-5.9c0.8-2.2,1.2-4.5,1.2-6.7l0-0.2c0-2.2-0.3-4.4-1.1-6.7
			C201.8,629.3,200.6,627.1,198.9,625.3L198.9,625.3L198.9,625.3z"/>
	</g>
</g>
</svg>
