<?xml version="1.0" encoding="utf-8"?>
<!-- Generator: Adobe Illustrator 16.0.0, SVG Export Plug-In . SVG Version: 6.00 Build 0)  -->
<!DOCTYPE svg PUBLIC "-//W3C//DTD SVG 1.1//EN" "http://www.w3.org/Graphics/SVG/1.1/DTD/svg11.dtd">
<svg version="1.1" id="Capa_1" xmlns="http://www.w3.org/2000/svg" xmlns:xlink="http://www.w3.org/1999/xlink" x="0px" y="0px"
	 width="800px" height="800px" viewBox="0 0 800 800" enable-background="new 0 0 800 800" xml:space="preserve">
<g>
	<path fill="#5D4BFF" d="M716.8,230.4H87.467c-17.067,0-32-10.667-32-24.533l0,0c0-13.867,13.867-24.533,32-24.533h630.399
		c17.067,0,32,10.667,32,24.533l0,0C748.8,218.667,733.867,230.4,716.8,230.4z"/>
	<path fill="#5D4BFF" d="M716.8,432H87.467c-17.067,0-32-10.667-32-24.533l0,0c0-13.867,13.867-24.533,32-24.533h630.399
		c17.067,0,32,10.667,32,24.533l0,0C748.8,421.333,733.867,432,716.8,432z"/>
	<path fill="#5D4BFF" d="M716.8,634.667H87.467c-17.067,0-32-10.667-32-24.533l0,0c0-13.867,13.867-24.534,32-24.534h630.399
		c17.067,0,32,10.667,32,24.534l0,0C748.8,624,733.867,634.667,716.8,634.667z"/>
</g>
</svg>
