<?xml version="1.0" encoding="utf-8"?>
<!-- Generator: Adobe Illustrator 22.0.0, SVG Export Plug-In . SVG Version: 6.00 Build 0)  -->
<svg version="1.1" id="Capa_1" xmlns="http://www.w3.org/2000/svg" xmlns:xlink="http://www.w3.org/1999/xlink" x="0px" y="0px"
	 viewBox="0 0 75 75" style="enable-background:new 0 0 75 75;" xml:space="preserve">
<style type="text/css">
	.st0{fill:#8AB853;}
</style>
<g>
	<g>
		<path class="st0" d="M61.3,21.8l-8.1-8.1L28.1,38.8l8.2,8L61.3,21.8z M61.3,21.8"/>
		<path class="st0" d="M60.2,6.7L56,10.8l8.1,8.1l4.2-4.2c2.2-2.2,2.2-5.9,0-8.1C66.1,4.4,62.4,4.4,60.2,6.7L60.2,6.7z M60.2,6.7"/>
		<path class="st0" d="M19.8,55.2l13.9-5.8l-8.1-7.9L19.8,55.2z M19.8,55.2"/>
		<path class="st0" d="M61.8,28.8L54,36.6v25.5H12.6V20.9h26l7.2-7.7H5V70h56.8V28.8z M61.8,28.8"/>
	</g>
</g>
</svg>
