\relax 
\citation{shaw2003spectral}
\citation{yokoya2017hyperspectral}
\citation{ghamisi2017advances}
\citation{yokoya2017hyperspectral}
\citation{ghamisi2017advanced}
\citation{ghamisi2017advances}
\citation{he2018recent}
\citation{Hinojosa:18}
\citation{Sanchez:19}
\citation{he2016weighted}
\citation{RastiHyperspectral2016}
\citation{arce2014compressive}
\citation{montero2015analysis}
\citation{correa2016multiple}
\citation{cao2016computational}
\citation{8552442}
\citation{8657365}
\citation{yokoya2017hyperspectral}
\citation{arce2014compressive}
\citation{arce2014compressive}
\citation{arguello2014colored}
\citation{garcia2018multi}
\citation{diaz2019adaptive}
\citation{davenport2010signal}
\citation{li2013classification}
\citation{8510893}
\citation{achanta2012slic}
\citation{cao2016computational}
\@writefile{toc}{\contentsline {section}{\numberline {I}Introduction}{1}\protected@file@percent }
\newlabel{sec:intro}{{I}{1}}
\newlabel{sec:method1}{{I}{1}}
\@writefile{toc}{\contentsline {subsection}{\numberline {\unhbox \voidb@x \hbox {I-A}}Compressive measurements acquisition}{1}\protected@file@percent }
\newlabel{subsec:compressive}{{\unhbox \voidb@x \hbox {I-A}}{1}}
\providecommand*\caption@xref[2]{\@setref\relax\@undefined{#1}}
\newlabel{3DCASSI_sensingApp}{{1(a)}{2}}
\newlabel{sub@3DCASSI_sensingApp}{{a}{2}}
\newlabel{ordenamiento}{{1(b)}{2}}
\newlabel{sub@ordenamiento}{{b}{2}}
\@writefile{lof}{\contentsline {figure}{\numberline {1}{\ignorespaces Acquisition and rearrangement of CSI measurements. \vspace  {-0.21in}\relax }}{2}\protected@file@percent }
\newlabel{fig:CSIAcquisition}{{1}{2}}
\newlabel{eq:discretizedOutput}{{1}{2}}
\newlabel{eq:ordenamiento}{{\unhbox \voidb@x \hbox {I-A}}{2}}
\newlabel{eq:measuresForClassify}{{2}{2}}
\newlabel{eq:Fm}{{3}{2}}
\newlabel{eq:Fh}{{4}{2}}
\@writefile{toc}{\contentsline {subsection}{\numberline {\unhbox \voidb@x \hbox {I-B}}Features Extraction}{2}\protected@file@percent }
\@writefile{toc}{\contentsline {subsubsection}{\numberline {\unhbox \voidb@x \hbox {I-B}1}HS feature extraction}{2}\protected@file@percent }
\newlabel{eq:Yh}{{5}{2}}
\newlabel{eq:Omegah}{{6}{2}}
\citation{achanta2012slic}
\citation{SpectralImageDatabase}
\@writefile{toc}{\contentsline {subsubsection}{\numberline {\unhbox \voidb@x \hbox {I-B}2}MS feature extraction}{3}\protected@file@percent }
\newlabel{eq:Ym}{{7}{3}}
\newlabel{eq:ms_features}{{8}{3}}
\@writefile{toc}{\contentsline {section}{\numberline {II}Simulations and Results}{3}\protected@file@percent }
\newlabel{sec:results}{{II}{3}}
\@writefile{lof}{\contentsline {figure}{\numberline {2}{\ignorespaces Workflow of the proposed CSI Spectral-Spatial classification approach. \vspace  {-0.21in}\relax }}{3}\protected@file@percent }
\newlabel{fig:algFlow}{{2}{3}}
\@writefile{lof}{\contentsline {figure}{\numberline {3}{\ignorespaces Classification maps on the Pavia University data set. (a) Ground Truth. (b) Original Image, (c) Reconstruction-Fusion, (d) ACC, (e) Proposed-Noisy, (f) Proposed-Noiseless.\vspace  {-0.15in}\relax }}{3}\protected@file@percent }
\newlabel{fig:VresultsPavia}{{3}{3}}
\newlabel{subfig:OAvsNseg}{{4(a)}{3}}
\newlabel{sub@subfig:OAvsNseg}{{a}{3}}
\newlabel{subfig:OAvsSNR}{{4(b)}{3}}
\newlabel{sub@subfig:OAvsSNR}{{b}{3}}
\@writefile{lof}{\contentsline {figure}{\numberline {4}{\ignorespaces (\subref  {subfig:OAvsNseg}) The overall accuracy of the proposed classification method versus the number of the superpixel segments and (\subref  {subfig:OAvsSNR}) the overall accuracy against the SNR of the compressive measurements.\vspace  {-0.21in}\relax }}{3}\protected@file@percent }
\newlabel{fig:OAvsNsegandSNR}{{4}{3}}
\citation{hahn2014adaptive}
\citation{arguello2014colored}
\citation{YokoyaCoupled2012}
\citation{accMetrics}
\citation{bingham2001random}
\citation{SpectralImageDatabase}
\@writefile{lot}{\contentsline {table}{\numberline {I}{\ignorespaces Performance of the various classification approaches on the Pavia University dataset.\vspace  {-15pt}\relax }}{4}\protected@file@percent }
\newlabel{tab:combinations}{{I}{4}}
\@writefile{toc}{\contentsline {section}{\numberline {III}Conclusion}{4}\protected@file@percent }
\@writefile{toc}{\contentsline {section}{Appendix\nobreakspace  A: Proof of the First Zonklar Equation}{4}\protected@file@percent }
\bibcite{IEEEhowto:kopka}{1}
\@writefile{lof}{\contentsline {figure}{\numberline {5}{\ignorespaces Salinas Valley dataset: (a) RGB composite of the spectral image, (b) Ground Truth. (c) Original Image, (d) Reconstruction-Fusion, (e) Proposed-Noisy, (f) Proposed-Noiseless.\vspace  {-0.1in}\relax }}{5}\protected@file@percent }
\newlabel{fig:Salinas}{{5}{5}}
\@writefile{lof}{\contentsline {figure}{\numberline {6}{\ignorespaces (a) The overall accuracy on the Salinas Valley dataset versus the compression ratio and (b) the overall accuracy versus the rate of training samples.\vspace  {-0.21in}\relax }}{5}\protected@file@percent }
\newlabel{fig:TimeandOAvsCompression}{{6}{5}}
\@writefile{toc}{\contentsline {section}{Appendix\nobreakspace  B}{5}\protected@file@percent }
\@writefile{toc}{\contentsline {section}{References}{5}\protected@file@percent }
\@writefile{toc}{\contentsline {section}{Biographies}{5}\protected@file@percent }
\@writefile{toc}{\contentsline {subsection}{Michael Shell}{5}\protected@file@percent }
\@writefile{toc}{\contentsline {subsection}{John Doe}{5}\protected@file@percent }
\@writefile{toc}{\contentsline {subsection}{Jane Doe}{5}\protected@file@percent }
