\relax 
\citation{shaw2003spectral}
\citation{yokoya2017hyperspectral}
\citation{ghamisi2017advances}
\citation{yokoya2017hyperspectral}
\citation{ghamisi2017advanced}
\citation{ghamisi2017advances}
\citation{he2018recent}
\citation{Hinojosa:18}
\citation{Sanchez:19}
\citation{he2016weighted}
\citation{RastiHyperspectral2016}
\citation{arce2014compressive}
\citation{montero2015analysis}
\citation{correa2016multiple}
\citation{cao2016computational}
\citation{8552442}
\citation{8657365}
\citation{yokoya2017hyperspectral}
\citation{arce2014compressive}
\citation{arce2014compressive}
\citation{arguello2014colored}
\citation{garcia2018multi}
\citation{diaz2019adaptive}
\citation{davenport2010signal}
\citation{li2013classification}
\citation{8510893}
\citation{achanta2012slic}
\citation{cao2016computational}
\@writefile{toc}{\contentsline {section}{\numberline {1} Introduction}{1}\protected@file@percent }
\newlabel{sec:intro}{{1}{1}}
\@writefile{toc}{\contentsline {section}{\numberline {2} Proposed Methodology}{1}\protected@file@percent }
\newlabel{sec:method1}{{2}{1}}
\@writefile{toc}{\contentsline {subsection}{\numberline {2.1} Compressive measurements acquisition}{1}\protected@file@percent }
\newlabel{subsec:compressive}{{2.1}{1}}
\citation{achanta2012slic}
\providecommand*\caption@xref[2]{\@setref\relax\@undefined{#1}}
\newlabel{3DCASSI_sensingApp}{{1(a)}{2}}
\newlabel{sub@3DCASSI_sensingApp}{{a}{2}}
\newlabel{ordenamiento}{{1(b)}{2}}
\newlabel{sub@ordenamiento}{{b}{2}}
\@writefile{lof}{\contentsline {figure}{\numberline {1}{\ignorespaces Acquisition and rearrangement of CSI measurements. \vspace  {-0.21in}\relax }}{2}\protected@file@percent }
\newlabel{fig:CSIAcquisition}{{1}{2}}
\newlabel{eq:discretizedOutput}{{1}{2}}
\newlabel{eq:ordenamiento}{{2.1}{2}}
\newlabel{eq:measuresForClassify}{{2}{2}}
\newlabel{eq:Fm}{{3}{2}}
\newlabel{eq:Fh}{{4}{2}}
\@writefile{toc}{\contentsline {subsection}{\numberline {2.2} Features Extraction}{2}\protected@file@percent }
\@writefile{toc}{\contentsline {subsubsection}{\numberline {2.2.1} HS feature extraction}{2}\protected@file@percent }
\newlabel{eq:Yh}{{5}{2}}
\newlabel{eq:Omegah}{{6}{2}}
\@writefile{toc}{\contentsline {subsubsection}{\numberline {2.2.2} MS feature extraction}{2}\protected@file@percent }
\newlabel{eq:Ym}{{7}{2}}
\citation{SpectralImageDatabase}
\citation{hahn2014adaptive}
\citation{arguello2014colored}
\citation{YokoyaCoupled2012}
\@writefile{lof}{\contentsline {figure}{\numberline {2}{\ignorespaces Workflow of the proposed CSI Spectral-Spatial classification approach. \vspace  {-0.21in}\relax }}{3}\protected@file@percent }
\newlabel{fig:algFlow}{{2}{3}}
\newlabel{eq:ms_features}{{8}{3}}
\@writefile{toc}{\contentsline {section}{\numberline {3} Simulations and Results}{3}\protected@file@percent }
\newlabel{sec:results}{{3}{3}}
\@writefile{lof}{\contentsline {figure}{\numberline {3}{\ignorespaces Classification maps on the Pavia University data set. (a) Ground Truth. (b) Original Image, (c) Reconstruction-Fusion, (d) ACC, (e) Proposed-Noisy, (f) Proposed-Noiseless.\vspace  {-0.15in}\relax }}{3}\protected@file@percent }
\newlabel{fig:VresultsPavia}{{3}{3}}
\newlabel{subfig:OAvsNseg}{{4(a)}{3}}
\newlabel{sub@subfig:OAvsNseg}{{a}{3}}
\newlabel{subfig:OAvsSNR}{{4(b)}{3}}
\newlabel{sub@subfig:OAvsSNR}{{b}{3}}
\@writefile{lof}{\contentsline {figure}{\numberline {4}{\ignorespaces (\subref  {subfig:OAvsNseg}) The overall accuracy of the proposed classification method versus the number of the superpixel segments and (\subref  {subfig:OAvsSNR}) the overall accuracy against the SNR of the compressive measurements.\vspace  {-0.21in}\relax }}{3}\protected@file@percent }
\newlabel{fig:OAvsNsegandSNR}{{4}{3}}
\citation{accMetrics}
\citation{bingham2001random}
\citation{SpectralImageDatabase}
\@writefile{lot}{\contentsline {table}{\numberline {1}{\ignorespaces Performance of the various classification approaches on the Pavia University dataset.\vspace  {-15pt}\relax }}{4}\protected@file@percent }
\newlabel{tab:combinations}{{1}{4}}
\@writefile{lof}{\contentsline {figure}{\numberline {5}{\ignorespaces Salinas Valley dataset: (a) RGB composite of the spectral image, (b) Ground Truth. (c) Original Image, (d) Reconstruction-Fusion, (e) Proposed-Noisy, (f) Proposed-Noiseless.\vspace  {-0.1in}\relax }}{4}\protected@file@percent }
\newlabel{fig:Salinas}{{5}{4}}
\@writefile{lof}{\contentsline {figure}{\numberline {6}{\ignorespaces (a) The overall accuracy on the Salinas Valley dataset versus the compression ratio and (b) the overall accuracy versus the rate of training samples.\vspace  {-0.21in}\relax }}{4}\protected@file@percent }
\newlabel{fig:TimeandOAvsCompression}{{6}{4}}
\@writefile{toc}{\contentsline {section}{\numberline {4} Conclusions}{4}\protected@file@percent }
\newlabel{sec:conclusions}{{4}{4}}
\bibstyle{IEEEbib}
\bibdata{strings,refs}
\bibcite{shaw2003spectral}{1}
\bibcite{yokoya2017hyperspectral}{2}
\bibcite{ghamisi2017advances}{3}
\bibcite{ghamisi2017advanced}{4}
\bibcite{he2018recent}{5}
\bibcite{Hinojosa:18}{6}
\bibcite{Sanchez:19}{7}
\bibcite{he2016weighted}{8}
\bibcite{RastiHyperspectral2016}{9}
\bibcite{arce2014compressive}{10}
\bibcite{montero2015analysis}{11}
\bibcite{correa2016multiple}{12}
\bibcite{cao2016computational}{13}
\bibcite{8552442}{14}
\bibcite{8657365}{15}
\bibcite{arguello2014colored}{16}
\bibcite{garcia2018multi}{17}
\bibcite{diaz2019adaptive}{18}
\bibcite{davenport2010signal}{19}
\bibcite{li2013classification}{20}
\bibcite{8510893}{21}
\bibcite{achanta2012slic}{22}
\bibcite{SpectralImageDatabase}{23}
\bibcite{hahn2014adaptive}{24}
\bibcite{YokoyaCoupled2012}{25}
\bibcite{accMetrics}{26}
\bibcite{bingham2001random}{27}
\@writefile{toc}{\contentsline {section}{\numberline {5} References}{5}\protected@file@percent }
