\relax 
\bibstyle{ieee}
\bibcite{spectralClustering:Luxburg}{1}
\bibcite{SSC:vidal}{2}
\bibcite{3DSSC:Hinojosa}{3}
\pgfsyspdfmark {pgfid1}{1822154}{839114}
\newlabel{eq:optimizationCodingPatternAlgorithm}{{9}{2}}
\newlabel{eq:modelSSC-c}{{10}{2}}
