<?xml version="1.0" encoding="utf-8"?>
<!-- Generator: Adobe Illustrator 25.4.1, SVG Export Plug-In . SVG Version: 6.00 Build 0)  -->
<svg version="1.1" id="Capa_1" xmlns="http://www.w3.org/2000/svg" xmlns:xlink="http://www.w3.org/1999/xlink" x="0px" y="0px"
	 viewBox="0 0 38 38" style="enable-background:new 0 0 38 38;" xml:space="preserve">
<style type="text/css">
	.st0{fill:#FFFFFF;}
</style>
<path class="st0" d="M35,33.91H19.45c-0.6,0-1.09-0.49-1.09-1.09c0-0.6,0.49-1.09,1.09-1.09h14.45V7.68l-4.73-4.65H11.65v15.93
	c0,0.6-0.49,1.09-1.09,1.09s-1.09-0.49-1.09-1.09V1.94c0-0.6,0.49-1.09,1.09-1.09h19.06c0.29,0,0.56,0.11,0.77,0.31l5.38,5.28
	c0.21,0.21,0.33,0.49,0.33,0.78v25.59C36.09,33.42,35.6,33.91,35,33.91z"/>
<path class="st0" d="M35,8.32h-6.04c-0.6,0-1.09-0.49-1.09-1.09V1.94c0-0.6,0.49-1.09,1.09-1.09c0.6,0,1.09,0.49,1.09,1.09v4.19H35
	c0.6,0,1.09,0.49,1.09,1.09C36.09,7.83,35.6,8.32,35,8.32z"/>
<path class="st0" d="M12.18,20.4c-4.2,0-7.62,3.42-7.62,7.62c0,4.2,3.42,7.62,7.62,7.62c4.2,0,7.62-3.42,7.62-7.62
	C19.8,23.82,16.38,20.4,12.18,20.4z M12.18,37.83c-5.41,0-9.81-4.4-9.81-9.81c0-5.41,4.4-9.81,9.81-9.81c5.41,0,9.81,4.4,9.81,9.81
	C21.99,33.43,17.59,37.83,12.18,37.83z"/>
<path class="st0" d="M11.99,32.67c-0.6,0-1.09-0.49-1.09-1.09v-7.43c0-0.6,0.49-1.09,1.09-1.09c0.6,0,1.09,0.49,1.09,1.09v7.43
	C13.08,32.18,12.59,32.67,11.99,32.67z"/>
<path class="st0" d="M11.89,33.53L11.89,33.53c-0.3,0-0.58-0.12-0.79-0.33l-3.56-3.68c-0.42-0.43-0.41-1.13,0.03-1.55
	C8.01,27.56,8.7,27.57,9.12,28l2.78,2.87l2.97-3.02c0.42-0.43,1.11-0.44,1.55-0.01c0.43,0.42,0.44,1.12,0.01,1.55l-3.75,3.82
	C12.46,33.42,12.18,33.53,11.89,33.53z"/>
</svg>
