-------------------------------------------------------------------------------
Test set: reqres.tests.ApiReqResTest
-------------------------------------------------------------------------------
Tests run: 1, Failures: 0, Errors: 0, Skipped: 0, Time elapsed: 2.286 s -- in reqres.tests.ApiReqResTest
