/Users/carlos.barros/Desktop/CHALLENGE/challenge/src/test/java/reqres/tests/ApiReqResTest.java
/Users/carlos.barros/Desktop/CHALLENGE/challenge/src/test/java/reqres/commons/ApiTestBase.java
/Users/carlos.barros/Desktop/CHALLENGE/challenge/src/test/java/reqres/validators/MandatoryFieldsValidator.java
/Users/carlos.barros/Desktop/CHALLENGE/challenge/src/test/java/reqres/validators/StatusCodeValidator.java
/Users/carlos.barros/Desktop/CHALLENGE/challenge/src/test/java/reqres/validators/ContractValidator.java
/Users/carlos.barros/Desktop/CHALLENGE/challenge/src/test/java/reqres/pojo/CreateUserRequest.java
