<svg width="34" height="33" viewBox="0 0 34 33" fill="none" xmlns="http://www.w3.org/2000/svg">
<path d="M10.6408 0.607114C1.01663 0.98451 0.61562 10.0308 2.21938 14.0409C3.35557 12.6374 6.71067 9.95064 11.0416 10.4318C15.3725 10.9131 18.7276 13.0384 19.8638 14.0409C21.6686 7.62478 19.0621 0.27689 10.6408 0.607114Z" fill="#A81E1E" stroke="#A81E1E"/>
<path d="M33.0981 10.2315C33.0982 0.599926 23.8745 -0.59574 19.8647 1.40931C21.2493 2.56857 23.8262 6.91169 23.2733 11.2341C22.7205 15.5564 20.8628 17.7654 19.8416 18.8848C25.0775 21.0588 33.098 18.0512 33.0981 10.2315Z" fill="#A81E1E" stroke="#A81E1E"/>
<path d="M1.27738 22.8227C1.49642 32.4518 10.6877 33.5807 14.6508 31.485C13.2402 30.3575 10.7878 25.994 11.2422 21.6602C11.6965 17.3264 13.6553 15.1834 14.6508 14.041C9.23714 11.635 1.09955 15.0051 1.27738 22.8227Z" fill="#A81E1E" stroke="#A81E1E"/>
<path d="M23.5347 32.3994C33.1662 32.3615 34.3161 23.0555 32.2953 19.0537C31.1415 20.4427 26.8844 22.9503 22.5599 22.4144C18.2354 21.8786 16.1296 19.8799 15.0062 18.8631C12.4987 24.2305 15.7151 32.4301 23.5347 32.3994Z" fill="#A81E1E" stroke="#A81E1E"/>
</svg>
