%YAML 1.1
%TAG !u! tag:unity3d.com,2011:
--- !u!1045 &1
EditorBuildSettings:
  m_ObjectHideFlags: 0
  serializedVersion: 2
  m_Scenes:
  - enabled: 1
    path: Assets/Scenes/E4.unity
    guid: 1944b4b9806997843aae86eab4aed770
  - enabled: 1
    path: Assets/Scenes/GameOver.unity
    guid: 83a7b770eab5d504abfd14a266dce8bd
  m_configObjects: {}
