%YAML 1.1
%TAG !u! tag:unity3d.com,2011:
--- !u!1001 &7655961303751007117
PrefabInstance:
  m_ObjectHideFlags: 0
  serializedVersion: 2
  m_Modification:
    m_TransformParent: {fileID: 0}
    m_Modifications:
    - target: {fileID: 1973797488871700, guid: 48e06088b7e195f40898a828bd389ec3, type: 3}
      propertyPath: m_Name
      value: fireball-red-tail-big Variant
      objectReference: {fileID: 0}
    - target: {fileID: 4469022170149554, guid: 48e06088b7e195f40898a828bd389ec3, type: 3}
      propertyPath: m_RootOrder
      value: 0
      objectReference: {fileID: 0}
    - target: {fileID: 4469022170149554, guid: 48e06088b7e195f40898a828bd389ec3, type: 3}
      propertyPath: m_LocalPosition.x
      value: -12.018763
      objectReference: {fileID: 0}
    - target: {fileID: 4469022170149554, guid: 48e06088b7e195f40898a828bd389ec3, type: 3}
      propertyPath: m_LocalPosition.y
      value: -6.2401857
      objectReference: {fileID: 0}
    - target: {fileID: 4469022170149554, guid: 48e06088b7e195f40898a828bd389ec3, type: 3}
      propertyPath: m_LocalPosition.z
      value: 0
      objectReference: {fileID: 0}
    - target: {fileID: 4469022170149554, guid: 48e06088b7e195f40898a828bd389ec3, type: 3}
      propertyPath: m_LocalRotation.w
      value: 1
      objectReference: {fileID: 0}
    - target: {fileID: 4469022170149554, guid: 48e06088b7e195f40898a828bd389ec3, type: 3}
      propertyPath: m_LocalRotation.x
      value: 0
      objectReference: {fileID: 0}
    - target: {fileID: 4469022170149554, guid: 48e06088b7e195f40898a828bd389ec3, type: 3}
      propertyPath: m_LocalRotation.y
      value: 0
      objectReference: {fileID: 0}
    - target: {fileID: 4469022170149554, guid: 48e06088b7e195f40898a828bd389ec3, type: 3}
      propertyPath: m_LocalRotation.z
      value: 0
      objectReference: {fileID: 0}
    - target: {fileID: 4469022170149554, guid: 48e06088b7e195f40898a828bd389ec3, type: 3}
      propertyPath: m_LocalEulerAnglesHint.x
      value: 0
      objectReference: {fileID: 0}
    - target: {fileID: 4469022170149554, guid: 48e06088b7e195f40898a828bd389ec3, type: 3}
      propertyPath: m_LocalEulerAnglesHint.y
      value: 0
      objectReference: {fileID: 0}
    - target: {fileID: 4469022170149554, guid: 48e06088b7e195f40898a828bd389ec3, type: 3}
      propertyPath: m_LocalEulerAnglesHint.z
      value: 0
      objectReference: {fileID: 0}
    - target: {fileID: 212511831395615402, guid: 48e06088b7e195f40898a828bd389ec3,
        type: 3}
      propertyPath: m_FlipY
      value: 1
      objectReference: {fileID: 0}
    m_RemovedComponents: []
  m_SourcePrefab: {fileID: 100100000, guid: 48e06088b7e195f40898a828bd389ec3, type: 3}
--- !u!1 &7653994107963560601 stripped
GameObject:
  m_CorrespondingSourceObject: {fileID: 1973797488871700, guid: 48e06088b7e195f40898a828bd389ec3,
    type: 3}
  m_PrefabInstance: {fileID: 7655961303751007117}
  m_PrefabAsset: {fileID: 0}
--- !u!50 &-1167319062693938891
Rigidbody2D:
  serializedVersion: 4
  m_ObjectHideFlags: 0
  m_CorrespondingSourceObject: {fileID: 0}
  m_PrefabInstance: {fileID: 0}
  m_PrefabAsset: {fileID: 0}
  m_GameObject: {fileID: 7653994107963560601}
  m_BodyType: 0
  m_Simulated: 1
  m_UseFullKinematicContacts: 0
  m_UseAutoMass: 0
  m_Mass: 1
  m_LinearDrag: 0
  m_AngularDrag: 0.05
  m_GravityScale: 0
  m_Material: {fileID: 0}
  m_Interpolate: 0
  m_SleepingMode: 1
  m_CollisionDetection: 0
  m_Constraints: 5
--- !u!61 &3565147314183110801
BoxCollider2D:
  m_ObjectHideFlags: 0
  m_CorrespondingSourceObject: {fileID: 0}
  m_PrefabInstance: {fileID: 0}
  m_PrefabAsset: {fileID: 0}
  m_GameObject: {fileID: 7653994107963560601}
  m_Enabled: 1
  m_Density: 1
  m_Material: {fileID: 0}
  m_IsTrigger: 1
  m_UsedByEffector: 0
  m_UsedByComposite: 0
  m_Offset: {x: -0.0029103868, y: -0.08381553}
  m_SpriteTilingProperty:
    border: {x: 0, y: 0, z: 0, w: 0}
    pivot: {x: 0.5323376, y: 0.18957208}
    oldSize: {x: 0.09, y: 0.27}
    newSize: {x: 0.09, y: 0.27}
    adaptiveTilingThreshold: 0.5
    drawMode: 0
    adaptiveTiling: 0
  m_AutoTiling: 0
  serializedVersion: 2
  m_Size: {x: 0.09, y: 0.27}
  m_EdgeRadius: 0
--- !u!114 &-7287925579546459665
MonoBehaviour:
  m_ObjectHideFlags: 0
  m_CorrespondingSourceObject: {fileID: 0}
  m_PrefabInstance: {fileID: 0}
  m_PrefabAsset: {fileID: 0}
  m_GameObject: {fileID: 7653994107963560601}
  m_Enabled: 1
  m_EditorHideFlags: 0
  m_Script: {fileID: 11500000, guid: ff72b9012bbc30c459b5cb263d0782ff, type: 3}
  m_Name: 
  m_EditorClassIdentifier: 
  speed: 20
  rb: {fileID: -1167319062693938891}
