%YAML 1.1
%TAG !u! tag:unity3d.com,2011:
--- !u!1001 &2712267391792574974
PrefabInstance:
  m_ObjectHideFlags: 0
  serializedVersion: 2
  m_Modification:
    m_TransformParent: {fileID: 0}
    m_Modifications:
    - target: {fileID: 1939245619601230, guid: d2f2f92c494bd1c41970791d8041c000, type: 3}
      propertyPath: m_Name
      value: fireball-blue-tail-big Variant
      objectReference: {fileID: 0}
    - target: {fileID: 4586067091643388, guid: d2f2f92c494bd1c41970791d8041c000, type: 3}
      propertyPath: m_RootOrder
      value: 0
      objectReference: {fileID: 0}
    - target: {fileID: 4586067091643388, guid: d2f2f92c494bd1c41970791d8041c000, type: 3}
      propertyPath: m_LocalPosition.x
      value: -13.921114
      objectReference: {fileID: 0}
    - target: {fileID: 4586067091643388, guid: d2f2f92c494bd1c41970791d8041c000, type: 3}
      propertyPath: m_LocalPosition.y
      value: -5.864722
      objectReference: {fileID: 0}
    - target: {fileID: 4586067091643388, guid: d2f2f92c494bd1c41970791d8041c000, type: 3}
      propertyPath: m_LocalPosition.z
      value: 0
      objectReference: {fileID: 0}
    - target: {fileID: 4586067091643388, guid: d2f2f92c494bd1c41970791d8041c000, type: 3}
      propertyPath: m_LocalRotation.w
      value: 1
      objectReference: {fileID: 0}
    - target: {fileID: 4586067091643388, guid: d2f2f92c494bd1c41970791d8041c000, type: 3}
      propertyPath: m_LocalRotation.x
      value: 0
      objectReference: {fileID: 0}
    - target: {fileID: 4586067091643388, guid: d2f2f92c494bd1c41970791d8041c000, type: 3}
      propertyPath: m_LocalRotation.y
      value: 0
      objectReference: {fileID: 0}
    - target: {fileID: 4586067091643388, guid: d2f2f92c494bd1c41970791d8041c000, type: 3}
      propertyPath: m_LocalRotation.z
      value: 0
      objectReference: {fileID: 0}
    - target: {fileID: 4586067091643388, guid: d2f2f92c494bd1c41970791d8041c000, type: 3}
      propertyPath: m_LocalEulerAnglesHint.x
      value: 0
      objectReference: {fileID: 0}
    - target: {fileID: 4586067091643388, guid: d2f2f92c494bd1c41970791d8041c000, type: 3}
      propertyPath: m_LocalEulerAnglesHint.y
      value: 0
      objectReference: {fileID: 0}
    - target: {fileID: 4586067091643388, guid: d2f2f92c494bd1c41970791d8041c000, type: 3}
      propertyPath: m_LocalEulerAnglesHint.z
      value: 0
      objectReference: {fileID: 0}
    m_RemovedComponents: []
  m_SourcePrefab: {fileID: 100100000, guid: d2f2f92c494bd1c41970791d8041c000, type: 3}
--- !u!1 &2712586897668058800 stripped
GameObject:
  m_CorrespondingSourceObject: {fileID: 1939245619601230, guid: d2f2f92c494bd1c41970791d8041c000,
    type: 3}
  m_PrefabInstance: {fileID: 2712267391792574974}
  m_PrefabAsset: {fileID: 0}
--- !u!50 &8780419895072547493
Rigidbody2D:
  serializedVersion: 4
  m_ObjectHideFlags: 0
  m_CorrespondingSourceObject: {fileID: 0}
  m_PrefabInstance: {fileID: 0}
  m_PrefabAsset: {fileID: 0}
  m_GameObject: {fileID: 2712586897668058800}
  m_BodyType: 0
  m_Simulated: 1
  m_UseFullKinematicContacts: 0
  m_UseAutoMass: 0
  m_Mass: 1
  m_LinearDrag: 0
  m_AngularDrag: 0.05
  m_GravityScale: 0
  m_Material: {fileID: 0}
  m_Interpolate: 0
  m_SleepingMode: 1
  m_CollisionDetection: 0
  m_Constraints: 5
--- !u!61 &9046433035528435484
BoxCollider2D:
  m_ObjectHideFlags: 0
  m_CorrespondingSourceObject: {fileID: 0}
  m_PrefabInstance: {fileID: 0}
  m_PrefabAsset: {fileID: 0}
  m_GameObject: {fileID: 2712586897668058800}
  m_Enabled: 1
  m_Density: 1
  m_Material: {fileID: 0}
  m_IsTrigger: 1
  m_UsedByEffector: 0
  m_UsedByComposite: 0
  m_Offset: {x: -0.0029104613, y: 0.08004032}
  m_SpriteTilingProperty:
    border: {x: 0, y: 0, z: 0, w: 0}
    pivot: {x: 0.53233844, y: 0.20355436}
    oldSize: {x: 0.09, y: 0.27}
    newSize: {x: 0.09, y: 0.27}
    adaptiveTilingThreshold: 0.5
    drawMode: 0
    adaptiveTiling: 0
  m_AutoTiling: 0
  serializedVersion: 2
  m_Size: {x: 0.09, y: 0.27}
  m_EdgeRadius: 0
--- !u!114 &1553740806082377234
MonoBehaviour:
  m_ObjectHideFlags: 0
  m_CorrespondingSourceObject: {fileID: 0}
  m_PrefabInstance: {fileID: 0}
  m_PrefabAsset: {fileID: 0}
  m_GameObject: {fileID: 2712586897668058800}
  m_Enabled: 1
  m_EditorHideFlags: 0
  m_Script: {fileID: 11500000, guid: 72dd812b334b0064d8b90897f155e96a, type: 3}
  m_Name: 
  m_EditorClassIdentifier: 
  speed: 10
  rb: {fileID: 8780419895072547493}
