%YAML 1.1
%TAG !u! tag:unity3d.com,2011:
--- !u!74 &7400000
AnimationClip:
  m_ObjectHideFlags: 0
  m_CorrespondingSourceObject: {fileID: 0}
  m_PrefabInstance: {fileID: 0}
  m_PrefabAsset: {fileID: 0}
  m_Name: chaezius_Death
  serializedVersion: 6
  m_Legacy: 0
  m_Compressed: 0
  m_UseHighQualityCurve: 1
  m_RotationCurves: []
  m_CompressedRotationCurves: []
  m_EulerCurves: []
  m_PositionCurves: []
  m_ScaleCurves: []
  m_FloatCurves: []
  m_PPtrCurves:
  - curve:
    - time: 0
      value: {fileID: 1789349578669334376, guid: ba1fbcb499b743f4dad86910fab4cbf1,
        type: 3}
    - time: 0.065
      value: {fileID: -5457006992606959815, guid: ba1fbcb499b743f4dad86910fab4cbf1,
        type: 3}
    - time: 0.13
      value: {fileID: 1606593335960360805, guid: ba1fbcb499b743f4dad86910fab4cbf1,
        type: 3}
    - time: 0.195
      value: {fileID: 6191194967710665633, guid: ba1fbcb499b743f4dad86910fab4cbf1,
        type: 3}
    - time: 0.26
      value: {fileID: -1759447843507062774, guid: ba1fbcb499b743f4dad86910fab4cbf1,
        type: 3}
    - time: 0.325
      value: {fileID: 733698076524582317, guid: ba1fbcb499b743f4dad86910fab4cbf1,
        type: 3}
    - time: 0.39
      value: {fileID: -4267750960821301041, guid: ba1fbcb499b743f4dad86910fab4cbf1,
        type: 3}
    - time: 0.45499998
      value: {fileID: -8422430346868524545, guid: ba1fbcb499b743f4dad86910fab4cbf1,
        type: 3}
    - time: 0.52
      value: {fileID: 1254177723726040720, guid: ba1fbcb499b743f4dad86910fab4cbf1,
        type: 3}
    - time: 0.5683333
      value: {fileID: 1254177723726040720, guid: ba1fbcb499b743f4dad86910fab4cbf1,
        type: 3}
    attribute: m_Sprite
    path: 
    classID: 212
    script: {fileID: 0}
  m_SampleRate: 60
  m_WrapMode: 2
  m_Bounds:
    m_Center: {x: 0, y: 0, z: 0}
    m_Extent: {x: 0, y: 0, z: 0}
  m_ClipBindingConstant:
    genericBindings:
    - serializedVersion: 2
      path: 0
      attribute: 0
      script: {fileID: 0}
      typeID: 212
      customType: 23
      isPPtrCurve: 1
    pptrCurveMapping:
    - {fileID: 1789349578669334376, guid: ba1fbcb499b743f4dad86910fab4cbf1, type: 3}
    - {fileID: -5457006992606959815, guid: ba1fbcb499b743f4dad86910fab4cbf1, type: 3}
    - {fileID: 1606593335960360805, guid: ba1fbcb499b743f4dad86910fab4cbf1, type: 3}
    - {fileID: 6191194967710665633, guid: ba1fbcb499b743f4dad86910fab4cbf1, type: 3}
    - {fileID: -1759447843507062774, guid: ba1fbcb499b743f4dad86910fab4cbf1, type: 3}
    - {fileID: 733698076524582317, guid: ba1fbcb499b743f4dad86910fab4cbf1, type: 3}
    - {fileID: -4267750960821301041, guid: ba1fbcb499b743f4dad86910fab4cbf1, type: 3}
    - {fileID: -8422430346868524545, guid: ba1fbcb499b743f4dad86910fab4cbf1, type: 3}
    - {fileID: 1254177723726040720, guid: ba1fbcb499b743f4dad86910fab4cbf1, type: 3}
    - {fileID: 1254177723726040720, guid: ba1fbcb499b743f4dad86910fab4cbf1, type: 3}
  m_AnimationClipSettings:
    serializedVersion: 2
    m_AdditiveReferencePoseClip: {fileID: 0}
    m_AdditiveReferencePoseTime: 0
    m_StartTime: 0
    m_StopTime: 0.585
    m_OrientationOffsetY: 0
    m_Level: 0
    m_CycleOffset: 0
    m_HasAdditiveReferencePose: 0
    m_LoopTime: 0
    m_LoopBlend: 0
    m_LoopBlendOrientation: 0
    m_LoopBlendPositionY: 0
    m_LoopBlendPositionXZ: 0
    m_KeepOriginalOrientation: 0
    m_KeepOriginalPositionY: 1
    m_KeepOriginalPositionXZ: 0
    m_HeightFromFeet: 0
    m_Mirror: 0
  m_EditorCurves: []
  m_EulerEditorCurves: []
  m_HasGenericRootTransform: 0
  m_HasMotionFloatCurves: 0
  m_Events: []
