%YAML 1.1
%TAG !u! tag:unity3d.com,2011:
--- !u!1045 &1
EditorBuildSettings:
  m_ObjectHideFlags: 0
  serializedVersion: 2
  m_Scenes:
  - enabled: 1
    path: Assets/Scenes/MainScreen.unity
    guid: b3a00c4d5cb6a7642a8b2ffa024a77df
  - enabled: 1
    path: Assets/Scenes/MainMenu.unity
    guid: 1e2dcfe595624bf408f3a557f7186465
  - enabled: 1
    path: Assets/Scenes/GameScreen.unity
    guid: 5c51969f7a0117a48b84e000a4a92293
  - enabled: 1
    path: Assets/Scenes/GameOver.unity
    guid: b20d5a69c9c90be4bb9fecd48d2dc1cc
  - enabled: 1
    path: Assets/Scenes/ShopScreen.unity
    guid: 44288ce0b46f1fc4c922c28c2dde946a
  m_configObjects: {}
