E,nrec,ninj
2,  23,   96
6,  71,   239
10, 115,  295
14, 159,  327
18, 200,  345
22, 221,  316
26, 291,  349
30, 244,  281
34, 277,  298
38, 221,  235
42, 210,  217
46, 182,  185
50, 136,  140
54, 119,  121
58, 79,   79 
62, 81,   81 
66, 61,   61 
70, 44,   45 
74, 41,   41 
78, 32,   32 
82, 32,   32 
86, 31,   31 
90, 22,   22 
94, 18,   18 
98,  11,    11
