Carles miranda
................................................
Pizza de Jamon 1
................................................
Pizza Napolitana 1
................................................
Pizza Muzarella 1
................................................
