[gd_resource type="StyleBoxFlat" format=2]

[resource]
bg_color = Color( 0.0627451, 0.0627451, 0.0627451, 1 )
border_width_left = 10
border_width_top = 10
border_width_right = 10
border_width_bottom = 10
border_color = Color( 1, 1, 1, 1 )
corner_radius_top_left = 10
corner_radius_top_right = 10
corner_radius_bottom_right = 10
corner_radius_bottom_left = 10
corner_detail = 12
expand_margin_bottom = 20.0
anti_aliasing_size = 2
