{
	"Doelgroepregister": {
		"TFS": "Doelgroepregister\\DEV",
		"Solution": "Doelgroepregister 1.1.sln",
		"IIS": [
			"Presentation Werkgever\\Presentation Werkgever.csproj",
			"Presentation Werknemer\\Presentation Werknemer.csproj",
			"Services Werkgever\\Services Werkgever.csproj",
			"Services Werknemer\\Services Werknemer.csproj"
		]
	},
	"e-Dienstverlening Beheerportaal": {
		"TFS": "Beheerportaal\\e-Dienstverlening\\DEV",
		"Solution": "Beheerportaal e-Dienstverlening 1.0.sln",
		"IIS": [
			"Presentation\\Presentation.csproj"
		]
	},
	"Eigenrisicodrager": {
		"TFS": "Eigenrisicodrager\\DEV",
		"Solution": "Eigenrisicodrager 1.0.sln",
		"IIS": [
			"Presentation\\Presentation.csproj",
			"Services\\Services.csproj"
		]
	},
	"Gegevens Aanvragen" : {
		"TFS": "GegevensAanvragen\\DEV",
		"Solution": "GegevensAanvragen 1.0.sln",
		"IIS": [
			"Presentation\\Presentation.csproj",
			"Services\\Services.csproj"
		]
	},
	"Gegevensdiensten": {
		"TFS": "Gegevensdiensten\\DEV",
		"Solution": "Gegevensdiensten 3.0.sln",
		"IIS": [
			"Presentation\\Presentation.csproj",
			"Services\\Services.csproj"
		]
	},
	"Gegevensdiensten Beheerportaal": {
		"TFS": "Beheerportaal\\Gegevensdiensten\\DEV",
		"Solution": "Beheerportaal Gegevensdiensten 1.1.sln",
		"IIS": [
			"Gegevensdiensten\\Gegevensdiensten.csproj"
		]
	},
	"IAMWerkgever": {
		"TFS": "Identity and Access Management\\Werkgever\\DEV",
		"Solution": "IAM Werkgever 1.0.sln",
		"IIS": [
			"Presentation\\Presentation.csproj",
			"Services\\Services.csproj"
		]
	},
	"IAMWerknemer": {
		"TFS": "Identity and Access Management\\Werknemer\\DEV",
		"Solution": "Identity and Access Management 1.2.sln",
		"IIS": [
			"IdentityManager\\IdentityManager.csproj",
			"Services\\Services.csproj"
		]
	},
	"IAMZakelijk": {
		"TFS": "Identity and Access Management\\Zakelijk\\DEV",
		"Solution": "IAM Zakelijk 1.0.sln",
		"IIS": [
			"Presentation\\Presentation.csproj",
			"Services\\Services.csproj"
		]
	},
	"Inleenadministratie": {
		"TFS": "Inleenadministratie\\DEV",
		"Solution": "InleenAdministratie 1.0.sln",
		"IIS": [
			"Presentation\\Presentation.csproj",
			"Services\\Services.csproj"
		]
	},
	"MijnUWV": {
		"TFS": "Mijn UWV\\DEV",
		"Solution": "MijnUWV 5.0.sln",
		"IIS": [
			"Presentation\\Presentation.csproj",
			"Services\\Services.csproj"
		]
	},
	"MijnBerichten": {
		"TFS": "Mijn Berichten\\DEV",
		"Solution": "Mijn Berichten 1.2.sln",
		"IIS": [
			"Presentation Werkgever\\Presentation Werkgever.csproj",
			"Presentation.Werknemer\\Presentation Werknemer.csproj",
			"Services Werknemer\\Services Werknemer.csproj",
			"Services Werkgever\\Services Werkgever.csproj"
		]
	},
	"MijnStatusWW": {
		"TFS": "Statusinformatie WW\\DEV",
		"Solution": "Statusinformatie WW 2.2.sln",
		"IIS": [
			"Presentation\\Presentation.csproj",
			"Uwv.eWN.StatusinfoWW.Services\\services.csproj"
		]
	},
	"MijnStatusZW": {
		"TFS": "Statusinformatie ZW\\DEV",
		"Solution": "Statusinformatie ZW 1.0.sln",
		"IIS": [
			"Presentation\\Presentation.csproj",
			"Services\\services.csproj"
		]
	},
	"WGR Beheerportaal": {
		"TFS": "Beheerportaal\\Werkgever\\DEV",
		"Solution": "Beheerportaal Werkgevers 2.3.sln",
		"IIS": [
			"Werkgevers\\Werkgevers.csproj"
		]
	},
	"BezwaarenBeroep": {
		"TFS": "Bezwaar en Beroep\\DEV",
		"Solution": "Bezwaar en Beroep 1.0.sln",
		"IIS": [
			"Presentation Werkgever\\Presentation Werkgever.csproj",
			"Presentation Werknemer\\Presentation Werknemer.csproj",
			"Services Werkgever\\Services Werkgever.csproj",
			"Services Werknemer\\Services Werknemer.csproj"
		]
	},
	"WGR Documenten": {
		"TFS": "Werkgever Documenten\\DEV",
		"Solution": "Werkgever Documenten 1.0.sln",
		"IIS": [
			"Presentation\\Presentation.csproj",
			"Services\\Services.csproj"
		]
	},
	"WGR Portaal": {
		"TFS": "Werkgeversportaal\\DEV",
		"Solution": "Werkgeversportaal 5.0.sln",
		"IIS": [
			"Presentation\\Presentation.csproj",
			"Services\\Services.csproj"
		]
	},
	"WGR Uploaden Documenten": {
		"TFS": "Werkgever Uploaden Documenten\\DEV",
		"Solution": "Werkgever Uploaden Documenten 1.5.sln",
		"IIS": [
			"Presentation\\Presentation.csproj",
			"Services\\Services.csproj"
		]
	},
	"WGR Verzuimmelder": {
		"TFS": "WGR_VERZUIMMELDER\\DEV",
		"Solution": "Uwv.Zw.Verzuimmelder.sln",
		"IIS": [
			"Uwv.Zw.Verzuimmelder.BusinessServices\\Uwv.Zw.Verzuimmelder.BusinessServices.csproj",
			"Uwv.Zw.Verzuimmelder.Presentation\\Presentation.csproj"
		]
	},
	"DIGIDStub": {
		"TFS": "Stub Services\\DigiD\\DEV",
		"Solution": "DigiD.sln",
		"IIS": [
			"DigiD\\DigiD.csproj"
		]
	},
	"BnBStub": {
		"TFS": "Stub Services\\BnB\\DEV",
		"Solution": "BnB.sln",
		"IIS": [
			"BnB\\BnB.csproj"
		]
	},
	"EAEDStub": {
		"TFS": "Stub Services\\EAED\\DEV",
		"Solution": "Elektronisch Archief.sln",
		"IIS": [
			"Uwv.StubServices.EAED\\ElektronischArchief.csproj"
		]
	},
	"EPMStub": {
		"TFS": "Stub Services\\EPM\\DEV",
		"Solution": "EPM.sln",
		"IIS": [
			"EPM\\EPM.csproj"
		]
	},
	"GCUStub": {
		"TFS": "Stub Services\\GCU\\DEV",
		"Solution": "GCU.sln",
		"IIS": [
			"GCU\\GCU.csproj"
		]
	},
	"GeneriekeRaadpleegserviceStub": {
		"TFS": "Stub Services\\GeneriekeRaadpleegservice\\DEV",
		"Solution": "GeneriekeRaadpleegservice.sln",
		"IIS": [
			"GeneriekeRaadpleegservice\\GeneriekeRaadpleegservice.csproj"
		]
	},
	"ODSStub": {
		"TFS": "Stub Services\\ODS\\DEV",
		"Solution": "ODS.sln",
		"IIS": [
			"ODS\\ODS.csproj"
		]
	},
	"PeopleSoftStub": {
		"TFS": "Stub Services\\PeopleSoft\\DEV",
		"Solution": "PeopleSoft.sln",
		"IIS": [
			"PeopleSoft\\PeopleSoft.csproj"
		]
	},
	"PolisStub": {
		"TFS": "Stub Services\\Polis\\DEV",
		"Solution": "Polis.sln",
		"IIS": [
			"Polis\\Polis.csproj"
		]
	},
	"PolisAdministratieStub": {
		"TFS": "Stub Services\\PolisAdministratie\\DEV",
		"Solution": "PolisAdministratie.sln",
		"IIS": [
			"PolisAdministratie\\PolisAdministratie.csproj"
		]
	},
	"PVCStub": {
		"TFS" : "Stub Services\\PVC\\DEV",
		"Solution" : "PVC.sln",
		"IIS" : [
			"PVC\\PVC.csproj"
		]
	},
	"TNTStub": {
		"TFS": "Stub Services\\TNT\\DEV",
		"Solution": "Tnt.sln",
		"IIS": [
			"Tnt\\Tnt.csproj"
		]
	},
	"UPAStub": {
		"TFS": "Stub Services\\UPA\\DEV",
		"Solution": "UPA.sln",
		"IIS": [
			"UPA\\UPA.csproj"
		]
	},
	"UGCStub": {
		"TFS": "Stub Services\\UGC\\DEV",
		"Solution": "UGC.sln",
		"IIS": [
			"UGC\\UGC.csproj"
		]
	},
	"UGDStub": {
		"TFS": "Stub Services\\UGD\\DEV",
		"Solution": "UGD.sln",
		"IIS": [
			"UGD\\UGD.csproj"
		]
	},
	"UZIStub": {
		"TFS": "Stub Services\\UZI\\DEV",
		"Solution": "UZI.sln",
		"IIS": [
			"UZI\\UZI.csproj"
		]
	},
	"UZSStub": {
		"TFS": "Stub Services\\UZS\\DEV",
		"Solution": "UZS.sln",
		"IIS": [
			"UZS\\UZS.csproj"
		]
	},
	"CMSService": {
		"TFS": "Generic Services\\ContentManagement Service\\DEV",
		"Solution": "ContentManagementService 1.0.sln",
		"IIS": [
			"Service\\Service.csproj"
		]
	},
	"DWHService": {
		"TFS": "Generic Services\\DWH Service\\DEV",
		"Solution": "DWH Service 1.0.sln",
		"IIS": [
			"Service\\Services.csproj"
		]
	},

	"EmailService": {
		"TFS": "Generic Services\\Email Service\\DEV",
		"Solution": "EmailService.sln",
		"IIS": [
			"Uwv.GII.Services.EmailService\\Uwv.GII.Services.EmailService.csproj"
		]
	},
	"MembershipService": {
		"TFS": "Generic Services\\Membership Service\\DEV",
		"Solution": "MembershipService 1.2.sln",
		"IIS": [
			"Services\\Services.csproj"
		]
	},
	"ServiceAgents": {
		"TFS": "ServiceAgents\\DEV",
		"Solution": "ServiceAgents.sln"
	},
	"SIPService": {
		"TFS": "Generic Services\\SIP Service\\DEV",
		"Solution": "SIP Service 1.2.sln",
		"IIS": [
			"Web service\\Web Service.csproj"
		]
	},
	"VirusScanService": {
		"TFS": "Generic Services\\Virus Scan Service\\DEV",
		"Solution": "Virus Scan Service 1.1.sln",
		"IIS": [
			"VirusScanService\\VirusScanService.csproj"
		]
	},
	"WerkgeverNotificationService": {
		"TFS": "Generic Services\\Werkgever Notification Service\\DEV",
		"Solution": "Werkgever Notification Service 1.0.sln",
		"IIS": [
			"Services\\Services.csproj"
		]
	},
	"BerichtenboxValidatieServiceStub": {
		"TFS": "Stub Services\\BerichtenboxValidatieService\\DEV",
		"Solution": "BerichtenboxValidatieService.sln",
		"IIS": [
			"Web Service\\Web Service.csproj"
		]
	},
	"GINAStub": {
		"TFS": "Stub Services\\GINA\\DEV",
		"Solution": "GINA.sln",
		"IIS": [
			"GINA\\GINA.csproj"
		]
	},
	"KPSStub": {
		"TFS": "Stub Services\\KPS\\DEV",
		"Solution": "KPS.sln",
		"IIS": [
			"KPS\\KPS.csproj"
		]
	},
	"SIVStub": {
		"TFS": "Stub Services\\SIV\\DEV",
		"Solution": "SIV.sln",
		"IIS": [
			"SIV\\SIV.csproj"
		]
	},
	"Ziekbetermelder": {
		"TFS": "Ziekbetermelder\\DEV",
		"Solution": "Betermelder.sln",
		"IIS": [
			"EMO\\Uwv.eWn.ZiekBetermelder.Presentation\\Uwv.eWn.ZiekBetermelder.Presentation.csproj",
			"Uwv.eWn.ZiekBetermelder.Business\\Uwv.eWn.ZiekBetermelder.Business.csproj"
		]
	},
	"WNR Beheerportaal": {
		"TFS": "Beheerportaal\\Werknemer\\DEV",
		"Solution": "Beheerportaal e-Werknemer 1.0.sln",
		"IIS": [
			"Presentation\\Presentation.csproj"
		]
	},
	"MijnDocumenten": {
		"TFS": "Mijn Documenten\\DEV",
		"Solution": "Mijn Documenten 2.0.sln",
		"IIS": [
			"Presentation\\Presentation.csproj",
			"Services\\Services.csproj"
		]
	},
	"DVB": {
		"TFS": "DVB WEBAPPLICATIE\\DEV",
		"Solution": "Uwv.Dvb.sln",
		"IIS": [
			"Uwv.Dvb.Presentation\\Uwv.Dvb.Presentation.csproj",
			"Uwv.Dvb.Services\\Uwv.Dvb.Services.csproj"
		]
	},
	"IKWF-WW": {
		"TFS": "IKWF-WW\\DEV",
		"Solution": "IKWF-WW.sln",
		"IIS": [
			"eWn.MijnWW.Presentation\\eWn.MijnWW.Presentation.csproj",
			"eWn.MijnWW.Services\\eWn.MijnWW.Services.csproj",
			"Uwv.GII.Werkbriefje.BeheerInkijk\\Uwv.GII.Werkbriefje.BeheerInkijk.csproj",
			"Uwv.GII.Werkbriefje.Presentation\\Uwv.GII.Werkbriefje.Presentation.csproj",
			"Uwv.GII.Werkbriefje.Business\\Uwv.GII.Werkbriefje.Business.csproj"
		]
	},
	"MijnIOW": {
		"TFS": "Mijn IOW\\DEV",
		"Solution": "Mijn IOW 1.1.sln",
		"IIS": [
			"Presentation\\Presentation.csproj",
			"Services\\Services.csproj"
		]
	},
	"MijnVoorzieningen": {
		"TFS": "e-Aanvraag Voorzieningen\\DEV",
		"Solution": "eAanvraag Voorziening 1.1.sln",
		"IIS": [
			"Presentation\\Presentation.csproj",
			"Services\\Services.csproj"
		]
	},
	"Arbeidsmarktcijfers.nl": {
		"TFS": "Arbeidsmarktcijfers.nl\\DEV",
		"Solution": "Arbeidsmarktcijfers.nl.sln",
		"IIS": [
			"AMI\\AMI.csproj"	
		]
	},
	"Beheerportaal-KccInkijk": {
		"TFS": "Beheerportaal\\KccInkijk\\DEV",
		"Solution": "KccInkijk 4.1.sln",
		"IIS": [
			"KccInkijk\\KccInkijk.csproj"
		]
	},
	"Administration Portal": {
		"TFS": "Administration Portal\\DEV",
		"Solution": "Administration Portal.sln",
		"IIS": [
			"Uwv.GII.Administration.Presentation\\Uwv.GII.Administration.Presentation.csproj"			
		]
	},
	"WWSAStub": {
		"TFS": "Stub Services\\WWSA\\DEV",
		"Solution": "WWSA.sln",
		"IIS": [
			"WWSA\\WWSA.csproj"
		]
	}
}