{
  "e-Dienstverlening": [
    "e-Dienstverlening Beheerportaal"
  ],
  "Gegevensdiensten": [
    "Gegevensdiensten",
    "Gegevensdiensten Beheerportaal",
    "Gegevens Aanvragen",
    "IAMZakelijk",
    "EPMStub",
    "UGCStub",
    "UGDStub",
    "EmailService",
    "MembershipService",
	"SIPService",
    "VirusScanService"
  ],
  "Generic Services": [
    "DWHService",
    "CMSService",
    "EmailService",
    "MembershipService",
	"SIPService",
    "VirusScanService",
    "WerkgeverNotificationService"
  ],
  "MijnUWV": [
    "MijnUWV",
    "IAMWerknemer",
    "ODSStub",
    "DIGIDStub",
    "PVCStub",
    "CMSService"
  ],  
  "WGR Diensten": [
    "Inleenadministratie",
    "Doelgroepregister",
    "Eigenrisicodrager",
	"BezwaarenBeroep",
    "WGR Documenten",
    "WGR Uploaden Documenten",
    "WGR Verzuimmelder",
    "BnBStub",
    "EAEDStub",
    "GeneriekeRaadpleegserviceStub",
    "ODSStub",
    "PeopleSoftStub",
    "PolisStub",
    "TNTStub",
    "UPAStub",
    "UZIStub",
    "UZSStub",
	"SIPService",
    "VirusScanService"
  ],
  "Stubs": [
    "BnBStub",
    "EAEDStub",
    "GeneriekeRaadpleegserviceStub",
    "ODSStub",
    "PeopleSoftStub",
    "PolisStub",
    "TNTStub",
    "UPAStub",
    "UZIStub",
    "UZSStub",
	"BerichtenboxValidatieServiceStub",
	"DigiDStub",
	"GCUStub",
	"GINAStub",
	"KPSStub",
	"PolisAdministratieStub",
	"PVCStub",
	"SIVStub",
	"UGCStub",
	"UGDStub",
	"WWSAStub"
  ],
  "WGR Portaal": [
    "WGR Portaal",
    "WGR Beheerportaal",
    "IAMWerkgever",
    "DIGIDStub",
    "GCUStub",
    "ODSStub",
    "PolisStub",
    "PolisAdministratieStub",
    "PVCStub",
    "UPAStub",
    "CMSService",
    "EmailService",
    "MembershipService",
    "SIPService",
    "VirusScanService",
    "WerkgeverNotificationService"
  ],
  "CMSService": [
    "CMSService"
  ],
  "Werknemer applicaties": [
	"MijnUWV",
	"MijnStatusWW",
	"MijnStatusZW",
	"DVB",
	"IKWF-WW",
	"ZiekBeterMelder",
	"Doelgroepregister",
	"IAMWerknemer",
	"Mijnberichten",
	"WNR Beheerportaal",
	"MijnDocumenten",
    "MijnIOW",
    "BezwaarenBeroep",
    "MijnVoorzieningen",
	"Administration Portal",
	"Beheerportaal-KccInkijk"
  ],
  "Arbeidsmarktcijfers.nl": [
    "Arbeidsmarktcijfers.nl"
  ]
}
