[
    {
        "id" : "1",
        "descripcion" : "comida para perros",
        "imagen" : ""
    },
    {
        "id" : "2",
        "descripcion" : "camida para gatos",
        "imagen" : ""
    },
    {
        "id" : "3",
        "descripcion" : "productos de aseo para gatos y mascotas",
        "imagen" : ""
    }
]