{
  "type": "service_account",
  "project_id": "discordinventorybot",
  "private_key_id": "f7d4d8459b5475083be38bce7ae673d58412ae07",
  "private_key": "-----BEGIN PRIVATE KEY-----\nMIIEvQIBADANBgkqhkiG9w0BAQEFAASCBKcwggSjAgEAAoIBAQCWxFe1ZtJ2hCoc\nfha+2kAsxdLLjkCnB8Oro1IyUV+EhV3W8iuWVQy0nF/stvIMW7Ky6z1UPMnHdNiV\njXZq0Grd+AWjbHrlbHAlSC/GCCCOze4X87qJhKP9OtFB1rdP9eH438UL6K5Bxvoe\nfZzrmlVvoTgSGziMNwieRH6yF2XHe38XFOt/8g7Z+bekveL2Fp2oAiyijvg9znfB\nmPgL+nDqDvGTjbW1GI4QAHwD0+BOpk7EAmSU3opCAo9wVws01hDTa9fp1HxbDF6h\nmgz1GXjo7WP3imYygG/c3HLNJiLhOYVlVPq1Fevr3LQ8ItruyJ/v32VU/bR4lEXt\n4F740dQ9AgMBAAECggEACOZzWmPvsGER+VefhnRs4xe/NMFjjgNhKOHofsxF9r/x\nb7h2cUFOZt/FBpIwN3bhquVEhr4F7WPiS0XWw+x6JTtjMygQGI4ZEA0IYPORicyc\nrcZMxe8ncnyv5hKZBLvlCKObxshdd8hEHgZX+/ftljxECpxCb33qNimgpGke2t1C\nE71uifrYeP5tYa7k/Z9SUyAtGdE+tciTzz0Z4a1mFpl8yV8dmUCgzCtJQBpk8s3I\nkSKC0tQbnLhuNcG1Zi9N1AmJYfveT14zY3k1Y1YhrRT4Pbbm349d7hU+CXt5i/ar\ng4xZe2rhz+enYVjaTUToIEXyDCBauspoKE2jqVKD4wKBgQDSJB+Axiaua5htnmCJ\nfFH0neZBD2F2H1AEa4XVT5OJ1p7040vYB0vXGsia41wBxKPGqz7+EjCxfpl8AGQ4\n7HgdlHmXCDLc8jIY7Il9ui8Q9yAtjz72dVSrDzbh4VhUJY17Qk/ldHiDj+K2yVNw\n2p3E8QZx3s7bS0GMUgyqkEfTowKBgQC3qy+VcbiZP6M/JMYB9DSwdwvs2sihbTS7\nL8/8x7hzTQiEGnSN0hb/flENIxgsXR7RFmMU/SRT5QhtsQr/BUHh3WB27gKySRF+\n/7Kj/lMpvedfUj1Y99CLFaDLPvezwDwD/ZlNKMUHNsqVIbb3PngdmwaK+Yld/gko\nneFyxTs2nwKBgQDMqHex/8neZ1W9tNiKLfTXiwyb4nHmC9rvYxSlyemD/e0zzUap\nb3myVhh3mOSbqDplG5Su92JLC2RJ+0ugkNTu4hKFQGvg+VRHJ99D/pcmK7hABtmo\nSF8cdiXaWZCf6y7ek5eifgt8/h4sLOlB6PhsvNys+/V0Z9e/5I0HdJsvhwKBgGqJ\nquVV/M0wA8J50z2I6RM/SrSOR/iTPxYhatTnCNAg7AKs0dT9+4ciP2OOatQ5A8om\n4Txohiz/2n6+RnGdHBUm83CpKPk/tx1itr23pYe99zrsmldEEDzNQ+MBWG9035s0\n/DqsnnVLzADreJU8MDKEHSx6CLtzwt5DjmWjkHBjAoGAViwh+Knr0qMhqRGm35eP\nyO24uxrdjqQoDGcoJQlWBdDUJ64XYut/o4reaeaeSY9WyTxD/eiT54gKKWGPT30u\niPPRTYQcCITnsHld6E1uiIGfe5jgoISJ5veDutcXRdTLDSLo+Ei0qAe+8EH4G1Jo\nnfr62S/YglcTOTAEo0FAKgo=\n-----END PRIVATE KEY-----\n",
  "client_email": "discordinventorybot@discordinventorybot.iam.gserviceaccount.com",
  "client_id": "109581597761760589254",
  "auth_uri": "https://accounts.google.com/o/oauth2/auth",
  "token_uri": "https://oauth2.googleapis.com/token",
  "auth_provider_x509_cert_url": "https://www.googleapis.com/oauth2/v1/certs",
  "client_x509_cert_url": "https://www.googleapis.com/robot/v1/metadata/x509/discordinventorybot%40discordinventorybot.iam.gserviceaccount.com"
}