@startuml

start
:Le client clique sur "Poursuivre la commande";
if (Utilisateur connecté ?) then (oui)
  :L'utilisateur saisit les informations de livraison;
  :L'utilisateur saisit les informations de paiement;
  :Le système de paiement traite le paiement;
  if (Paiement validé ?) then (oui)
    :La commande est confirmée;
  else (non)
    :La validation du paiement a échoué;
    :La commande n'est pas confirmée;
  endif
else (non)
  :L'utilisateur est redirigé vers la page de connexion;
  :L'utilisateur saisit ses identifiants de connexion;
  if (Connexion réussie ?) then (oui)
    :L'utilisateur est redirigé vers la page de commande;
    :L'utilisateur saisit les informations de livraison;
    :L'utilisateur saisit les informations de paiement;
    :Le système de paiement traite le paiement;
    if (Paiement validé ?) then (oui)
      :La commande est confirmée;
    else (non)
      :La validation du paiement a échoué;
      :La commande n'est pas confirmée;
    endif
  else (non)
    :L'utilisateur est redirigé vers la page d'inscription;
    :L'utilisateur saisit les détails d'inscription;
    :L'utilisateur confirme l'inscription;
    :L'utilisateur est redirigé vers la page de commande;
    :L'utilisateur saisit les informations de livraison;
    :L'utilisateur saisit les informations de paiement;
    :Le système de paiement traite le paiement;
    if (Paiement validé ?) then (oui)
      :La commande est confirmée;
    else (non)
      :La validation du paiement a échoué;
      :La commande n'est pas confirmée;
    endif
  endif
endif

@enduml