@startuml

left to right direction
skinparam linetype ortho
skinparam usecase {
  BackgroundColor yellow
  BorderColor Red
}
skinparam rectangle {
  BorderColor blue
}

actor "Admin" as Admin

rectangle "Diagramme de cas d'utilisation - Admin" {
  Admin -- (Gérer les produits)
  Admin -- (Gérer les catégories de produits)
  Admin -- (Voir et gérer les commandes)
  Admin -- (Gérer le contenu des pages statiques)
  Admin -- (Voir les rapports et statistiques)
  Admin -- (Gérer les utilisateurs)

  (Gérer les utilisateurs) .up.> (S'inscrire) : <<require>>
}

@enduml
