@startuml
skinparam style strictuml
skinparam handwritten true
skinparam defaultFontColor #000000
skinparam actorBorderColor #000000
skinparam arrowColor #000000
skinparam participantFontSize 14
skinparam participantFontColor #000000
skinparam actorFontSize 14
skinparam lifeLineBorderColor #000000
skinparam lifeLineBackgroundColor #FFFFFF

title Présentation des compétences

actor Utilisateur as U
participant Assistant as A

U -> A: /start

A -> A: Bonjour, je suis là pour vous présenter mes compétences. Voici quelques-unes de mes expertises :

A -> A: 
- Développement web (HTML, CSS, JavaScript)
- Développement backend (Python, Java)
- Gestion de bases de données (SQL)
- Développement d'applications mobiles (React Native)
- Test et débogage de logiciels
- Gestion de projets Agile

A -> A: Comment puis-je vous aider aujourd'hui ?
@enduml