@startuml

'left to right direction
skinparam linetype ortho
skinparam usecase {
  BackgroundColor white
  BorderColor black
}
skinparam rectangle {
  BorderColor blue
}

actor "Client" as Client

rectangle "Diagramme de cas d'utilisation - Client" {
  Client -- (Naviguer sur le site)
  Client -- (Rechercher des produits)
  Client -- (Voir les détails d'un produit)
  Client -- (Gérer le panier)
  Client -- (Passer une commande)
  Client -- (S'inscrire)
  Client -- (Se connecter)
  Client -- (Gérer le compte)
  Client -- (Voir l'historique des commandes)
  'Client -- (Contacter le service client)

  (Se connecter) .up.> (S'inscrire) : <<require>>
  '(Gérer le compte) .up.> (Se connecter) : <<require>>
  '(Passer une commande) .up.> (Se connecter) : <<require>>
  '(Voir l'historique des commandes) .up.> (Se connecter) : <<require>>
  '(Demander un retour) .up.> (Se connecter) : <<require>>
  (Passer une commande) .up.> (Gérer le panier) : <<require>>
}

@enduml