@startuml

left to right direction
'skinparam style strictuml
skinparam actorStyle awesome
skinparam linetype ortho
skinparam usecase {
  BackgroundColor White
  BorderColor Black
}

actor "Client" as Client
actor "Admin" as Admin
actor "Paiement" as Paiement
actor "Livraison" as Livraison

rectangle "Diagramme de cas d'utilisation" {
  Client -- (Naviguer sur le site)
  Client -- (Rechercher des produits)
  Client -- (Voir les détails d'un produit)
  Client -- (Ajouter un produit au panier)
  Client -- (Voir et modifier le panier)
  Client -- (Passer une commande)
  Client -- (S'inscrire)
  Client -- (Gérer le compte)
  Client -- (Voir l'historique des commandes)
  Client -- (Demander un retour)
  Client -- (Contacter le service client via formulaire de contact)

  Admin -- (Gérer les produits)
  Admin -- (Gérer les catégories de produits)
  Admin -- (Voir et gérer les commandes)
  Admin -- (Gérer le contenu des pages statiques)
  Admin -- (Voir les rapports et statistiques)

}

rectangle "Paiement et Livraison" {
  Paiement -- (Traiter les paiements)
  Paiement -- (Valider les cartes de crédit)
  Paiement -- (Gérer les remboursements)

  Livraison -- (Gérer les informations de livraison)
  Livraison -- (Suivre les livraisons)
}

(S'inscrire) -- (Se connecter)
(Rechercher des produits) -- (Voir les détails d'un produit)
(Passer une commande) -- (Ajouter un produit au panier)
(Passer une commande) -- (Voir et modifier le panier)
(Demander un retour) -- (Passer une commande)
(Gérer les utilisateurs) -- (S'inscrire)

@enduml