<?xml version="1.0" encoding="UTF-8" standalone="no"?>
<svg width="314px" height="36px" viewBox="0 0 314 36" version="1.1" xmlns="http://www.w3.org/2000/svg" xmlns:xlink="http://www.w3.org/1999/xlink">
    <!-- Generator: Sketch 50 (54983) - http://www.bohemiancoding.com/sketch -->
    <title>Group 46</title>
    <desc>Created with Sketch.</desc>
    <defs>
        <polygon id="path-1" points="0 0.0976744186 31.7511536 0.0976744186 31.7511536 32.9173674 0 32.9173674"></polygon>
        <polygon id="path-3" points="0.0774165957 0.124562791 21.9367149 0.124562791 21.9367149 21.0277256 0.0774165957 21.0277256"></polygon>
    </defs>
    <g id="CanYa.io-Esther" stroke="none" stroke-width="1" fill="none" fill-rule="evenodd">
        <g id="Splash" transform="translate(-965.000000, -1419.000000)">
            <g id="Group-46" transform="translate(970.000000, 1419.000000)">
                <path d="M0.607538433,18.862069 L73.6274497,18.862069" id="Path-9" stroke="#B8EDFF" stroke-width="10" stroke-linecap="round"></path>
                <g id="CanYaDAO" transform="translate(111.000000, 0.000000)">
                    <g>
                        <path d="M123.080459,34.4980814 C123.064959,34.4870814 123.048459,34.4775814 123.032959,34.4665814 C123.048459,34.4775814 123.064959,34.4870814 123.080459,34.4980814" id="Fill-1" fill="#33CCFF" fill-rule="nonzero"></path>
                        <path d="M123.10333,34.5231698 C123.00833,34.4481698 122.90933,34.3776698 122.81683,34.2996698 C122.90933,34.3776698 123.00833,34.4481698 123.10333,34.5231698" id="Fill-3" fill="#33CCFF" fill-rule="nonzero"></path>
                        <path d="M123.380336,34.7365698 C123.214336,34.6175698 123.056836,34.4885698 122.897336,34.3620698 C123.056836,34.4885698 123.214336,34.6175698 123.380336,34.7365698" id="Fill-5" fill="#33CCFF" fill-rule="nonzero"></path>
                        <path d="M122.946968,34.4172093 C122.884468,34.3652093 122.827468,34.3072093 122.765968,34.2542093 C122.827468,34.3077093 122.884468,34.3652093 122.946968,34.4172093" id="Fill-7" fill="#33CCFF" fill-rule="nonzero"></path>
                        <path d="M128.252067,18.3345628 C128.236567,18.4220628 128.225567,18.5105628 128.208567,18.5975628 C128.224567,18.5100628 128.237567,18.4220628 128.252067,18.3345628" id="Fill-9" fill="#33CCFF" fill-rule="nonzero"></path>
                        <path d="M128.397714,17.7485302 C128.397714,17.9466698 128.335214,18.1424372 128.220714,18.3345767 C128.339714,18.1445302 128.404714,17.9496 128.397714,17.7485302" id="Fill-11" fill="#33CCFF" fill-rule="nonzero"></path>
                        <path d="M128.222534,18.4079442 C128.217034,18.4384442 128.209034,18.4684442 128.203034,18.4984442 C128.209534,18.4684442 128.216534,18.4384442 128.222534,18.4079442" id="Fill-13" fill="#33CCFF" fill-rule="nonzero"></path>
                        <path d="M82.5569847,12.5152884 C81.8823804,11.637614 80.9586613,10.9519395 79.7865294,10.4565907 C78.6135549,9.9622186 77.112406,9.71440465 75.2816783,9.71440465 C73.8362783,9.71440465 72.422474,10.0421721 71.0418102,10.6960326 C70.4031549,10.9985442 69.8202485,11.385614 69.2923889,11.8562651 C68.5724272,12.4981256 68.0058102,13.2890093 67.5657166,14.1447767 C66.0701847,17.0526837 63.7978187,19.499986 61.0202017,21.2171023 L61.0202017,31.5517535 C61.0202017,33.5314744 62.6352357,35.1362651 64.6275932,35.1362651 L67.861874,35.1362651 L67.861874,22.1620326 C67.861874,19.6410558 68.278657,17.8293349 69.1144698,16.7284047 C69.94944,15.6271953 71.2985081,15.0764512 73.1619549,15.0764512 C74.7998783,15.0764512 75.9397123,15.5793349 76.5825804,16.5846837 C77.2247464,17.5900326 77.5461804,19.1145907 77.5461804,21.1568233 L77.5461804,31.6398 C77.5461804,33.5708233 79.1217549,35.1362651 81.0651038,35.1362651 L84.3878528,35.1362651 L84.3878528,19.9120326 C84.3878528,18.3799395 84.2507974,16.9841721 83.9782315,15.7230558 C83.7049634,14.4623581 83.2314485,13.3933814 82.5569847,12.5152884" id="Fill-15" fill="#33CCFF" fill-rule="nonzero"></path>
                        <path d="M61.0201736,10.3848279 L61.0201736,18.867293 C63.3895736,16.5868744 65.1302885,13.6659907 65.9592204,10.3848279 L61.0201736,10.3848279 Z" id="Fill-17" fill="#33CCFF" fill-rule="nonzero"></path>
                        <path d="M93.5623443,12.4191907 L87.8277868,2.73909767 C87.1722804,1.63258605 85.9764166,0.953330233 84.6843613,0.953330233 L78.3382506,0.953330233 L89.2331655,18.9280744 C90.1842677,16.446586 91.6744634,14.2297953 93.5623443,12.4191907" id="Fill-19" fill="#33CCFF" fill-rule="nonzero"></path>
                        <path d="M107.366216,7.44820465 L111.294059,0.953274419 L104.888829,0.953274419 C103.602812,0.953274419 102.412284,1.62764651 101.756918,2.7271814 L97.7759949,9.40699535 L94.769063,14.4520186 L94.7679396,14.4541116 L94.7677991,14.4538326 C92.6153566,17.2582047 91.2778034,20.7129488 91.1063438,24.4700651 L91.1063438,26.1172744 L91.1063438,31.5578791 C91.1063438,33.5342512 92.7187098,35.1362512 94.7075566,35.1362512 L98.670646,35.1362512 L98.670646,22.8052744 C98.670646,22.1650884 98.8460374,21.5369023 99.177863,20.9882512 L107.343467,7.4856 L107.366216,7.44820465 Z" id="Fill-21" fill="#33CCFF" fill-rule="nonzero"></path>
                        <path d="M112.405077,30.8902605 C112.405077,28.9138884 110.792711,27.3117488 108.803724,27.3117488 C106.814737,27.3117488 105.202371,28.9138884 105.202371,30.8902605 C105.202371,32.8666326 106.814737,34.4687721 108.803724,34.4687721 C110.792711,34.4687721 112.405077,32.8666326 112.405077,30.8902605" id="Fill-23" fill="#33CCFF" fill-rule="nonzero"></path>
                        <path d="M120.923655,28.496707 C121.120484,28.2985674 121.28715,28.0994512 121.423655,27.8996372 C121.286528,28.0994512 121.121417,28.2985674 120.923655,28.496707" id="Fill-25" fill="#33CCFF" fill-rule="nonzero"></path>
                        <path d="M121.742491,32.7705349 C121.741789,32.760907 121.740665,32.7512791 121.739823,32.7416512 C121.739261,32.7422093 121.73884,32.7427674 121.738137,32.7433256 C121.73898,32.7529535 121.739963,32.7624419 121.740806,32.7720698 C121.951584,33.3503023 122.308686,33.8580698 122.766052,34.2542093 C122.309108,33.8576512 121.952567,33.3493256 121.742491,32.7705349" id="Fill-27" fill="#33CCFF" fill-rule="nonzero"></path>
                        <path d="M114.513862,31.1483442 C114.578598,31.1607628 114.643334,31.1689953 114.70807,31.177507 C114.795836,31.1885302 114.883743,31.1999721 114.971368,31.2109953 C115.021921,31.2172744 115.072615,31.2209023 115.123589,31.2246698 C115.175406,31.2285767 115.228768,31.2336 115.28213,31.235414 C115.288449,31.2376465 115.294628,31.2396 115.300947,31.2376465 C115.376215,31.243786 115.449236,31.2478326 115.524364,31.2500651 C115.641338,31.2542512 115.758313,31.2584372 115.875147,31.2584372 L115.889751,31.2584372 C116.142236,31.2584372 116.38447,31.2500651 116.616453,31.235414 C116.847032,31.2203442 117.065674,31.1964837 117.275189,31.1660651 C117.98504,31.0626698 118.574406,30.871786 119.040198,30.5882512 C119.779398,30.1422977 120.324109,29.6070419 120.679245,28.9845767 C120.765326,28.8327628 120.840172,28.6801116 120.909823,28.5271814 C120.840172,28.679414 120.762798,28.8310884 120.677138,28.9823442 C120.322143,29.6046698 119.777291,30.1399256 119.038232,30.5858791 C118.5723,30.8695535 117.982934,31.0604372 117.273083,31.163693 C117.063568,31.1942512 116.844926,31.2179721 116.614347,31.2331814 C116.382504,31.2478326 116.14027,31.2562047 115.887645,31.2562047 L115.87304,31.2562047 C115.756206,31.2562047 115.639372,31.2518791 115.522257,31.2478326 C115.44713,31.2456 115.373968,31.2415535 115.29884,31.235414 C115.292521,31.2372279 115.286343,31.235414 115.280164,31.2331814 C115.226802,31.2313674 115.17344,31.2262047 115.121483,31.2224372 C115.070649,31.2185302 115.019955,31.2150419 114.969402,31.2086233 C114.881777,31.1977395 114.79387,31.1862977 114.706104,31.1751349 C114.641228,31.1666233 114.576491,31.1585302 114.511755,31.1461116 C114.447019,31.135786 114.382423,31.1251814 114.317687,31.1127628 C114.281598,31.1062047 114.248457,31.0964372 114.21307,31.0890419 C114.21307,31.0896 114.21293,31.0901581 114.21293,31.0908558 C114.249019,31.0983907 114.282862,31.1082977 114.319794,31.1151349 C114.38453,31.1275535 114.449126,31.1381581 114.513862,31.1483442" id="Fill-29" fill="#33CCFF" fill-rule="nonzero"></path>
                        <path d="M128.270424,26.4284512 L128.270424,29.6274279 L128.270424,35.1333349 L125.13079,35.1333349 L125.117029,35.1333349 C124.344829,35.1319395 123.631046,34.8881721 123.046314,34.4754279 C123.626833,34.8860791 124.334858,35.1301256 125.10102,35.135707 L125.15382,35.135707 L128.272531,35.135707 L128.272531,29.6296605 L128.272531,29.1171488 L128.272531,27.6690558 L128.272531,26.4306837 L128.272531,25.821893 L128.272531,22.9523581 C128.271829,22.9526372 128.271126,22.9527767 128.270424,22.9530558 L128.270424,25.241986 L128.270424,26.4284512 Z" id="Fill-31" fill="#33CCFF" fill-rule="nonzero"></path>
                        <path d="M121.14946,28.2294488 C121.19646,28.0769488 121.24396,27.9244488 121.28646,27.7719488 C121.24396,27.9244488 121.19646,28.0769488 121.14946,28.2294488" id="Fill-33" fill="#33CCFF" fill-rule="nonzero"></path>
                        <path d="M120.90988,28.6061372 C120.92638,28.5696372 120.94238,28.5331372 120.95888,28.4966372 C120.94238,28.5331372 120.92638,28.5696372 120.90988,28.6061372" id="Fill-35" fill="#33CCFF" fill-rule="nonzero"></path>
                        <path d="M22.3477545,27.5059535 C22.3422779,27.5119535 22.3372226,27.518093 22.331746,27.524093 C22.2192651,27.6454884 22.1017289,27.7596279 21.9818055,27.8705581 C21.7276353,28.1312093 21.4811885,28.3993953 21.2433077,28.6749767 C20.9801502,29.0293953 20.7044949,29.373907 20.4163417,29.7075349 C18.1734651,32.3055349 15.1939162,34.2565116 11.7991289,35.2413488 C13.342546,35.6725116 15.009397,35.8922791 16.7991204,35.9010698 C16.8367545,35.9013488 16.8738268,35.9023256 16.9116013,35.9023256 C17.0978055,35.9023256 17.2810609,35.8967442 17.464597,35.8917209 C19.3697502,35.8405116 21.1298438,35.5268372 22.7412268,34.9448372 C24.5074991,34.3066047 26.0493715,33.3813488 27.366563,32.168093 C28.6834736,30.9553953 29.7434055,29.4869302 30.5466396,27.7635349 C31.2611247,26.2290698 31.732814,24.5293953 31.9642353,22.665907 C29.0148779,23.1492558 26.3073332,24.3442326 24.02598,26.068186 C23.4370353,26.5133023 22.8767374,26.9935814 22.3477545,27.5059535" id="Fill-37" fill="#33CCFF" fill-rule="nonzero"></path>
                        <g id="Group-41" transform="translate(0.000000, 0.041860)">
                            <g id="Fill-39-Clipped">
                                <mask id="mask-2" fill="white">
                                    <use xlink:href="#path-1"></use>
                                </mask>
                                <g id="path-1"></g>
                                <path d="M16.9115451,29.5887628 C15.2084643,29.5887628 13.7632047,29.2619721 12.5753451,28.607414 C11.3863621,27.953693 10.4227621,27.0835535 9.68440468,25.9982512 C8.94492383,24.913507 8.40765574,23.6927163 8.07021319,22.3357395 C7.73305149,20.9796 7.56440043,19.5828558 7.56440043,18.1467628 C7.56440043,16.6467628 7.73305149,15.1947628 8.07021319,13.7899256 C8.25852383,13.0062977 8.51157064,12.2713674 8.82486,11.5819256 C8.88580468,11.447693 8.94927702,11.3151349 9.01471532,11.1842512 C9.01850681,11.1768558 9.0222983,11.1696 9.02608979,11.1622047 C9.0877366,11.0402512 9.15078766,10.919414 9.21678766,10.8005302 C9.23686851,10.7639721 9.25835362,10.7282512 9.27885574,10.6919721 C9.33123447,10.6002977 9.38305149,10.5082047 9.43781745,10.4183442 C9.51743872,10.2874605 9.59930681,10.1585302 9.68440468,10.0318326 C10.4227621,8.93076279 11.3863621,8.05308837 12.5753451,7.39866977 C13.7632047,6.7448093 15.2084643,6.4171814 16.9115451,6.4171814 C16.9907451,6.4171814 17.069243,6.41983256 17.1478813,6.42206512 L17.1478813,6.42192558 C17.9935238,6.44564651 18.8064472,6.59494884 19.5853877,6.87206512 C20.436226,7.17555349 21.1994387,7.59820465 21.8741834,8.14043721 C22.5486472,8.68378605 23.1103494,9.31364651 23.5605536,10.0318326 C23.5605536,10.0318326 23.5605536,10.0319721 23.560694,10.0319721 C23.5650472,10.0390884 23.5695409,10.0462047 23.573894,10.0533209 C24.465877,11.4920651 26.0123834,12.401414 27.7129366,12.401414 L31.7511536,12.401414 C31.5260515,10.4229488 30.9803579,8.66732093 30.1130898,7.13522791 C29.6751026,6.36164651 29.1771536,5.65169302 28.6205068,5.00425116 C28.0746728,4.36950698 27.4722472,3.79490233 26.8125281,3.28127442 C25.4793281,2.24453023 23.969894,1.45462326 22.2835238,0.911413953 C20.597294,0.369181395 18.8063068,0.0976465116 16.9115451,0.0976465116 C14.2773026,0.0976465116 11.9081834,0.560762791 9.80488979,1.4860186 C8.75843872,1.94648372 7.79694511,2.49666977 6.91394936,3.13071628 C6.91156213,3.13071628 6.90903447,3.13057674 6.90650681,3.13043721 C6.85707702,3.1660186 6.80961319,3.20383256 6.76060468,3.23997209 C6.70190681,3.28308837 6.64377064,3.32690233 6.58577489,3.37085581 C6.46374511,3.46364651 6.34354085,3.5583907 6.22474085,3.65466977 C6.16857064,3.70015814 6.11197915,3.74550698 6.05651106,3.79183256 C5.93574511,3.89271628 5.81750681,3.99597209 5.70025149,4.10048372 C5.65110255,4.14429767 5.60111106,4.18699535 5.55252383,4.23150698 C5.39033234,4.37983256 5.23094936,4.53108837 5.0754983,4.68653023 C5.0639834,4.69811163 5.05162596,4.70871628 5.04025149,4.72015814 C4.84871106,4.91327442 4.66208553,5.11197209 4.48079617,5.31611163 C4.33222596,5.48341395 4.18955362,5.6556 4.04800468,5.82890233 C3.9996983,5.88848372 3.95054936,5.94750698 3.90280468,6.00764651 C3.90280468,6.00764651 3.90280468,6.00778605 3.90266426,6.00778605 C2.73727277,7.47722791 1.82071532,9.1531814 1.1562217,11.0370419 C0.385285532,13.223693 -4.21276596e-05,15.5935535 -4.21276596e-05,18.1467628 C-4.21276596e-05,20.6362047 0.385285532,22.9582047 1.1562217,25.1124837 C1.92715787,27.2669023 3.0355366,29.1423907 4.48079617,30.7378326 C5.2206983,31.5549488 6.04794511,32.2805302 6.96028979,32.9173674 C10.7805664,32.8707628 14.3143749,31.6428558 17.2084047,29.5830419 C17.1099664,29.585693 17.0118089,29.5887628 16.9115451,29.5887628" id="Fill-39" fill="#33CCFF" fill-rule="nonzero" mask="url(#mask-2)"></path>
                            </g>
                        </g>
                        <path d="M127.25995,13.1346419 C126.585486,12.2261302 125.716954,11.5167349 124.656461,11.0042233 C123.597933,10.4938047 122.424537,10.1515256 121.140486,9.97529302 C120.497618,9.88822326 119.858542,9.82166512 119.226065,9.77813023 C119.067384,9.76766512 118.908703,9.75733953 118.750023,9.74910698 C118.276086,9.72413023 117.804397,9.71171163 117.334533,9.71171163 C116.996389,9.71171163 116.655997,9.72008372 116.317712,9.73668837 C115.28432,9.78845581 114.257108,9.91515349 113.232001,10.1183163 C111.866644,10.3901302 110.638903,10.8444558 109.546954,11.4835256 C108.455006,12.1223163 107.555159,12.9688744 106.84952,14.0205488 C106.141776,15.0744558 105.741001,16.3979442 105.64495,17.9954791 L109.913886,17.9954791 C111.224057,17.9954791 112.389448,17.2435256 113.007882,16.0958512 C113.222312,15.6980372 113.498248,15.3734791 113.835269,15.1221767 C114.509733,14.6201302 115.405367,14.3379907 116.522452,14.2757581 C116.67692,14.2654326 116.833495,14.261107 116.996389,14.261107 C117.301112,14.261107 117.597691,14.2715721 117.881491,14.2904093 C118.173857,14.3089674 118.453725,14.3400837 118.724886,14.3794326 C119.255414,14.4605023 119.720784,14.6201302 120.123806,14.8585953 C120.52472,15.0972 120.846295,15.4333395 121.086423,15.8647814 C121.32641,16.2942698 121.447457,16.877386 121.447457,17.6116186 C121.478912,18.3148744 121.270099,18.8481767 120.821299,19.215293 C120.372218,19.5825488 119.760525,19.8625953 118.99015,20.0533395 C118.219776,20.2440837 117.33664,20.3875256 116.340742,20.4849209 C115.344844,20.5803628 114.332235,20.7088744 113.305023,20.8666884 C112.27795,21.0264558 111.257057,21.2421767 110.246414,21.5139907 C109.586554,21.6910605 108.975563,21.9264558 108.411474,22.2179442 C108.10984,22.3739442 107.821125,22.5451535 107.547014,22.7338047 C106.759789,23.2774326 106.118886,24.0034326 105.619954,24.9120837 C105.286444,25.5246419 105.06401,26.2506419 104.955601,27.0865953 C105.936333,26.0897581 107.303797,25.4703628 108.817584,25.4703628 C110.027069,25.4703628 111.143593,25.8655256 112.043861,26.5327814 C112.04695,26.5270605 112.049337,26.5210605 112.052286,26.5154791 C112.27795,26.1028744 112.574248,25.7585023 112.943848,25.4865488 C113.313448,25.2169674 113.745537,25.001107 114.244469,24.8413395 C114.741435,24.6818512 115.248652,24.5532 115.762469,24.4576186 C116.30732,24.3621767 116.854418,24.2833395 117.401376,24.2191535 C117.401376,24.2191535 118.805912,24.0179442 120.605184,23.5334791 C122.68924,22.9722698 125.301716,22.0305488 126.875886,20.5814791 C127.549367,19.9615256 128.032993,19.2490605 128.203048,18.4332 C128.204733,18.4248279 128.20698,18.4164558 128.208525,18.4079442 C128.21344,18.3836651 128.216529,18.3589674 128.220742,18.3345488 C128.252759,18.1424093 128.270452,17.9466419 128.270452,17.7485023 L128.270452,16.7506884 C128.270452,15.2508279 127.934274,14.0455256 127.25995,13.1346419" id="Fill-42" fill="#33CCFF" fill-rule="nonzero"></path>
                        <path d="M42.1077753,25.4866186 C42.4775157,25.2168977 42.9094647,25.0011767 43.408537,24.8414093 C43.905503,24.6817814 44.41272,24.5531302 44.9263966,24.4576884 C45.4713881,24.3622465 46.018486,24.2832698 46.5654434,24.2192233 C46.5654434,24.2192233 47.9699796,24.018014 49.7692519,23.5334093 C49.7793626,23.5307581 49.7900349,23.5276884 49.8001455,23.5248977 C51.8638391,22.9668977 54.4341881,22.0366186 56.0040051,20.6125256 C56.9016051,19.9445721 57.4352221,18.8975023 57.4352221,17.7805256 L57.4352221,16.7529907 C57.4352221,15.8154558 57.3039243,14.9930372 57.0406264,14.2855953 C56.8826477,13.8604326 56.6772051,13.4767116 56.4238774,13.1347116 C55.749554,12.2260605 54.8810221,11.5166651 53.8205285,11.0041535 C52.7620009,10.4938744 51.5886051,10.1515953 50.304554,9.97522326 C49.6615455,9.88815349 49.0226094,9.82173488 48.3899923,9.77806047 C48.2314519,9.76759535 48.0726306,9.75726977 47.9140902,9.74917674 C47.440154,9.72406047 46.9683243,9.71164186 46.4986009,9.71164186 C46.1604562,9.71164186 45.8200647,9.72001395 45.4816391,9.73675814 C44.4482477,9.78838605 43.4211753,9.91508372 42.3959285,10.1182465 C41.0305711,10.3900605 39.8028306,10.8445256 38.7110221,11.4834558 C37.6190732,12.122386 36.7192264,12.9689442 36.0135881,14.0206186 C35.3058434,15.0745256 34.9050689,16.398014 34.8088774,17.9954093 L34.8098604,17.9954093 C34.8098604,17.9962465 34.80972,17.9969442 34.80972,17.9977814 L39.1130604,17.9977814 C40.4021668,17.9977814 41.5594136,17.2629907 42.1567838,16.128014 C42.3734604,15.7165256 42.6547328,15.3820605 43.0000391,15.1244791 C43.674503,14.6224326 44.570137,14.340293 45.6872221,14.2780605 C45.8416902,14.2675953 45.9982647,14.2634093 46.1611583,14.2634093 C46.4658817,14.2634093 46.7624604,14.2738744 47.0462604,14.2927116 C47.3386264,14.3111302 47.6184945,14.342386 47.8896562,14.3817349 C48.4201838,14.4628047 48.885554,14.6224326 49.2885753,14.8608977 C49.6894902,15.0995023 50.0110647,15.4356419 50.2511923,15.8670837 C50.3110136,15.9742465 50.3635328,16.0911767 50.4086094,16.2174558 C50.5435583,16.5967116 50.6115243,17.0617814 50.6115243,17.6115488 C50.6428391,18.3148047 50.4340264,18.8482465 49.9853668,19.2152233 C49.536286,19.5826186 48.9245923,19.8626651 48.1542179,20.0534093 C47.383703,20.2441535 46.5007072,20.3874558 45.5048094,20.4848512 C44.5089115,20.580293 43.496303,20.7088047 42.4689498,20.8666186 C41.4418774,21.026386 40.4211243,21.2422465 39.4103413,21.5139209 C38.7506221,21.6909907 38.1394902,21.926386 37.5755413,22.218014 C37.2739072,22.3738744 36.9851923,22.5450837 36.7109413,22.7337349 C35.9238562,23.2773628 35.2828136,24.0033628 34.7838817,24.9121535 C34.6875498,25.0892233 34.6014689,25.2768977 34.5238136,25.4729442 C34.5229711,25.4747581 34.5222689,25.4767116 34.5215668,25.4786651 C34.4851966,25.5703395 34.4512136,25.6642465 34.4189157,25.760107 C34.4149838,25.7716884 34.4110519,25.7834093 34.4072604,25.7951302 C34.3783328,25.8830372 34.3512306,25.9727581 34.3256732,26.064014 C34.32132,26.0793628 34.3168264,26.0947116 34.3126136,26.1103395 C34.2874774,26.2031302 34.2640264,26.2978744 34.2424009,26.3941535 C34.2395923,26.4064326 34.236503,26.418293 34.2338349,26.4307116 C34.1876349,26.6405721 34.1502817,26.8590837 34.1209328,27.0854093 C34.10352,27.2186651 34.088354,27.3541535 34.0769796,27.4929907 C34.051703,27.7793163 34.0392051,28.0758279 34.0392051,28.3848977 C34.0392051,29.6628977 34.254337,30.7646651 34.6885328,31.6899209 C35.1228689,32.6151767 35.7243115,33.3805256 36.4966519,33.9884791 C37.2670264,34.5940605 38.1647668,35.0401535 39.194086,35.3285721 C40.1169626,35.5858744 41.1065413,35.7269442 42.1587498,35.7538744 C42.2716519,35.7559674 42.3842732,35.7580605 42.4990009,35.7580605 C42.7892604,35.7580605 43.0774136,35.7496884 43.36332,35.7351767 C43.4595115,35.7290372 43.5554221,35.7227581 43.6516136,35.7164791 C43.9505796,35.6948512 44.2481413,35.6644326 44.5445796,35.6257814 C45.3886774,35.5156884 46.2226647,35.3366651 47.0462604,35.0878744 C48.5160945,34.644014 49.7959328,33.8680605 50.8859157,32.7582 C50.8898477,32.7541535 50.8932179,32.7508047 50.8967285,32.7474558 C50.8986945,32.7456419 50.9003796,32.7438279 50.9026264,32.7415953 C50.9033285,32.7513628 50.9044519,32.7608512 50.905154,32.7704791 C51.4026817,34.1415488 52.7152391,35.1244326 54.2637115,35.1355953 L54.3165115,35.1355953 L57.4352221,35.1355953 L57.4352221,29.6296884 L57.4352221,29.1171767 L57.4352221,27.6690837 L57.4352221,26.4307116 L57.4352221,25.8219209 L57.4352221,22.952386 C55.4543796,23.4586186 53.6066604,24.2931767 51.9513243,25.3914558 C51.9166391,25.4143395 51.881954,25.4373628 51.8474094,25.4606651 C51.0415072,26.0208977 50.4767157,26.8995488 50.33952,27.9134093 C50.3486477,27.8435023 50.3586179,27.7741535 50.3704136,27.7063395 C50.2566689,28.1362465 50.0812774,28.562386 49.8418519,28.9846186 C49.4868562,29.6069442 48.9420051,30.1422 48.2029455,30.5881535 C47.7370136,30.8718279 47.1476477,31.0627116 46.4377966,31.1659674 C46.2284221,31.1965256 46.0097796,31.2202465 45.7790604,31.2354558 C45.5472179,31.250107 45.3049838,31.2584791 45.0524987,31.2584791 L45.0378945,31.2584791 C44.92092,31.2584791 44.804086,31.2541535 44.6871115,31.250107 C44.6119838,31.2478744 44.5388221,31.2438279 44.4636945,31.2376884 C44.4573753,31.2395023 44.4511966,31.2376884 44.4448774,31.2354558 C44.3915157,31.2336419 44.338154,31.2284791 44.2861966,31.2247116 C44.2353626,31.2208047 44.1846689,31.2173163 44.1339753,31.2108977 C44.0464902,31.200014 43.9585838,31.1885721 43.8708179,31.1774093 C43.8060817,31.1688977 43.7413455,31.1608047 43.6764689,31.148386 C43.6117328,31.1380605 43.547137,31.1275953 43.4824009,31.1150372 C42.9666179,31.0195953 42.5178179,30.8517349 42.133754,30.6132698 C41.7475838,30.3725721 41.44272,30.0466186 41.2170562,29.6296884 C40.9916732,29.2169442 40.8810179,28.7045721 40.8810179,28.0988512 C40.8810179,27.4597814 40.9916732,26.9347116 41.2170562,26.5177814 L41.216354,26.5155488 C41.4418774,26.1028047 41.7383157,25.7584326 42.1077753,25.4866186" id="Fill-44" fill="#33CCFF" fill-rule="nonzero"></path>
                        <path d="M122.788549,25.3914 C122.753863,25.4144233 122.719178,25.4374465 122.684774,25.4606093 C121.954842,25.9679581 121.423893,26.7370744 121.22814,27.6307953 L121.207638,27.7064233 C121.20188,27.7283302 121.194157,27.7500977 121.187978,27.7720047 C121.176042,27.8145628 121.162702,27.8571209 121.149502,27.8996791 C121.087855,28.099493 121.012587,28.2984698 120.923697,28.4967488 C120.919063,28.5067953 120.91457,28.5169814 120.909936,28.5271674 C120.840144,28.6800977 120.765297,28.8327488 120.679217,28.9845628 C120.324221,29.6070279 119.77937,30.1422837 119.04031,30.5882372 C118.574378,30.8717721 117.985012,31.0626558 117.275161,31.1660512 C117.065787,31.1964698 116.847004,31.2203302 116.616425,31.2354 C116.384583,31.2500512 116.142208,31.2584233 115.889863,31.2584233 L115.875259,31.2584233 C115.758285,31.2584233 115.641451,31.2542372 115.524336,31.2500512 C115.449208,31.2478186 115.376187,31.2437721 115.301059,31.2376326 C115.2946,31.239586 115.288421,31.2376326 115.282102,31.2354 C115.22888,31.233586 115.175519,31.2285628 115.123561,31.2246558 C115.072587,31.2208884 115.021893,31.2172605 114.97134,31.2109814 C114.883714,31.1999581 114.795949,31.1885163 114.708183,31.177493 C114.643446,31.1689814 114.57857,31.1607488 114.513834,31.1483302 C114.449097,31.1381442 114.384502,31.1275395 114.319766,31.1151209 C114.282974,31.1082837 114.248991,31.0983767 114.213042,31.0908419 C114.121344,33.0550744 112.967046,34.7424698 111.30834,35.6007488 C111.850804,35.6857256 112.412506,35.7367953 112.993868,35.751586 C113.10677,35.7536791 113.219391,35.7557721 113.334259,35.7557721 C113.624519,35.7557721 113.912531,35.7474 114.198578,35.7328884 C114.29477,35.7267488 114.39068,35.7204698 114.486731,35.7141907 C114.785697,35.6925628 115.083259,35.6621442 115.379697,35.623493 C116.223795,35.5134 117.057783,35.3343767 117.881519,35.085586 C119.351353,34.6417256 120.631191,33.8657721 121.721034,32.7559116 C121.724685,32.7521442 121.727914,32.7490744 121.731144,32.7460047 C121.733251,32.7439116 121.735357,32.7418186 121.737885,32.739307 C121.737885,32.7407023 121.738025,32.7419581 121.738166,32.7433535 C121.738727,32.7427953 121.739289,32.7422372 121.739851,32.7416791 C121.740693,32.751307 121.741676,32.7607953 121.742519,32.7705628 C121.952455,33.3493535 122.308995,33.8575395 122.76594,34.2540977 C122.783212,34.2690279 122.799361,34.2850744 122.816774,34.2997256 C122.842893,34.321493 122.870557,34.3410279 122.897238,34.3620977 C122.942174,34.3974 122.986408,34.4334 123.033029,34.4666093 C123.037242,34.4696791 123.042017,34.4723302 123.046229,34.4754 C123.631102,34.8881442 124.344885,35.1319116 125.117085,35.133307 L125.130846,35.133307 L128.27048,35.133307 L128.27048,29.6274 L128.27048,26.4284233 L128.27048,25.2419581 L128.27048,22.9530279 C126.29034,23.4592605 124.443463,24.2935395 122.788549,25.3914" id="Fill-46" fill="#33CCFF" fill-rule="nonzero"></path>
                        <g id="Group-55" transform="translate(132.421277, 0.181395)">
                            <path d="M8.58776553,18.2543163 C10.2523698,18.2543163 11.7167272,17.933107 12.9801357,17.2908279 C14.2434038,16.6485488 15.2176762,15.7485488 15.9036549,14.5904093 C16.5890719,13.4326884 16.9318506,12.0942698 16.9318506,10.5761302 C16.9318506,9.05813023 16.5890719,7.72013023 15.9036549,6.5619907 C15.2176762,5.40426977 14.2434038,4.50371163 12.9801357,3.86143256 C11.7167272,3.21915349 10.2523698,2.89808372 8.58776553,2.89808372 L3.0347783,2.89808372 L3.0347783,18.2543163 L8.58776553,18.2543163 Z M0.0966548936,0.358130233 L8.76399957,0.358130233 C10.9382081,0.358130233 12.867374,0.786502326 14.5520591,1.64268837 C16.2364634,2.49943256 17.5438251,3.70082791 18.4742847,5.24826977 C19.404323,6.79557209 19.869974,8.57185116 19.869974,10.5761302 C19.869974,12.5809674 19.404323,14.3568279 18.4742847,15.9041302 C17.5438251,17.4514326 16.2364634,18.653386 14.5520591,19.5097116 C12.867374,20.3663163 10.9382081,20.7941302 8.76399957,20.7941302 L0.0966548936,20.7941302 L0.0966548936,0.358130233 Z" id="Fill-48" fill="#A6E9FF" fill-rule="nonzero"></path>
                            <path d="M36.1466834,13.3496093 L31.7100791,3.33602791 L27.2736153,13.3496093 L36.1466834,13.3496093 Z M37.1750196,15.6851442 L26.2452791,15.6851442 L23.9830238,20.794214 L20.9568536,20.794214 L30.2704366,0.358213953 L33.1792111,0.358213953 L42.522143,20.794214 L39.4374153,20.794214 L37.1750196,15.6851442 Z" id="Fill-50" fill="#A6E9FF" fill-rule="nonzero"></path>
                            <g id="Group-54" transform="translate(43.531915, 0.000000)">
                                <g id="Fill-52-Clipped">
                                    <mask id="mask-4" fill="white">
                                        <use xlink:href="#path-3"></use>
                                    </mask>
                                    <g id="path-3"></g>
                                    <path d="M15.105757,17.4076326 C16.3103272,16.7265628 17.2601655,15.7873535 17.9556932,14.5904233 C18.6506591,13.3933535 18.998774,12.055493 18.998774,10.5761442 C18.998774,9.09735349 18.6506591,7.75893488 17.9556932,6.56200465 C17.2601655,5.36493488 16.3103272,4.42614419 15.105757,3.74465581 C13.9010464,3.06358605 12.5445357,2.72284186 11.036506,2.72284186 C9.52791447,2.72284186 8.16171447,3.06358605 6.93790596,3.74465581 C5.71353574,4.42614419 4.75358681,5.36493488 4.05862085,6.56200465 C3.36309319,7.75893488 3.01554,9.09735349 3.01554,10.5761442 C3.01554,12.055493 3.36309319,13.3933535 4.05862085,14.5904233 C4.75358681,15.7873535 5.71353574,16.7265628 6.93790596,17.4076326 C8.16171447,18.0891209 9.52791447,18.4294465 11.036506,18.4294465 C12.5445357,18.4294465 13.9010464,18.0891209 15.105757,17.4076326 M5.42482085,19.6701907 C3.75965489,18.7651674 2.45229319,17.5147953 1.50245489,15.9187953 C0.552054894,14.3230744 0.0774165957,12.5421907 0.0774165957,10.5761442 C0.0774165957,8.61051628 0.552054894,6.82977209 1.50245489,5.23363256 C2.45229319,3.63791163 3.75965489,2.38712093 5.42482085,1.48209767 C7.08942511,0.577074419 8.96003362,0.124562791 11.036506,0.124562791 C13.0931783,0.124562791 14.9538166,0.577074419 16.6187017,1.48209767 C18.2834464,2.38712093 19.5863145,3.63288837 20.5266038,5.2189814 C21.4667528,6.80549302 21.9368974,8.5909814 21.9368974,10.5761442 C21.9368974,12.5614465 21.4667528,14.347214 20.5266038,15.933307 C19.5863145,17.5198186 18.2834464,18.7651674 16.6187017,19.6701907 C14.9538166,20.575214 13.0931783,21.0277256 11.036506,21.0277256 C8.96003362,21.0277256 7.08942511,20.575214 5.42482085,19.6701907" id="Fill-52" fill="#A6E9FF" fill-rule="nonzero" mask="url(#mask-4)"></path>
                                </g>
                            </g>
                        </g>
                    </g>
                </g>
            </g>
        </g>
    </g>
</svg>