{
  "project_info": {
    "project_number": "387713636781",
    "project_id": "demofirebaseflutter-db3b8",
    "storage_bucket": "demofirebaseflutter-db3b8.appspot.com"
  },
  "client": [
    {
      "client_info": {
        "mobilesdk_app_id": "1:387713636781:android:3c146fc74e52610bf76924",
        "android_client_info": {
          "package_name": "com.example.untitled"
        }
      },
      "oauth_client": [
        {
          "client_id": "387713636781-vdtusan2od8bnfk4b8a4lnkf4pim32fv.apps.googleusercontent.com",
          "client_type": 3
        }
      ],
      "api_key": [
        {
          "current_key": "AIzaSyB7RznNPK6q2HxrKYeZ7HuP6NHtHuofiyQ"
        }
      ],
      "services": {
        "appinvite_service": {
          "other_platform_oauth_client": [
            {
              "client_id": "387713636781-vdtusan2od8bnfk4b8a4lnkf4pim32fv.apps.googleusercontent.com",
              "client_type": 3
            }
          ]
        }
      }
    }
  ],
  "configuration_version": "1"
}