[
{"Colcap":"0","SP_500":"0","Fear_Greed":"0","TRM":"-1","Down_Jones":"0","Tasa_Captacion":"0","SP_500_BOND_INDEX":"-1"},
{"Colcap":"1","SP_500":"0","Fear_Greed":"0","TRM":"0","Down_Jones":"0","Tasa_Captacion":"0","SP_500_BOND_INDEX":"0"},
{"Colcap":"0","SP_500":"0","Fear_Greed":"-1","TRM":"0","Down_Jones":"0","Tasa_Captacion":"0","SP_500_BOND_INDEX":"0"},
{"Colcap":"0","SP_500":"0","Fear_Greed":"-1","TRM":"0","Down_Jones":"0","Tasa_Captacion":"0","SP_500_BOND_INDEX":"0"},
{"Colcap":"-1","SP_500":"-1","Fear_Greed":"1","TRM":"1","Down_Jones":"-1","Tasa_Captacion":"0","SP_500_BOND_INDEX":"1"},
{"Colcap":"1","SP_500":"0","Fear_Greed":"0","TRM":"0","Down_Jones":"0","Tasa_Captacion":"0","SP_500_BOND_INDEX":"0"},
{"Colcap":"1","SP_500":"1","Fear_Greed":"-1","TRM":"1","Down_Jones":"1","Tasa_Captacion":"0","SP_500_BOND_INDEX":"-1"},
{"Colcap":"-1","SP_500":"0","Fear_Greed":"0","TRM":"1","Down_Jones":"0","Tasa_Captacion":"1","SP_500_BOND_INDEX":"0"},
{"Colcap":"1","SP_500":"-1","Fear_Greed":"-1","TRM":"-1","Down_Jones":"-1","Tasa_Captacion":"1","SP_500_BOND_INDEX":"1"},
{"Colcap":"1","SP_500":"1","Fear_Greed":"1","TRM":"-1","Down_Jones":"1","Tasa_Captacion":"-1","SP_500_BOND_INDEX":"-1"},
{"Colcap":"-1","SP_500":"0","Fear_Greed":"0","TRM":"1","Down_Jones":"0","Tasa_Captacion":"1","SP_500_BOND_INDEX":"0"},
{"Colcap":"1","SP_500":"1","Fear_Greed":"1","TRM":"-1","Down_Jones":"1","Tasa_Captacion":"-1","SP_500_BOND_INDEX":"-1"},
{"Colcap":"0","SP_500":"-1","Fear_Greed":"-1","TRM":"1","Down_Jones":"-1","Tasa_Captacion":"1","SP_500_BOND_INDEX":"1"},
{"Colcap":"-1","SP_500":"0","Fear_Greed":"0","TRM":"1","Down_Jones":"0","Tasa_Captacion":"1","SP_500_BOND_INDEX":"0"}
]
