{
  "profiles": {
    "Canine.Net.ServiceDiscoveryService": {
      "commandName": "Project",
      "environmentVariables": {
        "servicediscovery_sqlserver_password": "defaultPWD",
        "rabbitmq_port": "5672",
        "servicediscovery_sqlserver_user": "postgres",
        "rabbitmq_password": "guest",
        "rabbitmq_host": "127.0.0.1",
        "rabbitmq_username": "guest",
        "servicediscovery_sqlserver_name": "127.0.0.1",
        "servicediscovery_sqlserver_port": "53114",
        "servicediscovery_sqlserver_databasename": "Test_ServiceDiscovery"
      }
    }
  }
}