{
  "name": "FoundryVTT-pf2-it",
  "title": "Pathfinder 2 Italian Translation",
  "description": "Add Italian language to Pathfinder 2 system for FoundryVTT.",
  "version": "0.1",
  "minimumCoreVersion" : "0.6.6",
  "compatibleCoreVersion":"0.6.6",
  "author": "Simone, ProtoZac, Sant1x, FR4NC35C0, heirold",
  "esmodules": ["babele-register.js"],
  "scripts": [],
  "styles": [],
  "packs": [],

  "languages": [{
  	"lang": "it",
    "name": "Italian",
    "path": "it.json"
  }],

  "url": "https://gitlab.com/riccisi/foundryvtt-pf2-lang-it-it",
  "manifest": "https://gitlab.com/riccisi/foundryvtt-pf2-lang-it-it/raw/master/it-IT/module.json",
  "download": "https://gitlab.com/riccisi/foundryvtt-pf2-lang-it-it/-/jobs/artifacts/0.1/raw/pf2-it-IT.zip?job=build"
}