<svg width="40" height="40" viewBox="0 0 81 80" fill="none" xmlns="http://www.w3.org/2000/svg">
<path d="M22.68 6.38437C13.7473 6.38437 6.47998 13.562 6.47998 22.3844V57.5844C6.47998 66.4068 13.7473 73.5844 22.68 73.5844H58.32C67.2527 73.5844 74.52 66.4068 74.52 57.5844V22.3844C74.52 13.562 67.2527 6.38437 58.32 6.38437H22.68ZM64.1513 14.4062C64.9662 14.3262 65.7325 14.8655 65.9042 15.6687C67.7073 24.0943 65.7708 41.5936 45.5435 47.5344C42.796 48.3408 40.2786 48.9899 37.8422 49.6187C26.8569 52.4491 20.223 54.156 17.7978 64.3656C17.6261 65.0936 16.9705 65.6 16.2253 65.6C16.1816 65.6 16.1361 65.597 16.0924 65.5938C15.2937 65.5298 14.6635 64.9013 14.6085 64.1125C14.5906 63.8741 13.1982 40.2045 38.2693 33.9469C60.9364 28.2925 62.699 18.7777 62.699 15.9969C62.699 15.1777 63.3268 14.4926 64.1513 14.4062ZM62.9838 24.2156C62.7683 24.5068 62.5324 24.7977 62.2845 25.0937C59.7752 29.3545 54.3765 34.3581 42.8097 37.2781C31.5329 40.1501 26.1203 43.6865 22.9078 47.1969C21.1193 49.6241 19.9466 52.1561 19.19 54.4937C19.4314 54.2329 19.7029 54.0103 19.9589 53.7687C24.1676 48.2807 32.5053 44.3424 40.5 43.2C49.2204 41.9536 54.917 38.5038 57.6872 36.4094C60.9239 32.5966 62.4686 28.206 62.9838 24.2156Z" fill="#F9F9F9"/>
</svg>
