<svg width="122" height="171" viewBox="0 0 122 171" fill="none" xmlns="http://www.w3.org/2000/svg">
<path d="M88.3566 132.084C55.4348 138.117 30.6297 55.8795 27.0003 0.00109148C15.5003 0.00109136 10.5 3.07477e-07 0.500037 3.24973e-05C33.698 210.957 99.4508 166.214 107.807 166.61C128.696 167.6 129.509 124.543 88.3566 132.084Z" fill="#D67D3E"/>
</svg>
