C:\Kron\POCV4\src\main\java\pages\LoginPage.java
C:\Kron\POCV4\src\main\java\listeners\MethodInterceptor.java
C:\Kron\POCV4\src\main\java\data\TestData.java
C:\Kron\POCV4\src\main\java\drivers\Firefox.java
C:\Kron\POCV4\src\main\java\pages\solMenuPages\UserAccountsPage.java
C:\Kron\POCV4\src\main\java\common\DBConnection.java
C:\Kron\POCV4\src\main\java\pages\altMenuPages\CreateNewAccountPage.java
C:\Kron\POCV4\src\main\java\common\AllureEnvironmentUtils.java
C:\Kron\POCV4\src\main\java\listeners\ResultListener.java
C:\Kron\POCV4\src\main\java\pages\MainPage.java
C:\Kron\POCV4\src\main\java\listeners\DriverEventListener.java
C:\Kron\POCV4\src\main\java\common\ReusableSteps.java
C:\Kron\POCV4\src\main\java\drivers\Chrome.java
C:\Kron\POCV4\src\main\java\data\UserData.java
C:\Kron\POCV4\src\main\java\pages\pagecomponents\ConfirmDialog.java
C:\Kron\POCV4\src\main\java\pages\pagecomponents\MenuPages.java
C:\Kron\POCV4\src\main\java\pages\ustmenupages\AnasayfaPage.java
C:\Kron\POCV4\src\main\java\common\BaseTest.java
C:\Kron\POCV4\src\main\java\common\BaseLibrary.java
