{
    "userId" : "111111A",
    "transactionDate" : "03-07-2022",
    "status" : "Pending Delivery",
    "total" : 3000
},
{
    "userId" : "222222A",
    "transactionDate" : "03-09-2022",
    "status" : "Paid",
    "total" : 9000
}

//Refference Model
{
    "userId" : String,
    "transactionDate" : String,
    "status" : String,
    "total" : Number
}