<?xml version="1.0" encoding="UTF-8"?>
<kml xmlns="http://earth.google.com/kml/2.0">
  <Document>
    <name>KML Samples</name>
    <open>1</open>
    <distance>3.497064</distance>
    <traveltime>872</traveltime>
    <description>To enable simple instructions add: 'instructions=1' as parameter to the URL</description>
    <Folder>
      <name>Paths</name>
      <visibility>0</visibility>
      <description>Examples of paths.</description>
      <Placemark>
        <name>Tessellated</name>
        <visibility>0</visibility>
        <description><![CDATA[If the <tessellate> tag has a value of 1, the line will contour to the underlying terrain]]></description>
        <LineString>
          <tessellate>1</tessellate>
         <coordinates> 9.493925,45.902182
9.493917,45.902221
9.493477,45.902403
9.493316,45.902438
9.493212,45.902458
9.493051,45.902456
9.492915,45.902459
9.492793,45.902494
9.492624,45.902509
9.492178,45.902527
9.492141,45.902524
9.491725,45.902501
9.491413,45.902434
9.490712,45.902465
9.490236,45.902427
9.489879,45.902394
9.489377,45.902433
9.488890,45.902425
9.488631,45.902442
9.488337,45.902458
9.488150,45.902469
9.487984,45.902513
9.487786,45.902607
9.487653,45.902718
9.487557,45.902841
9.487473,45.902986
9.487389,45.903043
9.487244,45.903064
9.487022,45.903091
9.486891,45.903191
9.486723,45.903660
9.486577,45.903858
9.485901,45.904543
9.485733,45.904695
9.485621,45.904781
9.485399,45.904885
9.485082,45.904994
9.484986,45.905043
9.484750,45.905328
9.484564,45.905520
9.484520,45.905554
9.484330,45.905630
9.484141,45.905684
9.483811,45.905807
9.483589,45.905909
9.483366,45.906021
9.483150,45.906183
9.483040,45.906180
9.482843,45.906106
9.482483,45.905726
9.482327,45.905645
9.482221,45.905646
9.482057,45.905805
9.481943,45.905864
9.481632,45.905954
9.481284,45.906184
9.480786,45.906378
9.480626,45.906405
9.480474,45.906356
9.480338,45.906193
9.480289,45.906040
9.480306,45.905942
9.480239,45.905821
9.480155,45.905685
9.480002,45.905501
9.479799,45.905166
9.479757,45.905116
9.479665,45.905107
9.479475,45.905125
9.479252,45.905090
9.479083,45.905096
9.478936,45.905157
9.478724,45.905285
9.478576,45.905299
9.478328,45.905244
9.478194,45.905220
9.478011,45.905155
9.477935,45.905188
9.477811,45.905217
9.477660,45.905230
9.477514,45.905220
9.477371,45.905186
9.477123,45.905164
9.476868,45.905124
9.476711,45.905104
9.476603,45.905056
9.476500,45.904964
9.476457,45.904931
9.476383,45.904901
9.476314,45.904840
9.476260,45.904767
9.476201,45.904610
9.476166,45.904315
9.476257,45.903729
9.476122,45.903614
9.476047,45.903331
9.475903,45.903172
9.475659,45.903041
9.475472,45.902879
9.475355,45.902662
9.475273,45.902517
9.475200,45.902458
9.474982,45.902428
9.474766,45.902384
9.474499,45.902305
9.474200,45.902320
9.474058,45.902277
9.473899,45.902018
9.473796,45.901968
9.473710,45.901941
9.473585,45.901909
9.473120,45.901802
9.472554,45.901667
9.472252,45.901659
9.472147,45.901573
9.472142,45.901374
9.472260,45.901107
9.472540,45.900857
9.472629,45.900712
9.472665,45.900531
9.472650,45.900529
9.472631,45.900537
9.472576,45.900636
9.472326,45.900820
9.472214,45.900882
9.472034,45.901032
9.471786,45.901187
9.471620,45.901463
9.471552,45.901555
9.471514,45.901877
9.471805,45.902154
9.471930,45.902136
9.471975,45.902255
9.471971,45.902422
9.471876,45.902576
9.471655,45.902550
9.471310,45.902496
9.471276,45.902418
9.470384,45.902295
9.470222,45.902291
9.470129,45.902298
9.470039,45.902281
9.470002,45.902264
9.469901,45.902190
9.469865,45.901904
9.469820,45.901864
9.469757,45.901855
9.469692,45.901897
9.469562,45.901834
9.469399,45.901810
9.469372,45.901777
9.469007,45.901658
9.468654,45.901566
9.468449,45.901564
9.468217,45.901473
9.467954,45.901075
9.467812,45.901043
9.467734,45.900979
9.467684,45.900966
9.467551,45.900988
9.467169,45.900838
9.466872,45.900690
9.466619,45.900655
9.466285,45.900836
9.465839,45.900747
9.465418,45.900941
9.465235,45.900868
9.465179,45.900880
9.465105,45.900975
9.464975,45.901046
9.464998,45.901108
9.464991,45.901145
9.464991,45.901180
9.464800,45.901265
9.464557,45.901313
9.464329,45.901404
9.464178,45.901414
9.464066,45.901435
9.463755,45.901355
9.463591,45.901285
9.462618,45.901095
9.462353,45.901187
9.461849,45.901232
9.460794,45.901020
9.460721,45.901005
9.460651,45.900993
9.460607,45.900996
9.460589,45.901007
9.460557,45.901010
9.460501,45.900997
9.460432,45.901001
9.460319,45.901036
9.460176,45.901033
9.459990,45.901020
9.459669,45.901053
9.459568,45.901036
9.459313,45.900992
9.458869,45.901028
9.458650,45.900987
9.458480,45.900974
9.458299,45.900980
9.458177,45.900997
9.458093,45.901037
9.457926,45.901077
9.457820,45.901089
9.457683,45.901076
9.457574,45.901066
9.457206,45.901008
9.456931,45.900936
9.456832,45.900912
9.456323,45.901008
9.456287,45.901025
9.456262,45.901078
9.456190,45.901148
9.456117,45.901163
9.456133,45.901167
9.456102,45.901183
9.456060,45.901185
9.456047,45.901198
9.456060,45.901202
9.455930,45.901270
9.455915,45.901227
9.455898,45.901227
9.455855,45.901172
9.455780,45.901167
9.455792,45.901120
9.455888,45.901030
9.455870,45.900998
9.455802,45.900992
9.455762,45.900937
9.455722,45.900948
9.455695,45.900928
9.455622,45.900940
9.455598,45.900922
9.455547,45.900935
9.455502,45.900975
9.455490,45.900927
9.455460,45.900913
9.455432,45.900812
9.455408,45.900810
9.455390,45.900867
9.455362,45.900868
9.455352,45.900817
9.455367,45.900787
9.455323,45.900795
9.455325,45.900772
9.455305,45.900775
9.455268,45.900698
9.455212,45.900703
9.455140,45.900682
9.455062,45.900702
9.455005,45.900678
9.454978,45.900642
9.454997,45.900618
9.454977,45.900597
9.454988,45.900577
9.454957,45.900553
9.454935,45.900498
9.454978,45.900403
9.454993,45.900280
9.454907,45.900185
9.454793,45.900210
9.454803,45.900192
9.454753,45.900222
9.454672,45.900235
9.454593,45.900303
9.454507,45.900340
9.454512,45.900312
9.454467,45.900223
9.454348,45.900273
9.454292,45.900317
9.454263,45.900295
9.454267,45.900262
9.454212,45.900210
9.454110,45.900243
9.454090,45.900222
9.454048,45.900223
9.454028,45.900207
9.454018,45.900240
9.453942,45.900245
9.453922,45.900200
9.453893,45.900185
9.453788,45.900217
9.453808,45.900197
9.453770,45.900182
9.453720,45.900198
9.453613,45.900202
9.453587,45.900182
9.453510,45.900177
9.453445,45.900210
9.453362,45.900305
9.453317,45.900300
9.453317,45.900268
9.453282,45.900280
9.453257,45.900272
9.453143,45.900410
9.453090,45.900310
9.453062,45.900308
9.453060,45.900275
9.453022,45.900260
9.452988,45.900280
9.452953,45.900263
9.452908,45.900278
9.452877,45.900315
9.452857,45.900293
9.452837,45.900298
9.452798,45.900280
9.452728,45.900335
9.452652,45.900242
9.452597,45.900303
9.452547,45.900282
9.452500,45.900293
9.452498,45.900267
9.452443,45.900267
9.452415,45.900233
9.452412,45.900245
9.452365,45.900243
9.452307,45.900185
9.452223,45.900198
9.452192,45.900088
9.452087,45.899952
9.452030,45.899998
9.452007,45.900075
9.451967,45.900067
9.451940,45.900098
9.451882,45.900058
9.451847,45.900098
9.451778,45.900095
9.451782,45.900130
9.451757,45.900107
9.451737,45.900117
9.451718,45.900103
9.451692,45.900108
9.451680,45.900092
9.451630,45.900098
9.451633,45.900115
9.451545,45.900228
9.451508,45.900178
9.451472,45.900172
9.451425,45.900122
9.451274,45.900080
9.451266,45.900124
9.451236,45.900176
9.451207,45.900186
9.451196,45.900207
9.451154,45.900216
9.451132,45.900239
9.451115,45.900269
9.451087,45.900264
9.451066,45.900244
9.451046,45.900222
9.451032,45.900227
9.451007,45.900250
9.450999,45.900269
9.450985,45.900285
9.450969,45.900292
9.450955,45.900298
9.450935,45.900306
9.450917,45.900302
9.450904,45.900279
9.450884,45.900262
9.450866,45.900282
9.450837,45.900287
9.450825,45.900296
9.450801,45.900292
9.450767,45.900256
9.450709,45.900230
9.450697,45.900206
9.450678,45.900208
9.450663,45.900204
9.450638,45.900182
9.450620,45.900187
9.450596,45.900194
9.450558,45.900187
9.450541,45.900199
9.450518,45.900223
9.450484,45.900247
9.450421,45.900269
9.450382,45.900290
9.450339,45.900299
9.450308,45.900305
9.450294,45.900283
9.450287,45.900251
9.450271,45.900242
9.450264,45.900233
9.450252,45.900214
9.450231,45.900199
9.450207,45.900201
9.450195,45.900209
9.450181,45.900216
9.450152,45.900219
9.450117,45.900224
9.450100,45.900219
9.450067,45.900232
9.450063,45.900217
9.450044,45.900193
9.450007,45.900146
9.449983,45.900149
9.449971,45.900159
9.449941,45.900155
9.449881,45.900163
9.449829,45.900173
9.449826,45.900150
9.449846,45.900112
9.449846,45.900065
9.449817,45.900031
9.449825,45.899968
9.449810,45.899858
9.449859,45.899733
9.449824,45.899669
9.449736,45.899560
9.449690,45.899475
9.449677,45.899361
9.449664,45.899351
          </coordinates>
        </LineString>
      </Placemark>
    </Folder>
  </Document>
</kml>
