<?xml version="1.0" encoding="UTF-8"?>
<kml xmlns="http://earth.google.com/kml/2.0">
  <Document>
    <name>KML Samples</name>
    <open>1</open>
    <distance>3.497064</distance>
    <traveltime>872</traveltime>
    <description>To enable simple instructions add: 'instructions=1' as parameter to the URL</description>
    <Folder>
      <name>Paths</name>
      <visibility>0</visibility>
      <description>Examples of paths.</description>
      <Placemark>
        <name>Tessellated</name>
        <visibility>0</visibility>
        <description><![CDATA[If the <tessellate> tag has a value of 1, the line will contour to the underlying terrain]]></description>
        <LineString>
          <tessellate>1</tessellate>
         <coordinates> 9.513337,45.977466
9.513223,45.977492
9.512757,45.977565
9.512727,45.977463
9.512632,45.977378
9.512457,45.977274
9.512143,45.977125
9.511921,45.976978
9.511746,45.976861
9.511445,45.976745
9.511085,45.976611
9.510866,45.976495
9.510652,45.976328
9.510399,45.976092
9.510090,45.975848
9.509880,45.975684
9.509725,45.975558
9.509609,45.975436
9.509459,45.975302
9.509240,45.975231
9.508910,45.975200
9.508678,45.975194
9.508547,45.975170
9.508390,45.975115
9.508061,45.975209
9.507798,45.975359
9.507688,45.975484
9.507619,45.975563
9.507521,45.975686
9.507386,45.975744
9.507199,45.975844
9.506882,45.975936
9.506606,45.975992
9.506421,45.975975
9.506228,45.975985
9.505906,45.976070
9.505757,45.976006
9.505644,45.975869
9.505652,45.975743
9.505527,45.975662
9.505322,45.975525
9.505171,45.975542
9.505160,45.975617
9.505224,45.975731
9.505178,45.975815
9.504939,45.975896
9.504711,45.975975
9.504630,45.976047
9.504634,45.976205
9.504454,45.976246
9.504341,45.976219
9.504196,45.976146
9.504062,45.976143
9.503904,45.976173
9.503713,45.976180
9.503552,45.976195
9.503449,45.976298
9.503342,45.976327
9.503189,45.976463
9.503090,45.976663
9.503076,45.976891
9.502992,45.977005
9.502965,45.977140
9.502851,45.977228
9.502648,45.977369
9.502568,45.977427
9.502309,45.977420
9.502109,45.977367
9.501990,45.977412
9.501909,45.977506
9.501925,45.977683
9.501930,45.977854
9.501900,45.978017
9.501763,45.978195
9.501509,45.978353
9.501168,45.978500
9.500895,45.978654
9.500560,45.978885
9.500371,45.979009
9.500141,45.979086
9.499965,45.979208
9.499855,45.979292
9.499819,45.979570
9.499719,45.979831
9.499679,45.979998
9.499787,45.980252
9.499828,45.980438
9.499887,45.980509
9.500136,45.980571
9.500319,45.980674
9.500657,45.980748
9.500595,45.980928
9.500565,45.981183
9.500617,45.981414
9.500600,45.981505
9.500446,45.981482
9.500228,45.981527
9.499984,45.981619
9.499763,45.981672
9.499471,45.981736
9.499265,45.981831
9.499076,45.981946
9.498871,45.982051
9.498714,45.982060
9.498509,45.982053
9.498328,45.982064
9.498133,45.982110
9.498094,45.982207
9.498161,45.982261
9.498230,45.982303
9.498366,45.982414
9.498471,45.982479
9.498620,45.982578
9.498654,45.982744
9.498654,45.982865
9.498704,45.983067
9.498732,45.983246
9.498780,45.983426
9.498775,45.983490
9.498666,45.983554
9.498668,45.983617
9.498807,45.983681
9.498802,45.983721
9.498901,45.983785
9.498877,45.983823
9.498698,45.983857
9.498636,45.983899
9.498641,45.983935
9.498713,45.983968
9.498758,45.983998
9.498771,45.984035
9.498753,45.984060
9.498651,45.984083
9.498579,45.984103
9.498583,45.984135
9.498620,45.984165
9.498625,45.984194
9.498543,45.984226
9.498470,45.984253
9.498432,45.984275
9.498439,45.984296
9.498484,45.984351
9.498507,45.984403
9.498524,45.984461
9.498565,45.984504
9.498613,45.984547
9.498686,45.984592
9.498734,45.984617
9.498799,45.984667
9.498859,45.984714
9.498898,45.984772
9.498958,45.984832
9.499009,45.984879
9.499070,45.984933
9.499092,45.984973
9.499124,45.985023
9.499186,45.985085
9.499226,45.985122
9.499236,45.985167
9.499294,45.985228
9.499366,45.985276
9.499423,45.985287
9.499460,45.985324
9.499438,45.985385
9.499428,45.985442
9.499451,45.985474
9.499516,45.985502
9.499601,45.985532
9.499653,45.985568
9.499626,45.985604
9.499589,45.985630
9.499536,45.985650
9.499500,45.985672
9.499533,45.985705
9.499573,45.985729
9.499645,45.985751
9.499690,45.985797
9.499782,45.985835
9.499790,45.985864
9.499716,45.985891
9.499705,45.985917
9.499746,45.985939
9.499789,45.985971
9.499802,45.986010
9.499803,45.986035
9.499854,45.986070
9.499846,45.986103
9.499832,45.986122
9.499784,45.986124
9.499789,45.986145
9.499827,45.986178
9.499857,45.986205
9.499848,45.986231
9.499817,45.986263
9.499824,45.986292
9.499883,45.986350
9.499900,45.986397
9.499900,45.986465
9.499908,45.986518
9.499900,45.986568
9.499910,45.986601
9.499916,45.986644
9.499910,45.986675
9.499938,45.986718
9.499967,45.986754
9.500027,45.986798
9.500073,45.986823
9.500076,45.986889
9.500016,45.986940
9.500016,45.986985
9.500070,45.986992
9.500070,45.987025
9.500125,45.987094
9.500098,45.987174
9.500082,45.987321
9.500090,45.987398
9.500157,45.987470
9.500209,45.987536
9.500257,45.987555
9.500320,45.987627
9.500408,45.987749
9.500459,45.987870
9.500567,45.987981
9.500841,45.988166
9.501021,45.988274
9.501036,45.988309
9.501071,45.988378
9.501133,45.988423
9.501130,45.988469
9.501106,45.988492
9.501147,45.988542
9.501146,45.988593
9.501202,45.988656
9.501236,45.988723
9.501231,45.988796
9.501244,45.988852
9.501254,45.988908
9.501235,45.988961
9.501190,45.989002
9.501153,45.989046
9.501113,45.989076
9.501052,45.989083
9.500982,45.989088
9.500823,45.989119
9.500781,45.989117
9.500721,45.989094
9.500667,45.989078
9.500612,45.989082
9.500561,45.989099
9.500565,45.989132
9.500551,45.989173
9.500540,45.989216
9.500517,45.989269
9.500482,45.989308
9.500417,45.989334
9.500363,45.989344
9.500287,45.989340
9.500190,45.989309
9.500140,45.989266
9.499998,45.989277
9.499963,45.989277
9.499815,45.989353
9.499759,45.989398
9.499727,45.989440
9.499706,45.989472
9.499673,45.989547
9.499656,45.989619
9.499642,45.989691
9.499612,45.989742
9.499593,45.989800
9.499581,45.989853
9.499558,45.989910
9.499529,45.989976
9.499532,45.990024
9.499547,45.990093
9.499518,45.990156
9.499503,45.990188
9.499429,45.990288
9.499367,45.990355
9.499303,45.990405
9.499263,45.990456
9.499214,45.990473
9.499150,45.990472
9.499127,45.990476
9.499077,45.990484
9.499003,45.990489
9.498950,45.990518
9.498879,45.990580
9.498806,45.990645
9.498744,45.990692
9.498687,45.990727
9.498658,45.990749
9.498647,45.990835
9.498606,45.990887
9.498480,45.990974
9.498385,45.991053
9.498324,45.991120
9.498213,45.991239
9.498119,45.991299
9.498088,45.991303
9.498029,45.991327
9.498021,45.991375
9.497902,45.991510
9.497876,45.991558
9.497850,45.991607
9.497810,45.991649
9.497733,45.991708
9.497673,45.991747
9.497612,45.991792
9.497589,45.991796
9.497559,45.991801
9.497522,45.991859
9.497444,45.991926
9.497407,45.991998
9.497332,45.992143
9.497259,45.992273
9.497230,45.992342
9.497178,45.992391
9.497098,45.992427
9.497078,45.992461
9.497082,45.992521
9.497129,45.992614
9.497212,45.992748
9.497230,45.992784
9.497246,45.992830
9.497347,45.992881
9.497337,45.993031
9.497306,45.993118
9.497260,45.993238
9.497227,45.993318
9.497155,45.993428
9.497104,45.993485
9.497091,45.993545
9.497072,45.993612
9.497061,45.993764
9.497062,45.993953
9.497047,45.994016
9.497004,45.994133
9.496976,45.994363
9.496931,45.994484
9.496908,45.994604
9.496898,45.994666
9.496856,45.994779
9.496743,45.994960
9.496682,45.995037
9.496599,45.995067
9.496445,45.995115
9.496404,45.995164
9.496323,45.995240
9.496209,45.995295
9.496088,45.995366
9.495982,45.995382
9.495844,45.995433
9.495674,45.995512
9.495548,45.995576
9.495327,45.995798
9.495270,45.995850
9.495255,45.995911
9.495146,45.996228
9.495150,45.996299
9.495165,45.996449
9.495136,45.996550
9.495150,45.996639
9.495133,45.996732
9.495129,45.996811
9.495140,45.996898
9.495125,45.996996
9.495128,45.997094
9.495099,45.997248
9.495109,45.997352
9.495145,45.997448
9.495208,45.997552
9.495234,45.997627
9.495228,45.997683
9.495188,45.997778
9.495180,45.997838
9.495229,45.997950
9.495230,45.998008
9.495137,45.998152
9.495099,45.998251
9.494989,45.998420
9.494909,45.998610
9.494831,45.998728
9.494695,45.998831
9.494597,45.998927
9.494473,45.999047
9.494347,45.999165
9.494267,45.999251
9.494207,45.999413
9.494080,45.999655
9.494030,45.999756
9.493979,45.999929
9.493897,46.000056
9.493875,46.000108
9.493847,46.000177
9.493848,46.000224
9.493855,46.000283
9.493859,46.000355
9.493869,46.000387
9.493909,46.000402
9.493994,46.000434
9.494056,46.000499
9.494045,46.000603
9.494125,46.000666
9.494136,46.000740
9.494330,46.000885
9.494434,46.000951
9.494446,46.001003
9.494326,46.001077
9.494235,46.001120
9.494185,46.001144
9.494068,46.001170
9.494001,46.001214
9.493899,46.001232
9.493821,46.001312
9.493812,46.001377
9.493776,46.001435
9.493741,46.001455
9.493724,46.001492
9.493664,46.001568
9.493609,46.001599
9.493504,46.001708
9.493494,46.001745
9.493456,46.001791
9.493436,46.001826
9.493354,46.001894
9.493333,46.001935
9.493231,46.002054
9.493195,46.002089
9.493165,46.002179
9.493123,46.002280
9.493052,46.002338
9.493009,46.002362
9.492937,46.002426
9.492797,46.002505
9.492709,46.002528
9.492616,46.002547
9.492584,46.002562
9.492560,46.002573
9.492559,46.002618
9.492517,46.002657
9.492445,46.002700
9.492389,46.002714
9.492344,46.002781
9.492291,46.002837
9.492174,46.002871
9.492107,46.002882
9.491973,46.002923
9.491915,46.002923
9.491898,46.002918
9.491861,46.002931
9.491782,46.002978
9.491752,46.002983
9.491653,46.003027
9.491608,46.003018
9.491565,46.003049
9.491537,46.003056
9.491501,46.003080
9.491437,46.003116
9.491404,46.003123
9.491334,46.003173
9.491268,46.003183
9.491177,46.003206
9.491102,46.003224
9.491044,46.003238
9.490984,46.003236
9.490948,46.003244
9.490914,46.003268
9.490864,46.003280
9.490677,46.003302
9.490626,46.003331
9.490528,46.003346
9.490493,46.003357
9.490471,46.003375
9.490380,46.003398
9.490315,46.003488
9.490258,46.003599
9.490220,46.003711
9.490147,46.003842
9.490135,46.003890
9.490120,46.003951
9.490136,46.004033
9.490090,46.004106
9.489995,46.004188
9.489909,46.004224
9.489830,46.004249
9.489792,46.004271
9.489752,46.004347
9.489721,46.004410
9.489719,46.004481
9.489742,46.004528
9.489729,46.004612
9.489695,46.004696
9.489683,46.004747
9.489683,46.004815
9.489675,46.004895
9.489647,46.004983
9.489588,46.005030
9.489558,46.005086
9.489546,46.005131
9.489599,46.005154
9.489630,46.005194
9.489668,46.005247
9.489689,46.005276
9.489816,46.005353
9.489946,46.005401
9.490049,46.005450
9.490074,46.005543
9.490145,46.005631
9.490197,46.005685
9.490159,46.005766
9.490207,46.005821
9.490240,46.005894
9.490260,46.005974
9.490312,46.006015
9.490372,46.006133
9.490448,46.006189
9.490519,46.006231
9.490608,46.006325
9.490673,46.006388
9.490721,46.006496
9.490774,46.006573
9.490783,46.006654
9.490877,46.006752
9.490983,46.006890
9.491047,46.006967
9.491061,46.007015
9.491063,46.007085
9.491119,46.007182
9.491166,46.007243
9.491158,46.007298
9.491134,46.007335
9.491138,46.007358
9.491160,46.007376
9.491163,46.007422
9.491127,46.007448
9.491117,46.007482
9.491120,46.007507
9.491126,46.007554
9.491121,46.007568
9.491115,46.007582
9.491142,46.007607
9.491156,46.007638
9.491125,46.007702
9.491109,46.007770
9.491125,46.007822
9.491128,46.007857
9.491110,46.007908
9.491123,46.007951
9.491117,46.007999
9.491099,46.008039
9.491091,46.008070
9.491082,46.008097
9.491086,46.008144
9.491098,46.008174
9.491097,46.008235
9.491086,46.008261
9.491101,46.008277
9.491095,46.008309
9.491077,46.008330
9.491070,46.008358
9.491052,46.008378
9.491034,46.008407
9.491020,46.008422
9.491004,46.008457
9.491006,46.008491
9.491022,46.008522
9.491025,46.008566
9.491045,46.008627
9.491056,46.008657
9.491070,46.008723
9.491068,46.008791
9.491059,46.008838
9.491069,46.008861
9.491068,46.008886
9.491059,46.008904
9.491052,46.008940
9.491048,46.008970
9.491012,46.009052
9.491023,46.009117
9.491041,46.009149
9.491065,46.009175
9.491080,46.009212
9.491112,46.009259
9.491170,46.009280
9.491208,46.009294
9.491262,46.009321
9.491338,46.009333
9.491384,46.009348
9.491404,46.009349
9.491481,46.009413
9.491627,46.009318
9.491690,46.009254
9.491805,46.009267
9.491921,46.009283
9.492053,46.009337
9.492081,46.009370
9.492124,46.009374
9.492265,46.009388
9.492379,46.009429
9.492550,46.009491
9.492662,46.009526
9.492768,46.009515
9.492831,46.009524
9.492893,46.009513
9.493002,46.009509
9.493142,46.009462
9.493254,46.009454
9.493315,46.009447
9.493388,46.009452
9.493584,46.009500
9.493639,46.009672
9.493646,46.009713
9.493655,46.009761
9.493640,46.009802
9.493619,46.009840
9.493632,46.009891
9.493717,46.009924
9.493767,46.009941
9.493910,46.010080
9.493929,46.010118
9.493944,46.010148
9.494081,46.010139
9.494205,46.010171
9.494336,46.010183
9.494503,46.010206
9.494663,46.010243
9.494777,46.010318
9.494926,46.010478
9.494967,46.010574
9.495051,46.010758
9.495069,46.010929
9.495058,46.010997
9.495027,46.011042
9.495024,46.011085
9.495010,46.011149
9.495051,46.011199
9.495166,46.011246
9.495257,46.011314
9.495364,46.011495
9.495517,46.011679
9.495840,46.012081
9.495929,46.012123
9.496292,46.012204
9.496498,46.012201
9.496795,46.012143
9.497058,46.012043
9.497240,46.011996
9.497377,46.011962
9.497505,46.011912
9.497702,46.011866
9.497914,46.011812
9.497967,46.011811
9.498105,46.011792
9.498227,46.011743
9.498339,46.011679
9.498407,46.011623
9.498479,46.011561
9.498528,46.011521
9.498571,46.011506
9.498596,46.011509
9.498635,46.011522
9.498723,46.011526
9.498850,46.011535
9.498937,46.011531
9.499053,46.011541
9.499121,46.011532
9.499262,46.011513
9.499334,46.011509
9.499393,46.011493
9.499448,46.011499
9.499500,46.011499
9.499553,46.011480
9.499676,46.011472
9.499724,46.011479
9.499827,46.011463
9.499915,46.011456
9.500028,46.011435
9.500162,46.011433
9.500284,46.011414
9.500437,46.011381
9.500616,46.011337
9.500882,46.011242
9.501070,46.011164
9.501359,46.011141
9.501933,46.011107
9.502221,46.011073
9.502434,46.011008
9.502735,46.010910
9.503168,46.010827
9.503393,46.010747
9.503560,46.010738
9.503642,46.010711
9.503720,46.010662
9.503793,46.010630
9.503845,46.010594
9.503965,46.010511
9.504094,46.010433
9.504452,46.010285
9.504535,46.010258
9.504742,46.010289
9.504838,46.010294
9.505001,46.010344
9.505126,46.010392
9.505290,46.010464
9.505403,46.010521
9.505505,46.010581
9.505620,46.010622
9.505707,46.010652
9.505841,46.010696
9.506098,46.010717
9.506225,46.010735
9.506343,46.010760
9.506496,46.010769
9.506724,46.010760
9.506981,46.010771
9.507155,46.010836
9.507245,46.010832
9.507414,46.010889
9.507666,46.010962
9.507817,46.011039
9.507930,46.011098
9.508104,46.011196
9.508149,46.011325
9.508189,46.011389
9.508347,46.011412
9.508450,46.011361
9.508726,46.011258
9.508891,46.011190
9.509084,46.011137
9.509366,46.011065
9.509651,46.011033
9.509891,46.011046
9.509993,46.011025
9.510150,46.011009
9.510335,46.011063
9.510458,46.011040
9.510717,46.010992
9.510938,46.011008
9.511376,46.011094
9.511618,46.011067
9.511856,46.011033
9.512128,46.011012
9.512301,46.010998
9.512527,46.010953
9.512766,46.010959
9.512879,46.010915
9.513045,46.010929
9.513271,46.010894
9.513454,46.010858
9.513736,46.010757
9.513994,46.010664
9.514206,46.010572
9.514305,46.010534
9.514355,46.010539
9.514445,46.010540
9.514565,46.010515
9.514592,46.010487
9.514682,46.010478
9.514813,46.010445
9.514964,46.010446
9.515122,46.010460
9.515249,46.010460
9.515362,46.010451
9.515459,46.010457
9.515630,46.010426
9.516017,46.010390
9.516274,46.010352
9.516454,46.010363
9.516888,46.010468
9.517075,46.010467
9.517181,46.010515
9.517387,46.010603
9.517558,46.010695
9.517685,46.010697
9.517859,46.010772
9.518043,46.010760
9.518109,46.010749
9.518315,46.010740
9.518606,46.010719
9.518806,46.010703
9.519012,46.010703
9.519212,46.010706
9.519444,46.010738
9.519559,46.010758
9.519650,46.010758
9.519625,46.010790
9.519866,46.010775
9.520028,46.010773
9.520156,46.010771
9.520291,46.010716
9.520369,46.010716
9.520438,46.010671
9.520510,46.010662
9.520605,46.010599
9.520741,46.010625
9.520897,46.010735
9.521023,46.010781
9.521362,46.010875
9.521329,46.010918
9.521327,46.010957
9.521430,46.010941
9.521739,46.010969
9.521961,46.011032
9.522169,46.011071
9.522268,46.011065
9.522265,46.011119
9.522369,46.011122
9.522385,46.011165
9.522474,46.011176
9.522435,46.011219
9.522608,46.011248
9.522787,46.011294
9.522799,46.011348
9.522757,46.011439
9.522819,46.011438
9.522805,46.011473
9.522941,46.011463
9.523044,46.011454
9.523095,46.011455
9.523068,46.011529
9.523141,46.011538
9.523134,46.011584
9.523251,46.011572
9.523295,46.011605
9.523521,46.011584
9.523677,46.011563
9.524305,46.011438
9.524342,46.011451
9.524312,46.011508
9.524372,46.011532
9.524326,46.011617
9.524523,46.011548
9.524592,46.011525
9.524627,46.011568
9.524587,46.011691
9.524741,46.011671
9.524771,46.011701
9.524718,46.011763
9.524918,46.011811
9.524955,46.011816
9.524794,46.011903
9.524868,46.012008
9.524866,46.012059
9.524964,46.012052
9.524887,46.012138
9.525047,46.012147
9.525202,46.012107
9.525369,46.012055
9.525640,46.011926
9.525799,46.011902
9.525896,46.011882
9.526100,46.011911
9.526165,46.011930
9.526215,46.011871
9.526340,46.011955
9.526418,46.011887
9.526546,46.011886
9.526590,46.011796
9.526954,46.011701
9.527283,46.011588
9.527389,46.011558
          </coordinates>
        </LineString>
      </Placemark>
    </Folder>
  </Document>
</kml>
