<?xml version='1.0' encoding='UTF-8'?>
<kml xmlns='http://www.opengis.net/kml/2.2'>
	<Document>
		<name>San Primo</name>
		<Placemark>
			<name>Parcheggio</name>
			<description><![CDATA[descrizione: <br>type: ]]></description>
			<styleUrl>#icon-1453</styleUrl>
			<ExtendedData>
				<Data name='descrizione'>
					<value></value>
				</Data>
				<Data name='type'>
					<value></value>
				</Data>
			</ExtendedData>
			<Point>
				<coordinates>9.22974,45.922858,1175.0</coordinates>
			</Point>
		</Placemark>
		<Placemark>
			<name>San Primo</name>
			<description><![CDATA[descrizione: <br>type: guidare]]></description>
			<styleUrl>#line-FF0000-4</styleUrl>
			<ExtendedData>
				<Data name='descrizione'>
					<value></value>
				</Data>
				<Data name='type'>
					<value>guidare</value>
				</Data>
			</ExtendedData>
			<LineString>
				<tessellate>1</tessellate>
				<coordinates>9.22974,45.922858,1175.0 9.229767,45.922839,1166.0 9.229955,45.922528,1156.0 9.229848,45.922559,1143.0 9.229824,45.922544,1146.0 9.229748,45.922485,1155.0 9.229744,45.922465,1156.0 9.229721,45.922385,1159.0 9.229704,45.922372,1160.0 9.229706,45.922288,1162.0 9.229707,45.922278,1162.0 9.22969,45.92223,1163.0 9.2297,45.92223,1164.0 9.229708,45.922221,1165.0 9.229773,45.92215,1166.0 9.229778,45.922137,1165.0 9.229831,45.922059,1169.0 9.229825,45.92204100000001,1170.0 9.229896,45.921974,1172.0 9.229901,45.921961,1172.0 9.229913,45.921879,1171.0 9.229919,45.921866,1170.0 9.229966,45.921787,1172.0 9.229957,45.921765,1172.0 9.229883000000001,45.921699000000004,1173.0 9.229863,45.921691,1174.0 9.229749,45.921686,1170.0 9.229727,45.921701,1168.0 9.229626,45.921723,1158.0 9.229593,45.92173,1158.0 9.229533,45.921688,1150.0 9.229508,45.921648,1150.0 9.229401,45.921605,1150.0 9.229382,45.921603,1151.0 9.22927,45.921572,1152.0 9.229248,45.921581,1152.0 9.229163,45.921642,1151.0 9.229149,45.921644,1150.0 9.229082,45.921684,1152.0 9.22908,45.921692,1152.0 9.229072,45.921692,1153.0 9.22906,45.921698,1153.0 9.229061,45.921705,1155.0 9.229045,45.921715,1155.0 9.228985,45.92179,1154.0 9.22897,45.921802,1154.0 9.228898,45.921867,1151.0 9.228881,45.921881,1150.0 9.228793,45.921927,1148.0 9.22877,45.921931,1147.0 9.228679,45.921978,1144.0 9.228658,45.92199,1143.0 9.228554,45.92204000000001,1142.0 9.228518,45.922032,1142.0 9.228406,45.922067,1144.0 9.228374,45.922075,1144.0 9.228251,45.922051,1140.0 9.228205,45.922014,1140.0 9.228159,45.922073,1140.0 9.228162,45.922117,1141.0 9.228056,45.922144,1141.0 9.228030000000002,45.922139,1141.0 9.227914,45.922157,1141.0 9.227904,45.922161,1141.0 9.22779,45.922161,1139.0 9.227773,45.922154,1139.0 9.227651,45.922174000000005,1141.0 9.227634,45.922174000000005,1141.0 9.227514,45.922202,1146.0 9.227485,45.922208,1146.0 9.227361,45.922207,1144.0 9.227345,45.922207,1143.0 9.227242,45.922233,1146.0 9.227212,45.922239,1145.0 9.227132000000001,45.922275,1145.0 9.227091,45.922272,1145.0 9.226994,45.922217,1146.0 9.226967,45.922218,1147.0 9.226849,45.922214,1152.0 9.226826,45.922226,1155.0 9.226708,45.922237,1158.0 9.226693,45.922263,1161.0 9.226614,45.922212,1159.0 9.226573,45.922212,1159.0 9.226457,45.922183,1163.0 9.226423,45.922176,1164.0 9.226361,45.922099,1163.0 9.226349,45.92208600000001,1163.0 9.226233,45.922122,1163.0 9.226211,45.92212,1163.0 9.226111,45.922156,1164.0 9.226072,45.92217000000001,1165.0 9.225955,45.922192,1163.0 9.225935,45.922189,1162.0 9.225825,45.922157,1164.0 9.225807,45.922147,1161.0 9.225763,45.922069,1160.0 9.225746,45.922055,1160.0 9.225677,45.921982,1162.0 9.225673,45.921968,1162.0 9.225564,45.921954,1164.0 9.225536,45.921943,1162.0 9.225429,45.921922,1157.0 9.225397,45.921918,1157.0 9.225296,45.921863,1161.0 9.225268,45.921876,1159.0 9.225158,45.921841,1158.0 9.225127,45.921819,1159.0 9.225061,45.921767,1157.0 9.22506,45.921741000000004,1157.0 9.225003,45.921672,1158.0 9.224979,45.921664,1159.0 9.224867,45.921639,1157.0 9.22485,45.921623,1158.0 9.224774,45.921566000000006,1160.0 9.224758,45.921549,1161.0 9.224677,45.921481,1164.0 9.224668,45.92147700000001,1165.0 9.224592,45.921415,1162.0 9.224589,45.921419,1163.0 9.224582,45.921417,1163.0 9.224479,45.921368,1168.0 9.224466,45.92137,1169.0 9.224377,45.921314,1163.0 9.22436,45.921313,1163.0 9.224249,45.92129,1169.0 9.224234,45.921282,1170.0 9.22413,45.921263,1163.0 9.224118,45.921241,1163.0 9.223992,45.92123,1170.0 9.223974,45.921225,1170.0 9.223865,45.921214,1169.0 9.223826,45.92117,1169.0 9.22371,45.921179,1167.0 9.223679,45.921189,1165.0 9.223553,45.921176,1162.0 9.223537,45.921198,1160.0 9.223422,45.921198,1160.0 9.223391,45.92119,1160.0 9.22328,45.921168,1162.0 9.223257,45.921158,1162.0 9.223188,45.921191,1162.0 9.223139,45.921201,1161.0 9.223036,45.921187,1159.0 9.223012,45.921166,1159.0 9.222886,45.921155,1159.0 9.222877,45.921143,1159.0 9.222768,45.921171,1159.0 9.222752,45.921184,1159.0 9.222771,45.92125,1160.0 9.22278,45.92128,1162.0 9.222761,45.921296,1161.0 9.222759,45.921295,1160.0 9.222738,45.921309,1159.0 9.222641,45.921354,1158.0 9.222629,45.92136,1158.0 9.22254,45.921421,1160.0 9.222535,45.921425,1159.0 9.222424,45.921395000000004,1161.0 9.2224,45.921395000000004,1162.0 9.22229,45.921407,1162.0 9.222262,45.921408,1164.0 9.222174,45.921473,1167.0 9.222166,45.921475,1168.0 9.22208,45.921541,1170.0 9.222065,45.92155,1169.0 9.222016,45.92163,1167.0 9.221984,45.921627,1166.0 9.221864,45.921651,1163.0 9.22184,45.92165200000001,1163.0 9.22176,45.921718,1163.0 9.221735,45.921723,1163.0 9.221622,45.92176,1165.0 9.221611,45.921785,1166.0 9.221502,45.921813,1166.0 9.221481,45.921816,1166.0 9.221372,45.92185,1166.0 9.221355,45.921858,1166.0 9.221316,45.921927,1165.0 9.221302,45.921957000000006,1163.0 9.221248,45.922028,1161.0 9.221221,45.922038,1161.0 9.221174,45.922118,1156.0 9.221157,45.922129000000005,1157.0 9.221133,45.922206,1157.0 9.221114,45.922217,1158.0 9.221097,45.922297,1159.0 9.221086,45.922318,1158.0 9.221011,45.922389,1155.0 9.221003,45.92239000000001,1154.0 9.22088,45.922416,1155.0 9.220856,45.922427,1156.0 9.220754,45.922467,1156.0 9.22074,45.922475,1156.0 9.220663,45.922539,1157.0 9.220633,45.92253,1158.0 9.220542,45.922586,1164.0 9.220522,45.922584,1165.0 9.220411,45.92262,1170.0 9.220403,45.922624,1170.0 9.220356,45.922692,1172.0 9.220353,45.922709,1170.0 9.220252,45.922743,1170.0 9.220223,45.922747,1169.0 9.220126,45.922788,1167.0 9.220108,45.922804,1165.0 9.220005,45.922856,1166.0 9.219999,45.922858,1165.0 9.219988,45.922946,1170.0 9.219987,45.922964,1170.0 9.219975,45.923034,1171.0 9.219962,45.923057,1172.0 9.219925,45.923141,1174.0 9.219919,45.923154,1174.0 9.219901,45.923232,1178.0 9.219904,45.923255,1179.0 9.219871,45.923324,1180.0 9.219841,45.923355,1180.0 9.219852,45.92334100000001,1181.0 9.219843000000001,45.92334000000001,1181.0 9.219851,45.923348,1182.0 9.219832,45.923436,1181.0 9.219831,45.923451,1182.0 9.219781,45.923518,1180.0 9.219759,45.923526,1177.0 9.219682,45.923591,1179.0 9.219679,45.923609,1179.0 9.219659,45.923695,1186.0 9.219651,45.9237,1186.0 9.219581,45.923771,1186.0 9.219578,45.923778,1188.0 9.21956,45.923848,1189.0 9.219524,45.923894,1187.0 9.219451,45.923967,1179.0 9.219458,45.923987,1182.0 9.219419,45.924055,1185.0 9.21941,45.924081,1185.0 9.219366,45.924163,1187.0 9.219352,45.92417,1187.0 9.219344,45.924219,1188.0 9.219352,45.924232,1187.0 9.219345,45.924242,1188.0 9.219257000000002,45.924303,1191.0 9.219249,45.924302,1192.0 9.21921,45.92438200000001,1193.0 9.219221,45.924376,1194.0 9.219194,45.924383000000006,1194.0 9.219162,45.924399,1194.0 9.219052000000001,45.92444,1199.0 9.219057,45.924464,1201.0 9.219,45.924541,1196.0 9.218911,45.92451100000001,1196.0 9.218908,45.924539,1195.0 9.218896,45.924532,1195.0 9.218887,45.92453,1195.0 9.218795,45.924475,1197.0 9.21877,45.924463,1198.0 9.218785,45.92454,1206.0 9.218773,45.924556,1206.0 9.21881,45.924639,1203.0 9.218813,45.924644,1202.0 9.218769,45.924721,1203.0 9.218755,45.924738,1204.0 9.21868,45.924807,1206.0 9.218696,45.924828,1206.0 9.218641,45.92489900000001,1210.0 9.218625,45.924911,1211.0 9.21858,45.924994,1214.0 9.218577,45.925004,1215.0 9.218524,45.925079,1216.0 9.218521,45.925104,1217.0 9.218499,45.925189,1216.0 9.218483,45.925202,1217.0 9.218435,45.92528,1218.0 9.218435,45.925292000000006,1220.0 9.218358000000002,45.925358,1223.0 9.218349,45.925364,1222.0 9.218265,45.925426,1221.0 9.218261000000002,45.925431,1222.0 9.218209,45.92551,1227.0 9.218207000000001,45.925517,1226.0 9.218195,45.925603,1226.0 9.218195,45.925619,1227.0 9.218149,45.925698,1230.0 9.218143,45.925705,1230.0 9.218112,45.92578,1235.0 9.218103,45.925794,1234.0 9.218092,45.925874,1236.0 9.218093,45.925887,1236.0 9.218049,45.925963,1237.0 9.218043,45.925977,1236.0 9.217961,45.926019,1239.0 9.217938,45.926033,1240.0 9.217822,45.926034,1239.0 9.217805,45.926037,1238.0 9.217706,45.92608,1234.0 9.217687000000002,45.926081,1234.0 9.217711,45.926089,1235.0 9.217714,45.926085,1235.0 9.217718,45.92609,1236.0 9.21772,45.926084,1235.0 9.217739,45.926074,1233.0 9.21774,45.926069,1233.0 9.217736,45.92607000000001,1234.0 9.217739,45.926076,1234.0 9.217742,45.926075,1234.0 9.217735,45.926098,1236.0 9.217723,45.926103,1235.0 9.217761,45.926099,1231.0 9.217764,45.926096,1231.0 9.217769,45.926101,1232.0 9.217751,45.9261,1233.0 9.217778,45.926089,1231.0 9.217777,45.92608,1231.0 9.217777,45.926077,1231.0 9.217784,45.926082,1231.0 9.217824,45.926082,1229.0 9.217825,45.926083,1229.0 9.217822,45.926089,1229.0 9.217806,45.92608,1230.0 9.217801,45.926087,1229.0 9.217796,45.926087,1229.0 9.217912,45.926108,1233.0 9.217925,45.92611300000001,1233.0 9.218023,45.926074,1234.0 9.218036,45.926065,1234.0 9.218098,45.925997,1235.0 9.218101,45.92598400000001,1235.0 9.218152,45.925911,1237.0 9.218147,45.925899,1237.0 9.218167,45.925816,1236.0 9.21817,45.925806,1235.0 9.218201,45.92572400000001,1230.0 9.21819,45.925711,1230.0 9.21819,45.925634,1229.0 9.218189,45.925619,1229.0 9.218183,45.9256,1230.0 9.218184,45.925596000000006,1229.0 9.21818,45.925597,1230.0 9.218119,45.92552,1231.0 9.218117,45.92550800000001,1231.0 9.218064,45.925428,1230.0 9.218052,45.925417,1230.0 9.218008,45.925336,1228.0 9.217996,45.925322,1227.0 9.217946,45.92524900000001,1228.0 9.217942,45.92524,1228.0 9.217959,45.925164,1229.0 9.217962,45.925147,1229.0 9.217977,45.925064,1232.0 9.217984,45.925037,1232.0 9.217973,45.924956,1230.0 9.217968000000003,45.924939,1229.0 9.217953,45.924855,1232.0 9.217938,45.924846,1232.0 9.217909,45.924759,1232.0 9.217899,45.924744,1233.0 9.217845,45.924673,1235.0 9.217819,45.92467,1234.0 9.21775,45.924597,1237.0 9.217734,45.924586,1236.0 9.217626,45.924549,1238.0 9.217607,45.924544,1238.0 9.21755,45.924474,1238.0 9.217544,45.924464,1237.0 9.217453,45.924414,1237.0 9.217443,45.924402,1237.0 9.217379,45.924327,1237.0 9.217377,45.924314,1238.0 9.217352,45.924226,1239.0 9.217352,45.924217,1239.0 9.2173,45.924135,1240.0 9.217301,45.924128,1239.0 9.217231,45.924052,1238.0 9.217221000000002,45.924047,1238.0 9.217168,45.923976,1239.0 9.217155,45.923967,1239.0 9.21708,45.92391,1242.0 9.217071,45.923898,1242.0 9.216997,45.923829,1242.0 9.216997,45.923818,1242.0 9.21701,45.923734,1245.0 9.217017,45.923721,1246.0 9.216994000000001,45.923637,1249.0 9.216991,45.923629,1250.0 9.216983,45.92355,1250.0 9.216981,45.923536,1251.0 9.216967,45.923447,1252.0 9.216966,45.923435,1252.0 9.216876,45.923375,1250.0 9.216868,45.923364,1250.0 9.216787,45.923305,1257.0 9.216742,45.923294,1256.0 9.21666,45.923227,1260.0 9.216654,45.923217,1260.0 9.216556,45.923165,1265.0 9.216544,45.923157,1265.0 9.216456,45.923094,1268.0 9.216446,45.92308,1268.0 9.216339,45.923035,1274.0 9.216321,45.923028,1274.0 9.216196,45.923006,1279.0 9.216186,45.922996000000005,1280.0 9.216077,45.922986,1279.0 9.21606,45.922976,1279.0 9.215939,45.922978,1282.0 9.21592,45.922979,1282.0 9.215953,45.922966,1285.0 9.215956,45.922959,1285.0 9.215953,45.922959,1286.0 9.215959,45.92296,1287.0 9.216061,45.922915,1287.0 9.216073000000002,45.922912000000004,1287.0 9.216185,45.922886,1284.0 9.216202,45.922884,1285.0 9.216300000000002,45.922851,1284.0 9.216314,45.922838,1283.0 9.216425,45.922808,1287.0 9.216436,45.922793,1288.0 9.216555,45.922761,1287.0 9.216568,45.922756,1287.0 9.216674,45.922709,1289.0 9.216696,45.922706,1287.0 9.216781,45.922641,1287.0 9.216786,45.922632,1287.0 9.216872,45.922574,1288.0 9.216891,45.922563,1288.0 9.216824,45.922498,1295.0 9.216802,45.922493,1295.0 9.216689,45.922461,1297.0 9.216677,45.922454,1299.0 9.216576,45.922417,1299.0 9.216566,45.922403,1298.0 9.216493,45.92235,1299.0 9.216457,45.922329,1300.0 9.216345,45.922288,1303.0 9.216292,45.922306,1307.0 9.216193,45.92225,1314.0 9.216187,45.92225,1314.0 9.216066,45.92223,1317.0 9.216053,45.92223,1317.0 9.215948,45.922179,1317.0 9.215937,45.922177,1318.0 9.215826,45.922139,1322.0 9.215826,45.92212800000001,1323.0 9.215743,45.922079,1333.0 9.215717,45.922072,1333.0 9.215722,45.922069,1335.0 9.215722,45.922077,1335.0 9.215709,45.922084,1331.0 9.215716,45.92208600000001,1331.0 9.215733,45.922004,1333.0 9.215728,45.921987,1334.0 9.215771,45.921906,1335.0 9.215761,45.921887,1334.0 9.215778,45.921848,1337.0 9.215771,45.921847,1338.0 9.215764,45.921841,1338.0 9.215723,45.921761,1340.0 9.215719,45.921753,1340.0 9.215656,45.921675,1348.0 9.215654,45.921672,1347.0 9.215701,45.921603,1350.0 9.215701,45.921576,1351.0 9.215593,45.921529,1354.0 9.21557,45.921534,1353.0 9.215454,45.921497,1358.0 9.215446,45.921487,1358.0 9.215326000000001,45.921489,1361.0 9.215313,45.921488,1361.0 9.215197,45.92147800000001,1364.0 9.215167,45.921451,1361.0 9.215057,45.921409,1368.0 9.215053,45.921405,1369.0 9.214962,45.921344,1370.0 9.214947,45.921335,1371.0 9.214848,45.921278,1375.0 9.214854,45.921268,1375.0 9.214783,45.92123,1381.0 9.214769,45.921225,1380.0 9.214736,45.921172,1380.0 9.214727,45.921161,1381.0 9.214656,45.921095,1383.0 9.214631,45.921092,1382.0 9.214556,45.921031,1385.0 9.214536,45.921027,1384.0 9.214465,45.920977,1391.0 9.21446,45.920969,1391.0 9.214394000000002,45.920922,1391.0 9.214378,45.920906,1391.0 9.21429,45.920886,1394.0 9.21425,45.920868,1392.0 9.214221,45.920859,1389.0 9.21421,45.920848,1389.0 9.214196,45.920844,1391.0 9.214152,45.92084,1405.0 9.214142,45.920835,1406.0 9.214125,45.920836,1406.0 9.213998,45.920824,1405.0 9.21399,45.920816,1405.0 9.213968,45.920806,1406.0 9.213955,45.920797,1405.0 9.213917,45.920788,1406.0 9.21383,45.920727,1414.0 9.213825,45.920731,1414.0 9.21377,45.920726,1414.0 9.213762,45.920717,1415.0 9.213675,45.920676,1418.0 9.21366,45.920658,1417.0 9.213599,45.920596,1425.0 9.213569,45.920577,1425.0 9.213485,45.920517,1426.0 9.213472,45.920506,1426.0 9.2134,45.920491,1426.0 9.213399,45.9205,1425.0 9.213405,45.92047,1426.0 9.2134,45.920454,1427.0 9.21337,45.920369,1434.0 9.213354000000002,45.920345,1434.0 9.213349,45.920297,1438.0 9.213322000000002,45.92029,1438.0 9.213306,45.920244,1440.0 9.213311,45.92022300000001,1439.0 9.213276,45.920232,1440.0 9.213259,45.920228,1440.0 9.213245,45.920214,1440.0 9.213175,45.920169,1439.0 9.213134,45.920156,1438.0 9.21303,45.920106,1437.0 9.213014,45.920105,1437.0 9.21292,45.920057,1437.0 9.212905,45.920046,1438.0 9.212908,45.920025,1441.0 9.212899,45.92003,1442.0 9.21288,45.920036,1445.0 9.212866,45.920039,1444.0 9.212792,45.919965000000005,1444.0 9.212784,45.919956,1446.0 9.212728,45.919896,1449.0 9.212705,45.919895,1451.0 9.212664,45.91987700000001,1455.0 9.212647,45.919872,1455.0 9.212537,45.919867,1453.0 9.2125,45.919864,1452.0 9.212483,45.919842,1454.0 9.212469,45.919835,1454.0 9.212465,45.919817,1453.0 9.212367,45.919762,1461.0 9.212354,45.919751,1461.0 9.212351,45.919738,1462.0 9.212356,45.919743,1460.0 9.212357,45.91974400000001,1461.0 9.212338,45.919739,1461.0 9.212227,45.919712,1466.0 9.212215,45.919698,1466.0 9.212198,45.919684,1469.0 9.212198,45.919677,1470.0 9.212107,45.919617,1474.0 9.212103,45.919601,1475.0 9.21204,45.919524,1478.0 9.212044,45.919512,1478.0 9.21202,45.919429,1480.0 9.212014,45.919422,1480.0 9.211976,45.919351,1485.0 9.211965,45.91935,1484.0 9.211981,45.919341,1485.0 9.211978,45.919312,1485.0 9.211919,45.919236,1493.0 9.211898,45.919224,1493.0 9.211885,45.919144,1494.0 9.211885,45.919128,1494.0 9.211791,45.919067,1497.0 9.211794,45.919063,1496.0 9.211742,45.918989,1499.0 9.211723,45.918985,1500.0 9.211606,45.918958,1499.0 9.211596,45.918945,1499.0 9.211606,45.918938,1501.0 9.211612,45.91892300000001,1501.0 9.211599,45.918875,1506.0 9.21159,45.918871,1504.0 9.211591,45.918849,1507.0 9.21158,45.918842,1506.0 9.211519,45.918763,1514.0 9.211512,45.918758,1515.0 9.211477,45.918714,1515.0 9.211468,45.918724,1516.0 9.211464,45.918715,1518.0 9.211461,45.918701,1520.0 9.211412,45.918625,1523.0 9.211401,45.918616,1522.0 9.211366,45.918533,1525.0 9.211353,45.91853,1525.0 9.211237,45.918496,1524.0 9.211225,45.918497,1523.0 9.211116,45.918523,1520.0 9.211097,45.918524,1520.0 9.210977,45.918511,1527.0 9.210968,45.918501,1528.0 9.2109,45.918425,1532.0 9.210894,45.918418,1533.0 9.210857,45.918333,1542.0 9.210845,45.918333,1541.0 9.210816,45.918315,1546.0 9.210814,45.91831400000001,1546.0 9.210818,45.918305,1547.0 9.210791,45.918217,1554.0 9.210791,45.918215,1554.0 9.210731,45.918145,1554.0 9.210725,45.918132,1555.0 9.210679,45.918114,1556.0 9.210671,45.918115,1557.0 9.210667,45.918113,1558.0 9.210621,45.918036,1565.0 9.21062,45.918028,1565.0 9.210585,45.91797,1567.0 9.210581,45.917967,1568.0 9.210584,45.917967,1568.0 9.21057,45.917961,1568.0 9.210531,45.917905,1575.0 9.21052,45.917904,1576.0 9.210522,45.91788100000001,1576.0 9.210512,45.917876,1577.0 9.210481,45.917853,1577.0 9.210483,45.917853,1578.0 9.210477,45.917841,1580.0 9.210462,45.917841,1580.0 9.210437,45.917759,1587.0 9.210421,45.917743,1587.0 9.210371,45.917669000000004,1588.0 9.210361,45.917651,1588.0 9.210412,45.917577,1594.0 9.210414,45.917561,1594.0 9.210415,45.917562,1595.0 9.210418,45.917557,1595.0 9.210411,45.917547,1596.0 9.210412,45.917548,1598.0 9.210381,45.91747,1605.0 9.210369,45.917461,1605.0 9.210364,45.917464,1605.0 9.210359,45.917463,1605.0 9.210352,45.917454,1604.0 9.210356,45.917442,1605.0 9.210307,45.917388,1610.0 9.210300000000002,45.917391,1611.0 9.210291,45.917384,1611.0 9.210289,45.917377,1612.0 9.210352,45.917306,1622.0 9.210367,45.917301,1623.0 9.210463,45.917247,1624.0 9.210473000000002,45.917237,1624.0 9.21048,45.917219,1624.0 9.210483,45.917216,1624.0 9.210463,45.917198,1624.0 9.210453,45.917157,1627.0 9.210456,45.917153,1627.0 9.210467,45.91714700000001,1629.0 9.210474,45.917142,1629.0 9.210503,45.917087,1630.0 9.210503,45.917089,1630.0 9.210502,45.917083,1630.0 9.210502,45.917076,1630.0 9.210496,45.917068,1631.0 9.210499,45.917068,1631.0 9.210502,45.917071,1631.0 9.210498,45.917065,1631.0 9.210414,45.916998,1636.0 9.21041,45.916992,1637.0 9.210297,45.916949,1644.0 9.210292,45.916946,1644.0 9.210232,45.91692900000001,1643.0 9.210234,45.916932,1644.0 9.210227,45.91693000000001,1644.0 9.210221,45.916927,1644.0 9.210194,45.916905,1651.0 9.210189,45.916902,1651.0 9.210179,45.916893,1651.0 9.210176,45.916887,1651.0 9.210176,45.91688800000001,1652.0 9.210174,45.91688400000001,1652.0 9.210144,45.916841,1658.0 9.210149000000001,45.916837,1658.0 9.210171,45.916833,1659.0 9.210094,45.916761,1660.0 9.210089,45.916760000000004,1661.0 9.210051000000002,45.916741,1663.0 9.210045,45.91674,1663.0 9.210034,45.916735,1662.0 9.210031,45.916695,1663.0 9.210032,45.916693,1663.0 9.210029000000002,45.916682,1663.0 9.210033,45.916631,1669.0 9.210032,45.916634,1669.0 9.210032,45.91662500000001,1669.0 9.209925,45.91661,1671.0 9.209931,45.916616,1671.0 9.209914,45.916614,1671.0 9.209814,45.916573,1675.0 9.20981,45.916575,1675.0 9.209807,45.91657,1675.0 9.209823,45.916484,1679.0 9.209824000000001,45.916476,1680.0 9.209824000000001,45.916391,1684.0 9.209838,45.916386,1684.0 9.209828,45.916376,1685.0 9.209824000000001,45.916375,1684.0 9.209823,45.916377,1684.0 9.209829,45.916375,1684.0 9.209716,45.916396,1688.0 9.209702,45.916397,1688.0 9.209675,45.91639,1689.0 9.209671,45.916392,1689.0 9.209659,45.916389,1689.0 9.209654,45.916383,1690.0 9.209652,45.916384,1690.0 9.209647,45.916373,1691.0 9.209637,45.916365,1694.0 9.20963,45.91636700000001,1694.0 9.209629000000001,45.916373,1695.0 9.209593,45.916355,1695.0 9.209592,45.916354,1696.0 9.209596,45.916361,1696.0 9.209488,45.916325,1699.0 9.209474,45.916313,1699.0 9.209354,45.916283,1706.0 9.20935,45.91628000000001,1707.0 9.209227,45.916272,1714.0 9.209214,45.916275,1713.0 9.209099,45.916242,1710.0 9.209076,45.916244,1711.0 9.209112,45.916165,1717.0 9.209124,45.916159,1717.0 9.209213,45.916102,1720.0 9.209217,45.91609,1719.0 9.209291,45.916026,1721.0 9.209304000000001,45.91602,1722.0 9.209355,45.915959,1725.0 9.20937,45.915932,1725.0 9.209413,45.915859,1725.0 9.209438,45.91584600000001,1726.0 9.209487,45.915777,1728.0 9.209505,45.915760000000006,1729.0 9.209558,45.915697,1728.0 9.20957,45.915669,1727.0 9.209642,45.915599,1729.0 9.209642,45.915593,1730.0 9.209714,45.91553,1731.0 9.209735,45.915513,1730.0 9.209836,45.915459000000006,1734.0 9.209841,45.91545500000001,1734.0 9.209921,45.915398,1734.0 9.209945,45.915389,1735.0 9.210066,45.915372000000005,1729.0 9.210081,45.91536700000001,1729.0 9.210151,45.91532600000001,1726.0 9.210148000000002,45.915330000000004,1725.0 9.210156,45.915332,1723.0 9.210165,45.915332,1724.0 9.210161,45.91534,1724.0 9.210152,45.915337,1724.0 9.210149000000001,45.915330000000004,1725.0 9.210149000000001,45.915329,1725.0 9.210174,45.915328,1723.0 9.210179,45.915329,1724.0 9.210191,45.915321,1724.0 9.210141,45.915312,1711.0 9.210141,45.915309,1712.0 9.210144,45.915309,1714.0 9.210146,45.915308,1715.0 9.210152,45.915318,1716.0 9.210143,45.915309,1717.0 9.210141,45.915313,1723.0 9.210141,45.91531,1723.0 9.210149000000001,45.915312,1723.0</coordinates>
			</LineString>
		</Placemark>
		<Placemark>
			<name>Monte San Primo</name>
			<description><![CDATA[descrizione: Creato con Google My Tracks su Android<br><br>Nome: San Primo<br>Tipo di attività: guidare<br>Descrizione: -<br>Distanza totale: 3,39 km (2,1 mi)<br>Tempo totale: 1:43:26<br>Tempo di spostamento: 1:05:41<br>Velocità media: 1,96 km/h (1,2 mi/h)<br>Velocità di spostamento media: 3,09 km/h (1,9 mi/h)<br>Velocità massima: 16,16 km/h (10,0 mi/h)<br>Ritmo medio: 30:32 min/km (49:09 min/mi)<br>Ritmo di spostamento medio: 19:23 min/km (31:12 min/mi)<br>Ritmo più rapido: 3:43 min/km (5:58 min/mi)<br>Altitudine max: 1728 m (5669 ft)<br>Altitudine min: 1142 m (3748 ft)<br>Dislivello: 606 m (1987 ft)<br>Pendenza massima: 33 %<br>Pendenza minima: -19 %<br>Registrato: 29/8/2015 11:09<br>type: ]]></description>
			<styleUrl>#icon-1377</styleUrl>
			<ExtendedData>
				<Data name='descrizione'>
					<value>Creato con Google My Tracks su Android

Nome: San Primo
Tipo di attività: guidare
Descrizione: -
Distanza totale: 3,39 km (2,1 mi)
Tempo totale: 1:43:26
Tempo di spostamento: 1:05:41
Velocità media: 1,96 km/h (1,2 mi/h)
Velocità di spostamento media: 3,09 km/h (1,9 mi/h)
Velocità massima: 16,16 km/h (10,0 mi/h)
Ritmo medio: 30:32 min/km (49:09 min/mi)
Ritmo di spostamento medio: 19:23 min/km (31:12 min/mi)
Ritmo più rapido: 3:43 min/km (5:58 min/mi)
Altitudine max: 1728 m (5669 ft)
Altitudine min: 1142 m (3748 ft)
Dislivello: 606 m (1987 ft)
Pendenza massima: 33 %
Pendenza minima: -19 %
Registrato: 29/8/2015 11:09</value>
				</Data>
				<Data name='type'>
					<value></value>
				</Data>
			</ExtendedData>
			<Point>
				<coordinates>9.210149000000001,45.915312,1723.0</coordinates>
			</Point>
		</Placemark>
		<Style id='icon-1377-normal'>
			<IconStyle>
				<scale>1.1</scale>
				<Icon>
					<href>http://www.gstatic.com/mapspro/images/stock/1377-rec-mountain.png</href>
				</Icon>
			</IconStyle>
			<LabelStyle>
				<scale>0.0</scale>
			</LabelStyle>
		</Style>
		<Style id='icon-1377-highlight'>
			<IconStyle>
				<scale>1.1</scale>
				<Icon>
					<href>http://www.gstatic.com/mapspro/images/stock/1377-rec-mountain.png</href>
				</Icon>
			</IconStyle>
			<LabelStyle>
				<scale>1.1</scale>
			</LabelStyle>
		</Style>
		<StyleMap id='icon-1377'>
			<Pair>
				<key>normal</key>
				<styleUrl>#icon-1377-normal</styleUrl>
			</Pair>
			<Pair>
				<key>highlight</key>
				<styleUrl>#icon-1377-highlight</styleUrl>
			</Pair>
		</StyleMap>
		<Style id='icon-1453-normal'>
			<IconStyle>
				<scale>1.1</scale>
				<Icon>
					<href>http://www.gstatic.com/mapspro/images/stock/1453-trans-parking.png</href>
				</Icon>
			</IconStyle>
			<LabelStyle>
				<scale>0.0</scale>
			</LabelStyle>
		</Style>
		<Style id='icon-1453-highlight'>
			<IconStyle>
				<scale>1.1</scale>
				<Icon>
					<href>http://www.gstatic.com/mapspro/images/stock/1453-trans-parking.png</href>
				</Icon>
			</IconStyle>
			<LabelStyle>
				<scale>1.1</scale>
			</LabelStyle>
		</Style>
		<StyleMap id='icon-1453'>
			<Pair>
				<key>normal</key>
				<styleUrl>#icon-1453-normal</styleUrl>
			</Pair>
			<Pair>
				<key>highlight</key>
				<styleUrl>#icon-1453-highlight</styleUrl>
			</Pair>
		</StyleMap>
		<Style id='line-FF0000-4-normal'>
			<LineStyle>
				<color>ff0000FF</color>
				<width>4</width>
			</LineStyle>
		</Style>
		<Style id='line-FF0000-4-highlight'>
			<LineStyle>
				<color>ff0000FF</color>
				<width>6.0</width>
			</LineStyle>
		</Style>
		<StyleMap id='line-FF0000-4'>
			<Pair>
				<key>normal</key>
				<styleUrl>#line-FF0000-4-normal</styleUrl>
			</Pair>
			<Pair>
				<key>highlight</key>
				<styleUrl>#line-FF0000-4-highlight</styleUrl>
			</Pair>
		</StyleMap>
	</Document>
</kml>