<?xml version='1.0' encoding='UTF-8'?>
<kml xmlns='http://www.opengis.net/kml/2.2'>
	<Document>
		<name>Percorso</name>
		<Placemark>
			<name>Parcheggio</name>
			<styleUrl>#icon-1453-nodesc</styleUrl>
			<Point>
				<coordinates>8.902294,46.05337,990.0</coordinates>
			</Point>
		</Placemark>
		<Placemark>
			<name>Segmento 1</name>
			<styleUrl>#line-DB4436-2-nodesc</styleUrl>
			<LineString>
				<tessellate>1</tessellate>
				<coordinates>8.902294,46.05337,990.0 8.902405,46.053398,985.0 8.902416,46.05341,984.0 8.902505,46.053453,984.0 8.90253,46.053462,984.0 8.902608,46.053519,983.0 8.902627,46.053531,982.0 8.902724,46.053565,984.0 8.902744,46.053581,985.0 8.90281,46.053649,985.0 8.902813,46.053661,984.0 8.902779,46.053729,983.0 8.902765,46.053745,982.0 8.902711,46.053826,978.0 8.902719,46.053841,978.0 8.90264,46.053902,976.0 8.902626,46.05391,975.0 8.902581,46.053983,976.0 8.902599,46.054,977.0 8.902536,46.054078,977.0 8.902513,46.054097,978.0 8.902495,46.054181,985.0 8.902482,46.054186,986.0 8.902458,46.054251,987.0 8.902447,46.054274,984.0 8.902384,46.054339,983.0 8.902377,46.054362,983.0 8.902421,46.054445,990.0 8.902389,46.054457,988.0 8.902375,46.054544,989.0 8.902376,46.054546,990.0 8.902253,46.054536,989.0 8.902241,46.054527,989.0 8.902217,46.054468,988.0 8.902214,46.054482,989.0 8.902194,46.054464,989.0 8.902179,46.054389,991.0 8.902184,46.05437,991.0 8.902127,46.054313,991.0 8.902083,46.054289,991.0 8.902055,46.054217,995.0 8.90205,46.054199,995.0 8.902008,46.054128,998.0 8.902005,46.054104,998.0 8.901981,46.054031,1002.0 8.901969,46.054012,1003.0 8.901918,46.053932,1006.0 8.901909,46.053913,1007.0 8.901838,46.053845,1014.0 8.901832,46.053829,1014.0 8.901758,46.05376,1012.0 8.901739,46.053759,1011.0 8.901648,46.053705,1016.0 8.901601,46.053694,1017.0 8.901527,46.053638,1015.0 8.901516,46.05362,1016.0 8.901417,46.053601,1017.0 8.901389,46.053591,1017.0 8.901334,46.053542,1023.0 8.90133,46.053509,1025.0 8.90126,46.053468,1026.0 8.901195,46.053491,1027.0 8.901108,46.05343,1028.0 8.901105,46.053417,1029.0 8.901065,46.053351,1031.0 8.901027,46.053335,1032.0 8.900939,46.053276,1034.0 8.900916,46.05327,1033.0 8.900831,46.053209,1033.0 8.900817,46.053201,1033.0 8.900739,46.053153,1032.0 8.900727,46.053136,1034.0 8.900626,46.053097,1036.0 8.900604,46.053093,1037.0 8.900481,46.053068,1037.0 8.900463,46.053055,1037.0 8.90038,46.053001,1042.0 8.90036,46.052985,1043.0 8.900248,46.052958,1044.0 8.900233,46.052949,1045.0 8.900145,46.052909,1046.0 8.900121,46.052899,1047.0 8.900006,46.052858,1048.0 8.899995,46.052854,1047.0 8.899933,46.052789,1049.0 8.899894,46.052796,1048.0 8.899781,46.05277,1050.0 8.899778,46.052742,1051.0 8.899667,46.052726,1052.0 8.899649,46.05272,1051.0 8.899529,46.05269,1043.0 8.899513,46.052682,1042.0 8.899415,46.052635,1049.0 8.899382,46.05263,1048.0 8.899267,46.052631,1046.0 8.899235,46.052627,1046.0 8.899118,46.052646,1047.0 8.899072,46.05262,1046.0 8.899054,46.052547,1055.0 8.899019,46.052534,1055.0 8.898949,46.052475,1057.0 8.898944,46.052449,1059.0 8.898833,46.052464,1059.0 8.898805,46.052472,1059.0 8.898733,46.052401,1062.0 8.898736,46.052392,1062.0 8.898618,46.052363,1063.0 8.898594,46.052354,1065.0 8.898569,46.05243,1065.0 8.898587,46.052444,1064.0 8.898677,46.0525,1061.0 8.898705,46.052497,1061.0 8.898789,46.052555,1062.0 8.898804,46.052558,1061.0 8.898881,46.052606,1062.0 8.8989,46.052621,1061.0 8.898963,46.052692,1060.0 8.898966,46.052704,1060.0 8.899037,46.052775,1060.0 8.899041,46.052783,1059.0 8.899106,46.052857,1058.0 8.899122,46.052865,1058.0 8.89921,46.052928,1058.0 8.899224,46.052937,1059.0 8.899313,46.052998,1061.0 8.899318,46.053005,1061.0 8.899362,46.053072,1059.0 8.89938,46.053087,1059.0 8.899459,46.053142,1061.0 8.899472,46.053153,1061.0 8.899502,46.053233,1059.0 8.899524,46.053243,1060.0 8.899579,46.053311,1059.0 8.899593,46.053321,1060.0 8.899654,46.053399,1062.0 8.899661,46.053409,1062.0 8.899687,46.053489,1063.0 8.899701,46.053498,1064.0 8.899727,46.053577,1064.0 8.899725,46.053587,1063.0 8.899788,46.053654,1064.0 8.899798,46.053665,1064.0 8.899822,46.053745,1067.0 8.899813,46.053756,1066.0 8.899804,46.053844,1065.0 8.899812,46.053854,1066.0 8.899857,46.053935,1068.0 8.89986,46.053944,1069.0 8.899902,46.054019,1070.0 8.899913,46.054032,1070.0 8.899959,46.054105,1070.0 8.899959,46.054117,1070.0 8.899979,46.05419,1068.0 8.899995,46.054205,1068.0 8.900042,46.05428,1066.0 8.900035,46.054291,1066.0 8.9001,46.054366,1067.0 8.900096,46.054377,1067.0 8.90011,46.054465,1069.0 8.900118,46.05447,1069.0 8.90011,46.054551,1069.0 8.900111,46.054563,1069.0 8.900145,46.054648,1069.0 8.900139,46.054665,1068.0 8.900181,46.054747,1069.0 8.9002,46.054763,1069.0 8.900258,46.054839,1071.0 8.900272,46.05485,1071.0 8.900341,46.054913,1072.0 8.90035,46.054924,1072.0 8.9004,46.054999,1074.0 8.900401,46.055016,1074.0 8.900428,46.055097,1074.0 8.900429,46.05511,1074.0 8.900453,46.055196,1074.0 8.900441,46.055208,1074.0 8.900428,46.055282,1076.0 8.900423,46.055297,1076.0 8.900481,46.055364,1078.0 8.900492,46.05538,1078.0 8.900535,46.055458,1079.0 8.900527,46.055468,1077.0 8.900531,46.055544,1080.0 8.900529,46.055558,1081.0 8.900487,46.05563,1081.0 8.900472,46.055645,1080.0 8.900391,46.055703,1079.0 8.900377,46.055718,1079.0 8.900306,46.055783,1082.0 8.900287,46.055791,1082.0 8.900182,46.055837,1083.0 8.900176,46.055853,1084.0 8.900121,46.055924,1085.0 8.900106,46.055931,1084.0 8.900044,46.055999,1080.0 8.900036,46.056009,1081.0 8.899936,46.056054,1084.0 8.899921,46.05606,1084.0 8.89981,46.056098,1090.0 8.899797,46.056099,1090.0 8.899741,46.056174,1088.0 8.899742,46.056188,1088.0 8.899711,46.056263,1089.0 8.899715,46.056278,1089.0 8.899725,46.056367,1095.0 8.899717,46.056384,1093.0 8.899693,46.056467,1095.0 8.899683,46.056474,1095.0 8.899659,46.056553,1096.0 8.899688,46.056574,1098.0 8.899712,46.056651,1099.0 8.899717,46.056662,1098.0 8.899743,46.056748,1099.0 8.899747,46.056756,1099.0 8.899777,46.056837,1101.0 8.899767,46.05685,1101.0 8.899804,46.056932,1102.0 8.899812,46.056944,1101.0 8.899841,46.057028,1106.0 8.899833,46.057042,1105.0 8.89983,46.057131,1106.0 8.899826,46.057133,1107.0 8.899821,46.057222,1109.0 8.899821,46.057235,1108.0 8.899743,46.057306,1103.0 8.899729,46.057313,1104.0 8.899631,46.057364,1105.0 8.899623,46.057386,1104.0 8.899502,46.057409,1107.0 8.89949,46.057412,1106.0 8.899407,46.05747,1105.0 8.899399,46.057486,1105.0 8.899336,46.057555,1104.0 8.899326,46.057562,1105.0 8.899273,46.057631,1104.0 8.89925,46.057643,1103.0 8.899256,46.057727,1105.0 8.899268,46.05774,1105.0 8.899293,46.057817,1104.0 8.899297,46.057829,1104.0 8.899329,46.0579,1102.0 8.899341,46.057916,1103.0 8.899381,46.057994,1105.0 8.899378,46.058003,1105.0 8.89939,46.058091,1105.0 8.899361,46.058101,1105.0 8.899328,46.05818,1104.0 8.89933,46.058193,1105.0 8.899262,46.058268,1107.0 8.899245,46.058274,1106.0 8.89923,46.058362,1109.0 8.899228,46.058371,1109.0 8.89922,46.05846,1110.0 8.899216,46.058465,1111.0 8.899203,46.058551,1108.0 8.899211,46.058562,1109.0 8.899264,46.058637,1112.0 8.899276,46.058648,1112.0 8.899344,46.058716,1115.0 8.899354,46.058727,1115.0 8.899401,46.058809,1116.0 8.899403,46.058822,1117.0 8.899373,46.058906,1118.0 8.899359,46.058923,1118.0 8.899294,46.058993,1116.0 8.899281,46.058998,1116.0 8.899184,46.059045,1117.0 8.899167,46.059052,1117.0 8.899052,46.059084,1117.0 8.899043,46.059091,1117.0 8.898968,46.059158,1122.0 8.898968,46.059168,1122.0 8.898944,46.059252,1123.0 8.898949,46.059268,1124.0 8.898972,46.059348,1123.0 8.898973,46.05936,1124.0 8.898994,46.059437,1120.0 8.899005,46.059448,1120.0 8.899009,46.059534,1122.0 8.899003,46.059547,1122.0 8.899008,46.059625,1124.0 8.898992,46.059638,1125.0 8.898986,46.059723,1126.0 8.898994,46.059735,1126.0 8.899028,46.059811,1127.0 8.899041,46.059822,1127.0 8.899126,46.059887,1128.0 8.899137,46.059893,1128.0 8.899241,46.059941,1127.0 8.89925,46.059946,1127.0 8.899305,46.06002,1127.0 8.899314,46.060036,1127.0 8.899356,46.060119,1124.0 8.899365,46.060125,1124.0 8.899413,46.060199,1125.0 8.899418,46.060208,1125.0 8.899473,46.060281,1124.0 8.899485,46.060292,1125.0 8.899546,46.060364,1126.0 8.899549,46.060376,1126.0 8.899626,46.060438,1129.0 8.899635,46.060447,1129.0 8.899676,46.060521,1128.0 8.899683,46.060532,1128.0 8.899711,46.060615,1128.0 8.899715,46.060627,1129.0 8.899714,46.060706,1130.0 8.899712,46.060719,1131.0 8.899728,46.060799,1136.0 8.899735,46.060813,1136.0 8.899714,46.060895,1137.0 8.899714,46.060909,1137.0 8.899704,46.060982,1140.0 8.899702,46.060999,1139.0 8.899724,46.061082,1142.0 8.899728,46.061094,1142.0 8.899729,46.061177,1146.0 8.899725,46.061186,1146.0 8.899649,46.061245,1145.0 8.899641,46.061256,1145.0 8.899535,46.061288,1144.0 8.899517,46.061293,1144.0 8.899415,46.061343,1147.0 8.899414,46.061356,1147.0 8.899356,46.061433,1148.0 8.89935,46.061453,1149.0 8.899364,46.061532,1152.0 8.899377,46.061549,1153.0 8.899403,46.061633,1154.0 8.899405,46.061647,1153.0 8.899438,46.06173,1154.0 8.899434,46.061738,1153.0 8.899484,46.061812,1155.0 8.899486,46.061825,1156.0 8.899544,46.061899,1158.0 8.899558,46.061904,1159.0 8.899563,46.061992,1158.0 8.899562,46.062001,1158.0 8.899598,46.062087,1160.0 8.899613,46.062096,1162.0 8.899682,46.06216,1163.0 8.89969,46.06217,1163.0 8.899722,46.062249,1165.0 8.899737,46.062261,1166.0 8.899782,46.062337,1165.0 8.899794,46.062344,1165.0 8.899863,46.062401,1159.0 8.899856,46.062397,1159.0 8.899859,46.062393,1159.0 8.899867,46.062405,1158.0 8.899894,46.062488,1157.0 8.899896,46.062497,1158.0 8.899935,46.062577,1157.0 8.899944,46.062588,1158.0 8.899977,46.062673,1160.0 8.899991,46.062687,1160.0 8.900041,46.062766,1160.0 8.900053,46.062771,1159.0 8.90005,46.062851,1157.0 8.90005,46.062861,1157.0 8.900029,46.062941,1161.0 8.900026,46.06295,1161.0 8.899969,46.063028,1161.0 8.899964,46.063034,1160.0 8.899903,46.063104,1159.0 8.899892,46.063115,1159.0 8.899834,46.063174,1158.0 8.899818,46.063189,1156.0 8.899768,46.06326,1158.0 8.899755,46.063278,1160.0 8.899714,46.06336,1164.0 8.899708,46.063368,1164.0 8.89967,46.063446,1162.0 8.899671,46.063464,1162.0 8.899644,46.063549,1162.0 8.899642,46.063559,1162.0 8.899578,46.063628,1165.0 8.899578,46.06364,1165.0 8.899581,46.063714,1166.0 8.899584,46.063731,1167.0 8.899592,46.063819,1166.0 8.899603,46.063833,1166.0 8.89969,46.063886,1167.0 8.89969,46.063906,1168.0 8.899726,46.063991,1172.0 8.899752,46.064004,1171.0 8.899762,46.064086,1175.0 8.899773,46.064093,1175.0 8.899722,46.064171,1170.0 8.899717,46.064182,1170.0 8.89968,46.064255,1174.0 8.89967,46.064269,1173.0 8.899643,46.064349,1175.0 8.899641,46.064361,1174.0 8.899628,46.06445,1175.0 8.899626,46.064457,1175.0 8.899567,46.064534,1180.0 8.899567,46.064543,1180.0 8.899562,46.064628,1181.0 8.899579,46.064641,1181.0 8.899637,46.064705,1182.0 8.899646,46.064721,1183.0 8.899684,46.064798,1182.0 8.899694,46.064812,1182.0 8.899721,46.06489,1185.0 8.899714,46.064906,1187.0 8.89968,46.06499,1186.0 8.899693,46.065014,1186.0 8.899665,46.065101,1187.0 8.899699,46.065114,1187.0 8.899749,46.065194,1191.0 8.899755,46.065203,1191.0 8.899863,46.065241,1191.0 8.89988,46.065247,1191.0 8.899986,46.065294,1197.0 8.899995,46.065296,1198.0 8.900091,46.065353,1200.0 8.900109,46.065354,1198.0 8.900201,46.065412,1196.0 8.900215,46.065414,1196.0 8.900279,46.065477,1197.0 8.900283,46.065492,1197.0 8.900319,46.065574,1196.0 8.900327,46.065589,1197.0 8.900393,46.065654,1198.0 8.9004,46.065663,1198.0 8.900428,46.065742,1197.0 8.900431,46.065751,1197.0 8.900486,46.065825,1198.0 8.900489,46.065837,1198.0 8.90054,46.065915,1201.0 8.900525,46.065933,1199.0 8.900468,46.066008,1198.0 8.900467,46.066021,1197.0 8.900459,46.066105,1195.0 8.900455,46.066116,1195.0 8.90047,46.066201,1197.0 8.900461,46.066212,1198.0 8.900462,46.066292,1197.0 8.900451,46.066306,1196.0 8.900392,46.066363,1199.0 8.900376,46.066384,1198.0 8.900315,46.066456,1200.0 8.900299,46.066463,1200.0 8.900286,46.066541,1203.0 8.900292,46.066556,1203.0 8.900273,46.066633,1204.0 8.900255,46.066649,1203.0 8.90024,46.066737,1204.0 8.900218,46.066759,1202.0 8.900162,46.066835,1206.0 8.900164,46.066846,1206.0 8.900146,46.066921,1208.0 8.900154,46.06694,1208.0 8.90011,46.067024,1210.0 8.900098,46.067035,1210.0 8.90009,46.067124,1209.0 8.900085,46.067134,1210.0 8.900059,46.067219,1210.0 8.900058,46.067235,1211.0 8.900057,46.067321,1214.0 8.900039,46.067338,1214.0 8.900015,46.067415,1215.0 8.900027,46.067429,1215.0 8.900032,46.067508,1216.0 8.900021,46.067519,1215.0 8.900025,46.067607,1214.0 8.900018,46.067623,1215.0 8.90005,46.0677,1217.0 8.900063,46.067713,1217.0 8.9001,46.067798,1220.0 8.900105,46.067821,1219.0 8.900154,46.067902,1218.0 8.900153,46.067915,1218.0 8.900162,46.067997,1219.0 8.900169,46.06801,1219.0 8.900076,46.068072,1218.0 8.900059,46.068092,1218.0 8.899971,46.068144,1218.0 8.899959,46.068149,1219.0 8.899882,46.068207,1218.0 8.89986,46.068221,1217.0 8.899811,46.0683,1216.0 8.899806,46.068312,1216.0 8.899755,46.06839,1219.0 8.899753,46.068406,1220.0 8.899742,46.068479,1222.0 8.899732,46.0685,1223.0 8.899666,46.068556,1220.0 8.899646,46.068569,1221.0 8.899579,46.068633,1219.0 8.899568,46.068644,1218.0 8.899494,46.068718,1215.0 8.899488,46.068719,1214.0 8.899447,46.068786,1213.0 8.899431,46.068804,1213.0 8.8994,46.068878,1217.0 8.899394,46.068897,1218.0 8.899308,46.068955,1218.0 8.8993,46.068962,1219.0 8.899251,46.068957,1223.0 8.899249,46.06896,1223.0 8.899243,46.06887,1234.0 8.899245,46.068867,1235.0 8.899263,46.068779,1238.0 8.899257,46.068766,1236.0 8.899215,46.068684,1236.0 8.899213,46.068676,1236.0 8.899249,46.0686,1236.0 8.899238,46.068585,1236.0 8.899191,46.068507,1237.0 8.899186,46.0685,1237.0 8.899206,46.068419,1238.0 8.899208,46.068406,1237.0 8.89923,46.068323,1235.0 8.899232,46.068308,1235.0 8.899239,46.068223,1235.0 8.89924,46.068205,1234.0 8.899241,46.06814,1234.0 8.899248,46.068112,1233.0 8.899231,46.068033,1234.0 8.89924,46.068016,1234.0 8.899189,46.067944,1237.0 8.899179,46.067934,1237.0 8.899062,46.067949,1240.0 8.899045,46.067968,1240.0 8.898972,46.068032,1189.0 8.898955,46.068042,1202.0 8.898884,46.068105,1232.0 8.898873,46.06812,1232.0 8.898805,46.068183,1240.0 8.898792,46.068193,1242.0 8.898756,46.06827,1243.0 8.898738,46.068293,1243.0 8.898686,46.068373,1242.0 8.898676,46.06838,1242.0 8.89856,46.068397,1248.0 8.898547,46.068404,1248.0 8.89849,46.068473,1248.0 8.898478,46.068496,1247.0 8.898448,46.068565,1246.0 8.898428,46.06858,1248.0 8.898352,46.068645,1256.0 8.898347,46.068656,1256.0 8.89827,46.068717,1258.0 8.898262,46.068731,1259.0 8.898185,46.068793,1260.0 8.89817,46.068798,1260.0 8.898058,46.068838,1261.0 8.89804,46.068846,1260.0 8.897993,46.068917,1259.0 8.897981,46.068926,1259.0 8.897951,46.069012,1253.0 8.897945,46.069021,1254.0 8.897904,46.069106,1252.0 8.897898,46.069105,1252.0 8.897836,46.069182,1253.0 8.897823,46.06919,1254.0 8.8978,46.069273,1252.0 8.897786,46.069291,1251.0 8.897732,46.069367,1253.0 8.897708,46.069381,1254.0 8.897646,46.069456,1258.0 8.897639,46.069461,1257.0 8.897619,46.069549,1261.0 8.897617,46.069551,1260.0 8.897549,46.069618,1265.0 8.897547,46.069631,1266.0 8.897457,46.069682,1268.0 8.897441,46.069692,1270.0 8.897337,46.069736,1273.0 8.897328,46.069741,1273.0 8.897227,46.069777,1281.0 8.897217,46.06981,1283.0 8.897167,46.069883,1285.0 8.897165,46.0699,1285.0 8.89714,46.069981,1279.0 8.897158,46.070003,1279.0 8.897151,46.070087,1280.0 8.897156,46.070109,1279.0 8.897109,46.070188,1281.0 8.897115,46.070194,1281.0 8.897125,46.070272,1288.0 8.897117,46.070285,1289.0 8.897098,46.070369,1289.0 8.897079,46.070374,1289.0 8.897006,46.070436,1288.0 8.897002,46.070447,1289.0 8.896977,46.070528,1292.0 8.89697,46.070538,1292.0 8.896968,46.07056,1293.0 8.896973,46.070553,1295.0 8.896964,46.070569,1296.0 8.89691,46.070644,1296.0 8.896928,46.070662,1296.0 8.896824,46.070695,1304.0 8.896795,46.070687,1305.0 8.89667,46.070696,1306.0 8.896663,46.070693,1308.0 8.896552,46.070667,1307.0 8.896532,46.070685,1307.0 8.896527,46.070679,1307.0 8.896514,46.070689,1307.0 8.896388,46.070706,1310.0 8.89638,46.070709,1311.0 8.896284,46.070756,1310.0 8.896271,46.070758,1311.0 8.896154,46.07079,1311.0 8.896141,46.070797,1310.0 8.896072,46.070865,1313.0 8.896058,46.070867,1312.0 8.895962,46.070918,1314.0 8.895942,46.070926,1315.0 8.895824,46.070939,1314.0 8.895808,46.070942,1314.0 8.895696,46.070956,1318.0 8.895679,46.070962,1317.0 8.895566,46.070969,1320.0 8.895548,46.070977,1320.0 8.89542,46.070974,1320.0 8.895402,46.070983,1320.0 8.895373,46.07097,1320.0 8.895365,46.07097,1321.0 8.895343,46.070962,1320.0 8.895238,46.070925,1318.0 8.895227,46.070916,1318.0 8.895107,46.070886,1324.0 8.895095,46.070882,1325.0 8.894984,46.070858,1328.0 8.894963,46.07086,1329.0 8.894929,46.070865,1328.0 8.89492,46.070867,1328.0 8.894912,46.07087,1327.0 8.894788,46.070884,1329.0 8.894782,46.070881,1328.0 8.894677,46.070833,1333.0 8.894669,46.070827,1333.0 8.894663,46.070828,1333.0 8.894657,46.070815,1335.0 8.894647,46.070809,1335.0 8.894546,46.070756,1336.0 8.894536,46.070755,1337.0 8.894421,46.070713,1336.0 8.894409,46.070711,1337.0 8.894316,46.070656,1344.0 8.894301,46.070659,1345.0 8.894196,46.070677,1346.0 8.894185,46.070683,1346.0 8.894172,46.07069,1345.0 8.894154,46.070694,1343.0 8.894153,46.07068,1344.0 8.89418,46.070676,1342.0 8.89417,46.070678,1343.0 8.894054,46.070661,1346.0 8.89404,46.070666,1347.0 8.893926,46.070691,1333.0 8.893912,46.07069,1333.0 8.893802,46.070727,1340.0 8.893779,46.070721,1340.0 8.893757,46.070733,1341.0 8.893748,46.070731,1341.0 8.893732,46.070738,1340.0 8.893664,46.070751,1346.0 8.89366,46.07075,1347.0 8.893656,46.070748,1347.0 8.893548,46.070764,1350.0 8.893539,46.070764,1351.0 8.893506,46.07076,1353.0 8.893495,46.070771,1356.0 8.893468,46.070789,1355.0 8.893482,46.070788,1356.0 8.893484,46.070795,1360.0 8.893479,46.070786,1360.0 8.893356,46.070797,1360.0 8.893344,46.070797,1359.0 8.893223,46.070805,1359.0 8.893213,46.07081,1359.0 8.893106,46.070835,1364.0 8.893086,46.070843,1364.0 8.892958,46.070832,1368.0 8.892947,46.07084,1368.0 8.892828,46.070855,1372.0 8.892816,46.070861,1372.0 8.8927,46.070831,1371.0 8.892685,46.070834,1370.0 8.89257,46.070814,1370.0 8.892546,46.070821,1370.0 8.892447,46.070793,1369.0 8.892425,46.070781,1368.0 8.8923,46.070777,1375.0 8.892285,46.070768,1375.0 8.892183,46.070736,1380.0 8.892162,46.070731,1381.0 8.892042,46.070701,1383.0 8.892023,46.07069,1382.0 8.891911,46.070663,1383.0 8.8919,46.070656,1385.0 8.89179,46.070685,1386.0 8.891781,46.070703,1388.0 8.891652,46.070703,1391.0 8.891635,46.070702,1391.0 8.891513,46.070687,1391.0 8.891498,46.070689,1392.0 8.891372,46.070678,1389.0 8.891361,46.070678,1388.0 8.891235,46.070692,1393.0 8.891216,46.070684,1393.0 8.891101,46.070685,1396.0 8.891076,46.070695,1395.0 8.890955,46.070712,1395.0 8.890937,46.070697,1395.0 8.890813,46.070716,1393.0 8.890795,46.070714,1394.0 8.890677,46.070738,1401.0 8.890658,46.070741,1400.0 8.890538,46.070775,1399.0 8.890517,46.070776,1399.0 8.890398,46.070781,1399.0 8.890382,46.070769,1400.0 8.890256,46.07078,1405.0 8.890241,46.070793,1407.0 8.890117,46.070786,1407.0 8.89011,46.070796,1406.0 8.889996,46.070766,1402.0 8.889983,46.070769,1401.0 8.889869,46.070746,1406.0 8.889856,46.070744,1407.0 8.889734,46.070731,1408.0 8.889714,46.070741,1408.0 8.889594,46.070746,1408.0 8.889578,46.070745,1408.0 8.889471,46.070697,1408.0 8.88946,46.070689,1407.0 8.889343,46.070684,1410.0 8.88933,46.070681,1410.0 8.889218,46.070725,1412.0 8.889202,46.070727,1412.0 8.889083,46.070753,1413.0 8.889075,46.070758,1413.0 8.889071,46.070769,1415.0 8.889071,46.070771,1416.0 8.889062,46.070773,1417.0 8.889044,46.070781,1417.0 8.889013,46.070793,1415.0 8.889021,46.070796,1416.0 8.889016,46.070799,1416.0 8.88901,46.070791,1416.0 8.889131,46.070773,1418.0 8.88914,46.070772,1417.0 8.889198,46.070693,1419.0 8.889209,46.070674,1417.0 8.889306,46.070646,1417.0 8.889335,46.070649,1418.0 8.889379,46.070572,1416.0 8.889392,46.070563,1414.0 8.889445,46.070485,1414.0 8.889451,46.070472,1413.0 8.88951,46.070395,1409.0 8.88952,46.070392,1409.0 8.8896,46.070338,1411.0 8.889615,46.07033,1411.0 8.889688,46.070256,1416.0 8.889685,46.070245,1415.0 8.889778,46.070193,1422.0 8.889781,46.070182,1422.0 8.889849,46.070125,1419.0 8.889857,46.07013,1418.0 8.889873,46.070125,1418.0 8.889897,46.070104,1420.0 8.889898,46.070098,1421.0 8.889898,46.070089,1420.0 8.889957,46.070013,1422.0 8.889957,46.069994,1422.0 8.88999,46.069922,1426.0 8.890004,46.069905,1425.0 8.890051,46.069821,1434.0 8.890052,46.069805,1433.0 8.890172,46.069778,1439.0 8.890177,46.069767,1439.0 8.890257,46.069712,1441.0 8.890278,46.069707,1442.0 8.890388,46.069672,1447.0 8.890408,46.069664,1446.0 8.89052,46.069628,1447.0 8.890534,46.069624,1446.0 8.890588,46.069609,1445.0 8.890597,46.069602,1444.0 8.890634,46.069573,1446.0 8.890645,46.069557,1446.0 8.890724,46.069495,1450.0 8.890733,46.069483,1451.0 8.89081,46.069416,1452.0 8.89083,46.069419,1452.0 8.890945,46.069404,1455.0 8.890965,46.069397,1455.0 8.89103,46.069322,1456.0 8.891046,46.069312,1457.0 8.891091,46.069232,1459.0 8.891098,46.069221,1458.0 8.89116,46.069148,1459.0 8.891171,46.069139,1458.0 8.891219,46.069073,1458.0 8.891211,46.069051,1458.0 8.891277,46.068977,1458.0 8.891288,46.068966,1458.0 8.891357,46.068894,1462.0 8.89136,46.068882,1463.0 8.891344,46.068834,1463.0 8.891353,46.068834,1463.0 8.891356,46.068825,1463.0 8.891412,46.068753,1465.0 8.891411,46.068743,1467.0 8.891452,46.068659,1468.0 8.891457,46.068655,1468.0 8.891497,46.068577,1472.0 8.891493,46.068564,1471.0 8.891489,46.068484,1470.0 8.891495,46.068474,1471.0 8.891465,46.068398,1473.0 8.891447,46.068386,1473.0 8.891401,46.068309,1472.0 8.891398,46.068297,1472.0 8.891479,46.068231,1474.0 8.891483,46.068214,1474.0 8.891503,46.068198,1474.0 8.891505,46.068193,1473.0 8.891505,46.068187,1475.0 8.891517,46.068178,1475.0 8.891544,46.068098,1476.0 8.891541,46.068085,1476.0 8.891512,46.068013,1475.0 8.891503,46.067985,1475.0 8.891469,46.0679,1478.0 8.891471,46.067893,1478.0 8.891493,46.067811,1482.0 8.891491,46.067801,1482.0 8.891491,46.067721,1482.0 8.891493,46.067697,1482.0 8.891479,46.067609,1479.0 8.891498,46.067585,1479.0 8.891538,46.067503,1481.0 8.891547,46.067497,1482.0 8.891522,46.067412,1479.0 8.891513,46.067403,1479.0 8.891415,46.067388,1478.0 8.891378,46.067381,1475.0 8.891285,46.067334,1477.0 8.891275,46.067317,1478.0 8.891264,46.067239,1480.0 8.891267,46.067227,1479.0 8.891261,46.067137,1475.0 8.891263,46.067135,1475.0 8.891266,46.06708,1475.0 8.891258,46.067089,1476.0 8.891259,46.067086,1475.0 8.891254,46.067084,1475.0 8.891255,46.067083,1475.0 8.891255,46.067088,1475.0 8.891244,46.067094,1474.0 8.891205,46.067008,1473.0 8.891213,46.066991,1473.0 8.891226,46.066912,1477.0 8.891228,46.066892,1476.0 8.891234,46.066816,1480.0 8.891234,46.066795,1481.0 8.891238,46.066717,1480.0 8.891227,46.0667,1480.0 8.891237,46.066615,1476.0 8.891237,46.066607,1476.0 8.891224,46.066526,1471.0 8.891219,46.066509,1471.0 8.891193,46.066427,1469.0 8.891177,46.066417,1469.0 8.891082,46.066355,1467.0 8.891066,46.066353,1467.0 8.89103,46.066321,1471.0 8.891027,46.066318,1472.0 8.891024,46.066303,1474.0 8.891013,46.066286,1474.0 8.89095,46.066219,1479.0 8.890942,46.066205,1479.0 8.890858,46.066137,1483.0 8.890852,46.066116,1482.0 8.890786,46.066051,1486.0 8.890776,46.066035,1486.0 8.890784,46.06595,1487.0 8.890786,46.065944,1486.0 8.890816,46.065867,1492.0 8.890824,46.065854,1491.0 8.890803,46.065774,1492.0 8.890812,46.065743,1492.0 8.890818,46.065656,1495.0 8.890818,46.065643,1495.0 8.890875,46.065571,1496.0 8.890882,46.065563,1496.0 8.890885,46.065475,1498.0 8.890896,46.06547,1498.0 8.890917,46.065386,1499.0 8.890918,46.065379,1499.0 8.890924,46.065291,1497.0 8.890927,46.065288,1497.0 8.890922,46.065201,1502.0 8.890921,46.065193,1502.0 8.890945,46.06511,1507.0 8.890951,46.065097,1507.0 8.891041,46.065033,1513.0 8.891042,46.065032,1513.0 8.891112,46.064957,1515.0 8.891128,46.06495,1515.0 8.891205,46.064887,1518.0 8.891214,46.064876,1517.0 8.891337,46.06485,1519.0 8.891346,46.06484,1519.0 8.89147,46.064832,1522.0 8.891483,46.064827,1520.0 8.891561,46.064893,1524.0 8.891573,46.064895,1525.0 8.8917,46.064892,1528.0 8.891709,46.06489,1527.0 8.89181,46.064943,1531.0 8.891815,46.064958,1531.0 8.891911,46.065015,1538.0 8.891892,46.065033,1539.0 8.891919,46.065081,1543.0 8.891921,46.065088,1544.0 8.891916,46.065092,1545.0 8.891914,46.065099,1544.0 8.891979,46.065171,1544.0 8.891991,46.065182,1544.0 8.892079,46.065244,1545.0 8.892089,46.065243,1545.0 8.892072,46.065252,1545.0</coordinates>
			</LineString>
		</Placemark>
		<Placemark>
			<name>Cima</name>
			<styleUrl>#icon-1377-nodesc</styleUrl>
			<Point>
				<coordinates>8.892072,46.065252,1545.0</coordinates>
			</Point>
		</Placemark>
		<Placemark>
			<name>La Bassa</name>
			<styleUrl>#icon-1381-nodesc</styleUrl>
			<Point>
				<coordinates>8.889016,46.0707952,0.0</coordinates>
			</Point>
		</Placemark>
		<Style id='icon-1377-nodesc-normal'>
			<IconStyle>
				<scale>1.1</scale>
				<Icon>
					<href>http://www.gstatic.com/mapspro/images/stock/1377-rec-mountain.png</href>
				</Icon>
			</IconStyle>
			<LabelStyle>
				<scale>0.0</scale>
			</LabelStyle>
			<BalloonStyle>
				<text><![CDATA[<h3>$[name]</h3>]]></text>
			</BalloonStyle>
		</Style>
		<Style id='icon-1377-nodesc-highlight'>
			<IconStyle>
				<scale>1.1</scale>
				<Icon>
					<href>http://www.gstatic.com/mapspro/images/stock/1377-rec-mountain.png</href>
				</Icon>
			</IconStyle>
			<LabelStyle>
				<scale>1.1</scale>
			</LabelStyle>
			<BalloonStyle>
				<text><![CDATA[<h3>$[name]</h3>]]></text>
			</BalloonStyle>
		</Style>
		<StyleMap id='icon-1377-nodesc'>
			<Pair>
				<key>normal</key>
				<styleUrl>#icon-1377-nodesc-normal</styleUrl>
			</Pair>
			<Pair>
				<key>highlight</key>
				<styleUrl>#icon-1377-nodesc-highlight</styleUrl>
			</Pair>
		</StyleMap>
		<Style id='icon-1381-nodesc-normal'>
			<IconStyle>
				<scale>1.1</scale>
				<Icon>
					<href>http://www.gstatic.com/mapspro/images/stock/1381-rec-picnic.png</href>
				</Icon>
			</IconStyle>
			<LabelStyle>
				<scale>0.0</scale>
			</LabelStyle>
			<BalloonStyle>
				<text><![CDATA[<h3>$[name]</h3>]]></text>
			</BalloonStyle>
		</Style>
		<Style id='icon-1381-nodesc-highlight'>
			<IconStyle>
				<scale>1.1</scale>
				<Icon>
					<href>http://www.gstatic.com/mapspro/images/stock/1381-rec-picnic.png</href>
				</Icon>
			</IconStyle>
			<LabelStyle>
				<scale>1.1</scale>
			</LabelStyle>
			<BalloonStyle>
				<text><![CDATA[<h3>$[name]</h3>]]></text>
			</BalloonStyle>
		</Style>
		<StyleMap id='icon-1381-nodesc'>
			<Pair>
				<key>normal</key>
				<styleUrl>#icon-1381-nodesc-normal</styleUrl>
			</Pair>
			<Pair>
				<key>highlight</key>
				<styleUrl>#icon-1381-nodesc-highlight</styleUrl>
			</Pair>
		</StyleMap>
		<Style id='icon-1453-nodesc-normal'>
			<IconStyle>
				<scale>1.1</scale>
				<Icon>
					<href>http://www.gstatic.com/mapspro/images/stock/1453-trans-parking.png</href>
				</Icon>
			</IconStyle>
			<LabelStyle>
				<scale>0.0</scale>
			</LabelStyle>
			<BalloonStyle>
				<text><![CDATA[<h3>$[name]</h3>]]></text>
			</BalloonStyle>
		</Style>
		<Style id='icon-1453-nodesc-highlight'>
			<IconStyle>
				<scale>1.1</scale>
				<Icon>
					<href>http://www.gstatic.com/mapspro/images/stock/1453-trans-parking.png</href>
				</Icon>
			</IconStyle>
			<LabelStyle>
				<scale>1.1</scale>
			</LabelStyle>
			<BalloonStyle>
				<text><![CDATA[<h3>$[name]</h3>]]></text>
			</BalloonStyle>
		</Style>
		<StyleMap id='icon-1453-nodesc'>
			<Pair>
				<key>normal</key>
				<styleUrl>#icon-1453-nodesc-normal</styleUrl>
			</Pair>
			<Pair>
				<key>highlight</key>
				<styleUrl>#icon-1453-nodesc-highlight</styleUrl>
			</Pair>
		</StyleMap>
		<Style id='line-DB4436-2-nodesc-normal'>
			<LineStyle>
				<color>ff3644DB</color>
				<width>2</width>
			</LineStyle>
			<BalloonStyle>
				<text><![CDATA[<h3>$[name]</h3>]]></text>
			</BalloonStyle>
		</Style>
		<Style id='line-DB4436-2-nodesc-highlight'>
			<LineStyle>
				<color>ff3644DB</color>
				<width>3.0</width>
			</LineStyle>
			<BalloonStyle>
				<text><![CDATA[<h3>$[name]</h3>]]></text>
			</BalloonStyle>
		</Style>
		<StyleMap id='line-DB4436-2-nodesc'>
			<Pair>
				<key>normal</key>
				<styleUrl>#line-DB4436-2-nodesc-normal</styleUrl>
			</Pair>
			<Pair>
				<key>highlight</key>
				<styleUrl>#line-DB4436-2-nodesc-highlight</styleUrl>
			</Pair>
		</StyleMap>
	</Document>
</kml>