[gd_resource type="SpatialMaterial" load_steps=2 format=2]

[ext_resource path="res://addons/kenney_prototype_textures/dark/texture_04.png" type="Texture" id=1]

[resource]
albedo_texture = ExtResource( 1 )
metallic = 1.0
roughness = 0.0
refraction_enabled = true
refraction_scale = 0.05
refraction_texture_channel = 0
uv1_triplanar = true
