[gd_resource type="SpatialMaterial" load_steps=2 format=2]

[ext_resource path="res://materials/Prototype/dark_prototype.png" type="Texture" id=1]

[resource]
params_diffuse_mode = 4
params_specular_mode = 3
albedo_texture = ExtResource( 1 )
uv1_triplanar = true
