[gd_scene load_steps=11 format=2]

[ext_resource path="res://textures/Prototype/dark.tres" type="Material" id=1]
[ext_resource path="res://level generator/GridPieces/GridPiece.gd" type="Script" id=2]
[ext_resource path="res://textures/Prototype/grey.tres" type="Material" id=3]
[ext_resource path="res://nodes/MultiMeshes/Noisy Blocks.tscn" type="PackedScene" id=4]

[sub_resource type="BoxShape" id=2]
extents = Vector3( 2.5, 2.5, 2.5 )

[sub_resource type="PlaneMesh" id=4]
material = ExtResource( 3 )
size = Vector2( 5, 5 )

[sub_resource type="ConcavePolygonShape" id=5]
data = PoolVector3Array( 2.5, 0, 2.5, -2.5, 0, 2.5, 2.5, 0, -2.5, -2.5, 0, 2.5, -2.5, 0, -2.5, 2.5, 0, -2.5 )

[sub_resource type="PlaneMesh" id=6]
material = ExtResource( 3 )
flip_faces = true
size = Vector2( 5, 5 )

[sub_resource type="PlaneMesh" id=7]
material = ExtResource( 1 )
flip_faces = true
size = Vector2( 5, 5 )

[sub_resource type="ConcavePolygonShape" id=3]
data = PoolVector3Array( 2.5, 0, 2.5, -2.5, 0, 2.5, 2.5, 0, -2.5, -2.5, 0, 2.5, -2.5, 0, -2.5, 2.5, 0, -2.5 )

[node name="h1" type="Room"]
script = ExtResource( 2 )
canSpawnEnemies = false
adjacents = [ Vector3( 1, 0, 0 ), Vector3( 0, -1, 0 ) ]

[node name="Area" type="Area" parent="."]

[node name="CollisionShape" type="CollisionShape" parent="Area"]
transform = Transform( 1, 0, 0, 0, 1, 0, 0, 0, 1, 0, 2.5, 0 )
shape = SubResource( 2 )

[node name="MeshInstance" type="MeshInstance" parent="."]
transform = Transform( 1, 0, 0, 0, -4.37114e-08, -1, 0, 1, -4.37114e-08, 0, 2.5, -2.5 )
visible = false
mesh = SubResource( 4 )
skeleton = NodePath("")

[node name="StaticBody" type="StaticBody" parent="MeshInstance"]

[node name="CollisionShape" type="CollisionShape" parent="MeshInstance/StaticBody"]
shape = SubResource( 5 )

[node name="MeshInstance2" type="MeshInstance" parent="."]
transform = Transform( 1, 0, 0, 0, -4.37114e-08, 1, 0, -1, -4.37114e-08, 0, 2.5, 2.5 )
visible = false
mesh = SubResource( 4 )
skeleton = NodePath("")

[node name="StaticBody" type="StaticBody" parent="MeshInstance2"]

[node name="CollisionShape" type="CollisionShape" parent="MeshInstance2/StaticBody"]
shape = SubResource( 5 )

[node name="MeshInstance3" type="MeshInstance" parent="."]
transform = Transform( -4.37114e-08, 1, 0, -1, -4.37114e-08, 0, 0, 0, 1, -2.5, 2.5, 0 )
visible = false
mesh = SubResource( 4 )
skeleton = NodePath("")

[node name="StaticBody" type="StaticBody" parent="MeshInstance3"]

[node name="CollisionShape" type="CollisionShape" parent="MeshInstance3/StaticBody"]
shape = SubResource( 5 )

[node name="MeshInstance4" type="MeshInstance" parent="."]
transform = Transform( 1, 0, 0, 0, -4.37114e-08, -1, 0, 1, -4.37114e-08, 0, 2.5, -2.5 )
visible = false
mesh = SubResource( 6 )
skeleton = NodePath("")

[node name="MeshInstance5" type="MeshInstance" parent="."]
transform = Transform( 1, 0, 0, 0, -4.37114e-08, 1, 0, -1, -4.37114e-08, 0, 2.5, 2.5 )
visible = false
mesh = SubResource( 6 )
skeleton = NodePath("")

[node name="MeshInstance6" type="MeshInstance" parent="."]
transform = Transform( -4.37114e-08, 1, 0, -1, -4.37114e-08, 0, 0, 0, 1, -2.5, 2.5, 0 )
visible = false
mesh = SubResource( 6 )
skeleton = NodePath("")

[node name="Obelisks" type="Spatial" parent="."]

[node name="Ceil" type="MeshInstance" parent="."]
transform = Transform( 1, 0, 0, 0, 1, 0, 0, 0, 1, 0, 5, 0 )
visible = false
mesh = SubResource( 7 )
skeleton = NodePath("")

[node name="StaticBody" type="StaticBody" parent="Ceil"]

[node name="CollisionShape" type="CollisionShape" parent="Ceil/StaticBody"]
shape = SubResource( 3 )

[node name="Noisy Blocks Ceiling" parent="." instance=ExtResource( 4 )]
transform = Transform( 1, 0, 0, 0, 1, 0, 0, 0, 1, 0, 5, 0 )

[node name="Noisy Blocks Floor" parent="." instance=ExtResource( 4 )]
visible = false

[node name="Noisy Blocks Wall 1" parent="." instance=ExtResource( 4 )]
transform = Transform( 1, 0, 0, 0, -4.37114e-08, -1, 0, 1, -4.37114e-08, 0, 2.5, 2.5 )

[node name="Noisy Blocks Wall 2" parent="." instance=ExtResource( 4 )]
transform = Transform( 1, 0, 0, 0, -4.37114e-08, 1, 0, -1, -4.37114e-08, 0, 2.5, -2.5 )

[node name="Noisy Blocks Wall 3" parent="." instance=ExtResource( 4 )]
transform = Transform( -4.37114e-08, -1, 0, 1, -4.37114e-08, 0, 0, 0, 1, -2.5, 2.5, 0 )

[node name="Portal5" type="Portal" parent="."]
transform = Transform( 1.31134e-07, 0, -1, 0, 1, 0, 1, 0, 1.31134e-07, 2.5, 2.5, 0 )
points = PoolVector2Array( -2.5, 2.5, -2.5, -2.5, 2.5, -2.5, 2.5, 2.5 )

[connection signal="body_entered" from="Area" to="." method="_body_entered"]
