[gd_scene load_steps=2 format=2]

[ext_resource path="res://nodes/Gadgets/Light Ball.tscn" type="PackedScene" id=1]

[node name="Spatial" type="Spatial"]

[node name="CSGCombiner" type="CSGCombiner" parent="."]
use_collision = true

[node name="CSGBox" type="CSGBox" parent="CSGCombiner"]
transform = Transform( 1, 0, 0, 0, 1, 0, 0, 0, 1, 0, -0.230145, 0 )
width = 0.750466
height = 0.443535
depth = 0.80719

[node name="CSGSphere" type="CSGSphere" parent="CSGCombiner"]
transform = Transform( 1, 0, 0, 0, 1, 0, 0, 0, 1, 0, -0.00812405, 0 )
operation = 2
radius = 0.32

[node name="OmniLight" type="OmniLight" parent="."]
transform = Transform( 1, 0, 0, 0, 1, 0, 0, 0, 1, 1.24717, 1.36403, 0 )
editor_only = true

[node name="Light Ball" parent="." instance=ExtResource( 1 )]
