"","    GrowthHabit","       StriaeColour","              StemColourPM","PresencePigmentedAxils"," PigmentedAxilColour","          LeafShape","           LeafColorPM","   DehiscenceDegree","            PerigoniumAppearance","               PerigoniumColour","              PericarpColour","                 EpispermColour","                   GrainShape","        GrainBorder","        AbioticStressSusceptibility"," PlantHeight"," StemDiameter","NrPrimaryBranch","PlantCoverage","NrTeethLeafBlade","PetioleLength","MaxLeafLength"," MaxLeafWidth","  GrainWidth","     TKM","GrainHLWeight","SeedYieldPlant","DaysBranchDev","DaysFlowering","  MilkStage","  DoughStage","    DaysPM","      HI","clust"
"","Saihua    : 1  ","Striae_Green :19  ","Stem_Chartreuse     :10  ","Axils_FALSE:14  ","Axil_Green :14  ","Leaf_Rhomboidal: 6  ","Leaf_Orange      :12  ","Deg_Light  : 2  ","Perigonium_Semi-opened:12  ","Perigonium_Light cream :18  ","Pericarp_Light cream :11  ","Episperm_Dark brown     :8  ","Shape_Nearly cylindrical:16  ","Border_Pointed: 0  ","AbioticStress_Very Low:16  ","Min.   :34.60  ","Min.   :3.700  ","Min.   : 6.000  ","Min.   :18.10  ","Min.   :2.10  ","Min.   :1.360  ","Min.   :2.720  ","Min.   :2.620  ","Min.   :1.055  ","Min.   :0.5800  ","Min.   :0.628  ","Min.   : 5.634  ","Min.   :24.00  ","Min.   :56.00  ","Min.   :79.00  ","Min.   : 95.0  ","Min.   :128.0  ","Min.   :31.76  ","A: 0  "
"","Lasta     :26  ","Striae_Yellow: 0  ","Stem_Golden         : 0  ","Axils_TRUE :13  ","Axil_Yellow: 0  ","Leaf_Triangular: 1  ","Leaf_Red         : 8  ","Deg_Regular: 9  ","Perigonium_Closed     :15  ","Perigonium_Yellow      : 2  ","Pericarp_Other       : 6  ","Episperm_Yellowish Brown:7  ","Shape_Conical           : 2  ","Border_Round  :27  ","AbioticStress_Low     :11  ","1st Qu.:40.65  ","1st Qu.:4.400  ","1st Qu.: 7.000  ","1st Qu.:36.80  ","1st Qu.:3.10  ","1st Qu.:1.660  ","1st Qu.:2.885  ","1st Qu.:2.735  ","1st Qu.:1.077  ","1st Qu.:0.7500  ","1st Qu.:0.656  ","1st Qu.: 7.720  ","1st Qu.:25.00  ","1st Qu.:59.00  ","1st Qu.:83.00  ","1st Qu.: 99.5  ","1st Qu.:133.5  ","1st Qu.:36.31  ","B:27  "
"","Pampalasta: 0  ","Striae_Pink  : 1  ","Stem_Orange         : 4  ",NA,"Axil_Pink  : 8  ","Leaf_Oval      :20  ","Leaf_Chartreuse  : 4  ","Deg_Strong :16  ",NA,"Perigonium_Red         : 2  ","Pericarp_Golden      : 2  ","Episperm_Light Brown    :7  ","Shape_Nearly lenticular : 9  ",NA,"AbioticStress_High    : 0  ","Median :41.90  ","Median :4.900  ","Median : 8.000  ","Median :41.60  ","Median :3.30  ","Median :1.730  ","Median :2.980  ","Median :2.890  ","Median :1.098  ","Median :0.8000  ","Median :0.676  ","Median : 9.276  ","Median :25.00  ","Median :64.00  ","Median :87.00  ","Median :105.0  ","Median :139.0  ","Median :38.52  ","C: 0  "
"",NA,"Striae_Red   : 3  ","Stem_Red            :13  ",NA,"Axil_Red   : 1  ",NA,"Leaf_Light yellow: 2  ",NA,NA,"Perigonium_Light Yellow: 1  ","Pericarp_Red         : 2  ","Episperm_Dark cream     :3  ","Shape_Nearly conical    : 0  ",NA,NA,"Mean   :42.99  ","Mean   :4.943  ","Mean   : 8.481  ","Mean   :39.53  ","Mean   :3.33  ","Mean   :1.739  ","Mean   :3.019  ","Mean   :2.901  ","Mean   :1.132  ","Mean   :0.8256  ","Mean   :0.669  ","Mean   :10.112  ","Mean   :25.85  ","Mean   :63.74  ","Mean   :87.37  ","Mean   :104.7  ","Mean   :139.0  ","Mean   :39.28  ",NA
"",NA,"Striae_Purple: 3  ","Stem_Brown yellowish: 0  ",NA,"Axil_Purple: 4  ",NA,"Leaf_Purple      : 1  ",NA,NA,"Perigonium_Light pink  : 1  ","Pericarp_Purple      : 2  ","Episperm_Reddish brown  :2  ",NA,NA,NA,"3rd Qu.:46.15  ","3rd Qu.:5.450  ","3rd Qu.:10.000  ","3rd Qu.:43.90  ","3rd Qu.:3.70  ","3rd Qu.:1.855  ","3rd Qu.:3.150  ","3rd Qu.:3.045  ","3rd Qu.:1.163  ","3rd Qu.:0.8600  ","3rd Qu.:0.680  ","3rd Qu.:11.104  ","3rd Qu.:26.00  ","3rd Qu.:67.00  ","3rd Qu.:90.50  ","3rd Qu.:108.5  ","3rd Qu.:143.5  ","3rd Qu.:41.05  ",NA
"",NA,"Striae_Other : 1  ","Stem_Light purple   : 0  ",NA,NA,NA,"Leaf_Light Purple: 0  ",NA,NA,"Perigonium_Pink        : 1  ","Pericarp_Light Yellow: 1  ","Episperm_Yellow         :0  ",NA,NA,NA,"Max.   :54.80  ","Max.   :6.300  ","Max.   :13.000  ","Max.   :49.70  ","Max.   :4.70  ","Max.   :2.010  ","Max.   :3.410  ","Max.   :3.470  ","Max.   :1.405  ","Max.   :1.4000  ","Max.   :0.696  ","Max.   :22.550  ","Max.   :34.00  ","Max.   :73.00  ","Max.   :97.00  ","Max.   :115.0  ","Max.   :151.0  ","Max.   :53.08  ",NA
"",NA,NA,"Stem_Other          : 0  ",NA,NA,NA,"(Other)          : 0  ",NA,NA,"(Other)                : 2  ","(Other)              : 3  ","(Other)                 :0  ",NA,NA,NA,NA,NA,NA,NA,NA,NA,NA,NA,NA,NA,NA,NA,NA,NA,NA,NA,NA,NA,NA
