,,,"Estación : ILLPA , Tipo Automtica - Meteorológica",,,,,
Departamento :,PUNO,,Provincia :,PUNO,Distrito :,PAUCARCOLLA,Ir :,2015-12
Latitud :,15° 41' 0'',,Longitud :,70° 5' 0'',Altitud :,3827,,
Día/mes/año,"Temperatura (°c)
Prom Max Min",,,Humedad (%),Lluvia (mm),Presion (mb),"Velocidad
del
Viento (m/s)","Direccion
del
Viento"
01-12-2015,9.48,16.1,3.6,64.13,.1,645.61,2.83,296
02-12-2015,9.37,15.9,2.1,62.52,0,646.8,3.16,73
03-12-2015,9.12,17.8,-.1,64.83,.7,647.19,3.26,55
04-12-2015,8.87,19,-1.4,58.63,.1,646.92,3.07,262
05-12-2015,9.68,18.5,-1.3,43.25,0,646.05,3.67,242
06-12-2015,10.54,18.8,.3,35.67,0,645.45,4.25,111
07-12-2015,11.46,18.8,4.1,50.75,1.1,644.9,4.55,314
08-12-2015,10.93,17.2,5.2,54.63,.1,645.26,4.78,261
09-12-2015,10.25,17.1,4.1,58.83,.6,646.47,3.41,326
10-12-2015,9.45,16.8,4,67.38,2.9,647.25,2.8,275
11-12-2015,9.83,18.1,,62.76,.1,647.24,2.94,346
12-12-2015,10.52,18.9,-1.5,51.71,0,646.58,2.59,34
13-12-2015,10.73,19.9,.2,36.95,0,646.49,3.48,254
14-12-2015,10.35,19.8,-2.6,33.04,0,645.37,4.19,242
15-12-2015,10.73,19.1,.4,41.71,0,645.65,4.35,90
16-12-2015,9.52,17.6,1.9,64.91,1.2,646.1,4.01,182
17-12-2015,14.21,19.3,6.3,44.86,0,645.16,4.06,125
18-12-2015,10.4,17.6,2.9,61.75,.1,645.33,4.09,248
19-12-2015,9.6,17.9,1.6,66.5,0,646.63,3.98,339
20-12-2015,9.77,15,5.2,67.04,1.9,647.03,3.08,293
21-12-2015,8.65,14.4,4.9,80.13,12.9,646,3.53,356
22-12-2015,8.99,16.4,4.7,70.96,1.1,645.71,2.57,297
23-12-2015,8.77,15.5,5,71.79,2.3,646.23,4.48,325
24-12-2015,8.47,15.7,4.7,77.08,22,647.68,2.68,309
25-12-2015,9.47,16.3,5,76.58,6,647.7,2.84,83
26-12-2015,8.26,13.9,5,77.63,3.5,647.17,3.2,169
27-12-2015,9.48,16.6,5.1,71.67,3.6,645.52,2.67,250
28-12-2015,10.39,18.2,2.8,61.17,,645.54,3.76,263
29-12-2015,10.64,17.7,2.4,47.67,0,647.17,3.75,250
30-12-2015,10.09,18.2,2.3,51.83,0,647.25,4,276
31-12-2015,9.83,19,,44.33,0,645.73,2.76,337
"* Fuente : SENAMHI - Dirección de Redes de Observación y Datos
* Informacion sin Control de Calidad
* El uso de esta Informacion es bajo su entera Responsabilidad",,,,,,,,
