592359 224422 470
224926 261498 443
964540 825974 525
394636 305133 441
388454 499291 449
871808 310318 525
479498 851731 525
52740 507853 449
911478 556984 525
748698 668966 504
570174 319491 470
945700 796897 525
923987 728198 525
683296 146098 509
128930 71515 354
79432 35521 351
891754 451635 525
686727 584958 509
248010 171319 443
429491 232425 449
918166 586124 525
179213 29668 383
494169 277257 449
431219 939845 525
367552 817490 509
312494 811885 509
834800 854717 525
165351 878149 525
883988 42625 525
461717 45142 449
797508 590343 509
822838 434925 509
577452 830090 509
811106 283848 509
515921 9070 470
194480 440204 449
591800 23201 470
220908 621932 470
718403 492800 509
357541 909827 525
389178 894573 525
653148 373813 509
991154 250018 525
140732 818746 509
793711 63795 509
69214 450419 449
486576 643498 509
497573 525438 470
94775 380285 443
28960 956893 525
322098 608508 470
32229 328712 443
930615 869835 476
450313 742189 509
175686 23923 383
558734 611943 434
15332 251603 443
248161 116133 443
778105 131195 509
352138 975557 525
264124 529119 470
139429 912595 525
11017 784491 509
154763 334741 443
19816 448166 449
911782 520039 525
489708 461730 413
993758 264733 525
31472 774194 509
572670 510256 470
481813 269948 449
324198 150774 443
421957 28085 449
364606 224657 443
106165 627804 509
450694 900293 525
898916 277615 525
56443 803234 509
165128 750746 509
928818 367918 525
962520 104500 525
736176 150800 509
357859 469125 449
315226 701872 509
665250 414682 509
164065 840314 525
853181 373748 525
50590 377578 443
379780 900289 525
966599 931528 507
200509 179555 365
308121 849022 525
170767 739546 509
686243 909926 525
963691 328625 525
741892 790221 468
286606 391824 441
126870 937839 525
109489 859240 525
508989 108890 449
764057 485477 509
713010 122578 509
171515 258480 443
607404 277499 470
716652 111369 509
484792 170369 449
772363 365609 509
168076 241880 443
427087 174423 449
172726 3621 383
595554 278787 470
412232 172209 449
635056 448085 509
994720 444976 525
963512 744428 525
426519 633512 509
561694 330284 470
243424 120328 443
445441 23245 449
260972 507096 449
366755 194197 443
690166 945903 525
466601 717963 509
632590 894599 525
395984 889938 525
123190 577258 470
370442 407772 436
850960 564281 525
934865 589090 525
767040 963587 525
990479 70379 525
178667 442442 449
772577 831035 468
246090 781192 509
739781 908329 525
215303 894225 525
431118 335343 449
772985 866571 525
223782 646182 509
797337 169199 509
765635 397154 509
735949 797932 468
232566 555955 470
239552 358930 441
646841 852501 525
349616 734456 509
294035 529963 470
612841 25913 470
266085 676945 509
201255 417963 449
348793 471179 449
80221 371028 443
210390 177504 373
478879 420273 444
122204 541003 470
207771 884307 525
552154 931783 525
483047 136234 449
422136 302196 449
263582 656877 509
2562 95416 351
68133 98400 351
486315 813916 509
316106 164721 443
653980 486324 509
39481 816317 509
901453 844044 445
580352 559621 421
241485 702440 509
627259 559532 509
850676 778756 525
235919 676884 509
203156 853106 525
337240 254110 407
943462 630375 525
57720 603439 470
741019 50160 509
449024 461176 387
691315 378868 509
542004 294208 470
597877 918626 525
859327 334913 525
699617 618189 509
718635 201662 509
235944 774265 509
327995 777012 509
219937 966764 525
898476 855200 445
828530 623459 509
5490 868752 525
859020 155173 525
342361 539713 470
80536 428669 449
265578 427747 449
57746 758256 509
940448 667810 525
742158 830406 468
569136 278645 470
993593 744182 525
972887 226764 525
910808 626791 525
977512 539644 525
176259 836294 509
366121 467462 449
668453 403071 509
281021 828605 509
573253 64877 470
781405 546594 509
31961 473361 449
974063 15823 525
324169 642457 509
911264 164938 525
137643 223792 386
980262 587001 525
484698 42109 449
756332 259238 509
689540 155567 509
460711 410268 418
983799 301355 525
650412 113088 509
881303 799054 525
195084 828699 509
401283 775992 509
989022 470029 525
863680 266913 525
351916 182173 443
825258 338257 509
484913 59280 449
549306 148521 470
634386 285969 509
115872 671994 509
540789 595304 452
804535 710834 468
100662 649956 509
635403 357012 509
371517 563019 470
363857 380764 423
326848 383420 441
578210 782829 509
968449 628165 525
343395 981296 525
944595 125097 525
42244 73190 340
324410 980475 525
148694 911561 525
608284 377239 470
725522 671651 504
866610 552379 525
89578 576423 470
842442 997478 507
