Shayan Maradia

Shayan Maradia
Shan Rizvi

Shayan Maradia

Shan Rizvi

Third Person

ElectionOne Shayan
ElectionOne Shan
ElectionOne Sam

ElectionTwo Shayan
ElectionTwo Shan
ElectionTwo Sam

ElectionThree Shayan

Albert Albert

John John

Billy Billy

Person First
Person Third
Person Fifth

Person First
Shayan Maradia
Shan Rizvi
