{
  "id": "888af7cf-693a-ebb6-ae7e-876d59658bdc",
  "name": "Cars API Production",
  "values": [
    {
      "enabled": true,
      "key": "baseUrl",
      "value": "http://carsapi-env.eba-5myn9kwk.us-east-2.elasticbeanstalk.com",
      "type": "text"
    }
  ],
  "timestamp": 1591342176485,
  "_postman_variable_scope": "environment",
  "_postman_exported_at": "2020-06-06T10:16:08.530Z",
  "_postman_exported_using": "Postman/5.5.5"
}