Division,WeightClassKg,Place,Name,Team,BodyweightKg,Best3SquatKg,Best3BenchKg,Best3DeadliftKg,TotalKg,Equipment,Event,Sex,BirthDate
Boys,51.71,1,Jaime Reyna,Olton,51.17,136.08,77.11,172.37,385.55,Unlimited,SBD,M,
Boys,51.71,2,Rolando Rivera,Sundown,51.66,145.15,97.52,140.61,383.29,Unlimited,SBD,M,
Boys,51.71,3,Isaac Vasquez,Brownfield,51.71,140.61,83.91,136.08,360.61,Unlimited,SBD,M,
Boys,51.71,4,Derek Martinez,Sundown,51.26,129.27,79.38,120.2,328.85,Unlimited,SBD,M,
Boys,51.71,5,Nathaniel Alvarado,Levelland,51.66,106.59,61.23,124.74,292.57,Unlimited,SBD,M,
Boys,51.71,6,Mason Arnold,Kress,50.89,74.84,43.09,97.52,215.46,Unlimited,SBD,M,
Boys,51.71,7,Michael Ballard,Kress,42.77,52.16,38.56,74.84,165.56,Unlimited,SBD,M,
Boys,55.79,1,Xavier Ellis,Kress,53.98,149.69,102.06,201.85,453.59,Unlimited,SBD,M,
Boys,55.79,2,Lj Minjarez,Seagraves,54.48,129.27,70.31,117.93,317.51,Unlimited,SBD,M,
Boys,55.79,3,Josiah Conde,Seagraves,55.16,122.47,65.77,124.74,312.98,Unlimited,SBD,M,
Boys,55.79,4,Talan Gonzales,Lamesa,54.48,102.06,61.23,136.08,299.37,Unlimited,SBD,M,
Boys,55.79,5,Joseph Carrillo,Sudan,54.16,106.59,47.63,115.67,269.89,Unlimited,SBD,M,
Boys,55.79,6,Kaine Carroll,Sudan,55.07,92.99,47.63,117.93,258.55,Unlimited,SBD,M,
Boys,55.79,7,Brenden Reyes,Kress,54.43,83.91,56.7,108.86,249.48,Unlimited,SBD,M,
Boys,55.79,8,Tony Carrillo,Bovina,54.16,86.18,45.36,113.4,244.94,Unlimited,SBD,M,
Boys,55.79,DQ,Caleb Mull,Idalou,55.79,,,,,Unlimited,SBD,M,
Boys,59.87,1,Zaden Carrillo,Levelland,59.78,165.56,97.52,183.7,446.79,Unlimited,SBD,M,
Boys,59.87,2,Henry Sandoval III,Crosbyton,55.97,142.88,86.18,174.63,403.7,Unlimited,SBD,M,
Boys,59.87,3,Zacharias Soto,Brownfield,59.51,142.88,97.52,151.95,392.36,Unlimited,SBD,M,
Boys,59.87,4,Angel Lopez,Lockney,59.19,142.88,74.84,136.08,353.8,Unlimited,SBD,M,
Boys,59.87,5,Aiden Nelms,Plains,59.56,117.93,70.31,147.42,335.66,Unlimited,SBD,M,
Boys,59.87,6,Daniel Longoria,Plains,59.47,92.99,72.57,154.22,319.78,Unlimited,SBD,M,
Boys,59.87,7,Edward Castellano,Levelland,58.38,111.13,72.57,113.4,297.1,Unlimited,SBD,M,
Boys,59.87,8,Ethan Ruiz,Wolfforth Frenship,57.88,97.52,70.31,120.2,288.03,Unlimited,SBD,M,
Boys,67.13,1,Noah Vasquez,Idalou,66,181.44,124.74,185.97,492.15,Unlimited,SBD,M,
Boys,67.13,2,Eddie Garcia,Meadow,66.18,170.1,102.06,181.44,453.59,Unlimited,SBD,M,
Boys,67.13,3,Corey Pormanes,Sundown,66.5,156.49,102.06,145.15,403.7,Unlimited,SBD,M,
Boys,67.13,4,Leo Rojas,Kress,66,138.35,83.91,170.1,392.36,Unlimited,SBD,M,
Boys,67.13,5,Santiago Villa,Kress,66.77,133.81,88.45,167.83,390.09,Unlimited,SBD,M,
Boys,67.13,6,Adrian Castillo,Kress,65.68,136.08,102.06,149.69,387.82,Unlimited,SBD,M,
Boys,67.13,7,Caleb Scarborough,Idalou,61.6,136.08,92.99,147.42,376.48,Unlimited,SBD,M,
Boys,67.13,8,Toby Lopez,Sundown,66.86,133.81,83.91,158.76,376.48,Unlimited,SBD,M,
Boys,67.13,9,Maddox Murrell,Plains,64.68,136.08,72.57,158.76,367.41,Unlimited,SBD,M,
Boys,67.13,10,Brenden Kibler,Lamesa,61.1,124.74,83.91,138.35,347,Unlimited,SBD,M,
Boys,67.13,11,Javier Reyes,Seagraves,65.86,142.88,72.57,131.54,347,Unlimited,SBD,M,
Boys,67.13,12,Aldo Loredo,Wolfforth Frenship,64.77,111.13,83.91,142.88,337.93,Unlimited,SBD,M,
Boys,67.13,13,Casimiro Villareal,Olton,61.1,117.93,65.77,133.81,317.51,Unlimited,SBD,M,
Boys,67.13,14,Cameron Jones,Crosbyton,63.59,111.13,74.84,124.74,310.71,Unlimited,SBD,M,
Boys,67.13,15,Jett Dodd,Idalou,66.77,92.99,83.91,122.47,299.37,Unlimited,SBD,M,
Boys,67.13,16,Chase Peterman,Wolfforth Frenship,60.78,95.25,74.84,127.01,297.1,Unlimited,SBD,M,
Boys,67.13,17,Kaiven Knox,Kress,61.37,68.04,52.16,106.59,226.8,Unlimited,SBD,M,
Boys,67.13,DQ,Jimmy Morin,Olton,66.18,74.84,61.23,,,Unlimited,SBD,M,
Boys,67.13,DQ,Kaiden Medina,Levelland,61.19,127.01,61.23,,,Unlimited,SBD,M,
Boys,74.84,1,Alex Salinas,Levelland,73.39,206.38,115.67,215.46,537.51,Unlimited,SBD,M,
Boys,74.84,2,Christian Serna,Wolfforth Frenship,74.8,181.44,136.08,206.38,523.9,Unlimited,SBD,M,
Boys,74.84,3,Kameron Isemann,Stanton,71.58,190.51,122.47,195.04,508.02,Unlimited,SBD,M,
Boys,74.84,4,Jeremiah Noriega,Kress,70.99,197.31,127.01,176.9,501.22,Unlimited,SBD,M,
Boys,74.84,5,Alex Keene,Levelland,74.57,183.7,92.99,174.63,451.32,Unlimited,SBD,M,
Boys,74.84,6,Jesus Montes-Mota,Idalou,70.49,156.49,106.59,174.63,437.72,Unlimited,SBD,M,
Boys,74.84,7,Isrrael Velez,Olton,74.8,161.03,120.2,156.49,437.72,Unlimited,SBD,M,
Boys,74.84,8,Axton Grubb,Tahoka,74.66,163.29,95.25,158.76,417.3,Unlimited,SBD,M,
Boys,74.84,9,Dave Pormanes,Sundown,70.4,158.76,95.25,154.22,408.23,Unlimited,SBD,M,
Boys,74.84,10,Quinn Carroll,Tahoka,71.08,142.88,102.06,142.88,387.82,Unlimited,SBD,M,
Boys,74.84,11,Miguel Alvarez,Kress,68.67,138.35,61.23,165.56,365.14,Unlimited,SBD,M,
Boys,74.84,12,Preston Alexander,Wolfforth Frenship,70.49,127.01,88.45,142.88,358.34,Unlimited,SBD,M,
Boys,74.84,13,Azariah Barnes,Wolfforth Frenship,68.58,102.06,97.52,151.95,351.53,Unlimited,SBD,M,
Boys,74.84,14,Brady Robles,Plains,71.49,124.74,81.65,140.61,347,Unlimited,SBD,M,
Boys,74.84,15,Zander Vuittonet,Kress,73.26,124.74,70.31,111.13,306.17,Unlimited,SBD,M,
Boys,74.84,16,Josiah Hernandez,Tulia,74.16,99.79,61.23,129.27,290.3,Unlimited,SBD,M,
Boys,74.84,17,Jayden Rocha,Levelland,71.67,97.52,58.97,106.59,263.08,Unlimited,SBD,M,
Boys,74.84,DQ,Jack Vandergriff,Sudan,68.67,92.99,,,,Unlimited,SBD,M,
Boys,82.1,1,Steven Hernandez,Tahoka,80.56,226.8,161.03,226.8,614.62,Unlimited,SBD,M,
Boys,82.1,2,Jacob Tew,Tahoka,80.78,190.51,120.2,208.65,519.36,Unlimited,SBD,M,
Boys,82.1,3,Brady Barcheers,Tahoka,81.47,204.12,127.01,188.24,519.36,Unlimited,SBD,M,
Boys,82.1,4,Isaac Florentino,Olton,78.93,197.31,142.88,176.9,517.1,Unlimited,SBD,M,
Boys,82.1,5,Jaxon Dyas,Idalou,80.38,176.9,124.74,192.78,494.42,Unlimited,SBD,M,
Boys,82.1,6,Russell Casillas,Lockney,80.47,183.7,97.52,183.7,464.93,Unlimited,SBD,M,
Boys,82.1,7,Trevor Bridges,Sundown,80.69,172.37,97.52,190.51,460.4,Unlimited,SBD,M,
Boys,82.1,8,Eli Ruiz,Olton,79.29,170.1,90.72,183.7,444.52,Unlimited,SBD,M,
Boys,82.1,9,Demetrio Alvarado,Olton,77.56,140.61,83.91,174.63,399.16,Unlimited,SBD,M,
Boys,82.1,10,Eduardo Sianez,Muleshoe,75.66,136.08,102.06,156.49,394.63,Unlimited,SBD,M,
Boys,82.1,11,Zaiden Perez,Tahoka,78.47,138.35,77.11,142.88,358.34,Unlimited,SBD,M,
Boys,82.1,12,Jesus Caro,Plains,75.8,104.33,77.11,151.95,333.39,Unlimited,SBD,M,
Boys,82.1,13,Keegan Durrett,Wolfforth Frenship,80.88,113.4,83.91,133.81,331.12,Unlimited,SBD,M,
Boys,82.1,14,Zayden Moore,Seagraves,74.89,129.27,70.31,111.13,310.71,Unlimited,SBD,M,
Boys,82.1,15,Corey Nelson,Wolfforth Frenship,80.78,97.52,61.23,120.2,278.96,Unlimited,SBD,M,
Boys,82.1,16,Bradley Saldana,Tahoka,76.07,102.06,61.23,111.13,274.42,Unlimited,SBD,M,
Boys,82.1,17,Caycen Wright,Lockney,75.8,97.52,61.23,113.4,272.16,Unlimited,SBD,M,
Boys,82.1,DQ,Kason Amador,Kress,76.66,235.87,,,,Unlimited,SBD,M,
Boys,89.81,1,Jack Pollard,Wolfforth Frenship,88.59,226.8,151.95,258.55,637.3,Unlimited,SBD,M,
Boys,89.81,2,Cayne Johnson,Brownfield,89.36,240.4,163.29,231.33,635.03,Unlimited,SBD,M,
Boys,89.81,3,Robert Moreno,Crosbyton,86.68,217.72,129.27,233.6,580.6,Unlimited,SBD,M,
Boys,89.81,4,Jake Benedict,Stanton,88.36,199.58,127.01,199.58,526.17,Unlimited,SBD,M,
Boys,89.81,5,Atlas Jones,Wolfforth Frenship,85.28,183.7,120.2,206.38,510.29,Unlimited,SBD,M,
Boys,89.81,6,Nicholas Williams,Wolfforth Frenship,83.96,179.17,131.54,190.51,501.22,Unlimited,SBD,M,
Boys,89.81,7,Jonas Garcia,Brownfield,84.59,183.7,113.4,165.56,462.66,Unlimited,SBD,M,
Boys,89.81,8,Angel Lara,Bovina,85.77,142.88,117.93,174.63,435.45,Unlimited,SBD,M,
Boys,89.81,9,Paul Cody,Kress,83.46,136.08,102.06,181.44,419.57,Unlimited,SBD,M,
Boys,89.81,10,Josiah Mendez,Muleshoe,88.5,142.88,122.47,151.95,417.3,Unlimited,SBD,M,
Boys,89.81,11,Cadon Garcia,Olton,86.18,138.35,99.79,172.37,410.5,Unlimited,SBD,M,
Boys,89.81,12,Evan Jenkins,Muleshoe,85.09,149.69,102.06,156.49,408.23,Unlimited,SBD,M,
Boys,89.81,13,Izais Mendez,Brownfield,84.46,129.27,102.06,151.95,383.29,Unlimited,SBD,M,
Boys,89.81,14,Gael Lozano,Plains,82.28,136.08,77.11,149.69,362.87,Unlimited,SBD,M,
Boys,89.81,15,Martin Franco,Morton,83.1,113.4,95.25,124.74,333.39,Unlimited,SBD,M,
Boys,89.81,16,Wyndun Banta,Crosbyton,82.51,115.67,70.31,124.74,310.71,Unlimited,SBD,M,
Boys,99.79,1,Hector Zamora,Lamesa,95.07,244.94,147.42,231.33,623.69,Unlimited,SBD,M,
Boys,99.79,2,Ethan Hunsaker,Idalou,92.99,226.8,151.95,240.4,619.15,Unlimited,SBD,M,
Boys,99.79,3,Zane McNeil,Idalou,97.79,197.31,147.42,204.12,548.85,Unlimited,SBD,M,
Boys,99.79,4,Evan Martinez,Seagraves,98.38,208.65,127.01,199.58,535.24,Unlimited,SBD,M,
Boys,99.79,5,Joseph O'Canas,Sundown,96.8,219.99,129.27,183.7,532.97,Unlimited,SBD,M,
Boys,99.79,6,Jonathan Badillo,Plains,91.17,197.31,115.67,199.58,512.56,Unlimited,SBD,M,
Boys,99.79,7,Adolfo Garcia,Olton,92.9,174.63,129.27,195.04,498.95,Unlimited,SBD,M,
Boys,99.79,8,Gilberto Marquez,Wolfforth Frenship,97.16,190.51,117.93,190.51,498.95,Unlimited,SBD,M,
Boys,99.79,9,Francisco Lozano,Levelland,92.76,176.9,111.13,204.12,492.15,Unlimited,SBD,M,
Boys,99.79,10,Cesar Ceballos,Olton,99.29,165.56,122.47,190.51,478.54,Unlimited,SBD,M,
Boys,99.79,11,Roman Childers,Crosbyton,98.47,170.1,102.06,192.78,464.93,Unlimited,SBD,M,
Boys,99.79,12,Aaron Garcia,Kress,94.48,158.76,88.45,181.44,428.64,Unlimited,SBD,M,
Boys,99.79,13,Kylan Barcheers,Tahoka,96.03,158.76,79.38,163.29,401.43,Unlimited,SBD,M,
Boys,99.79,14,Phu Nguyen,Wolfforth Frenship,97.39,131.54,92.99,172.37,396.89,Unlimited,SBD,M,
Boys,99.79,15,Alonza Ramirez,Muleshoe,94.89,142.88,88.45,156.49,387.82,Unlimited,SBD,M,
Boys,99.79,16,Julian Cruce,Wolfforth Frenship,95.16,138.35,92.99,151.95,383.29,Unlimited,SBD,M,
Boys,99.79,17,Anthony Villanueva,Muleshoe,97.66,136.08,83.91,158.76,378.75,Unlimited,SBD,M,
Boys,99.79,18,Christian Ammons,Tahoka,90.26,145.15,77.11,145.15,367.41,Unlimited,SBD,M,
Boys,99.79,19,Rylan Garcia,Idalou,95.89,92.99,88.45,163.29,344.73,Unlimited,SBD,M,
Boys,99.79,DQ,Westin Hill,Wolfforth Frenship,95.98,124.74,,,,Unlimited,SBD,M,
Boys,109.77,1,Pablo Herevia,Tahoka,105.28,242.67,174.63,226.8,644.1,Unlimited,SBD,M,
Boys,109.77,2,Zach Gonzales,Sundown,106.28,204.12,124.74,192.78,521.63,Unlimited,SBD,M,
Boys,109.77,3,Lupe Holguin,Seagraves,108.59,199.58,138.35,183.7,521.63,Unlimited,SBD,M,
Boys,109.77,4,Jaiden Duran,Olton,106.59,215.46,111.13,176.9,503.49,Unlimited,SBD,M,
Boys,109.77,5,Christian Quintana,Sundown,102.56,188.24,113.4,154.22,455.86,Unlimited,SBD,M,
Boys,109.77,6,Zheke Solines,Tulia,109.36,170.1,124.74,158.76,453.59,Unlimited,SBD,M,
Boys,109.77,7,Israel Contreras,Plains,105.19,149.69,92.99,142.88,385.55,Unlimited,SBD,M,
Boys,109.77,8,Romeo Castillo,Plains,109,158.76,79.38,145.15,383.29,Unlimited,SBD,M,
Boys,109.77,9,Daniel Mendoza,Muleshoe,103.78,151.95,86.18,142.88,381.02,Unlimited,SBD,M,
Boys,109.77,10,Aaron Moldenado,Tulia,103.06,136.08,102.06,122.47,360.61,Unlimited,SBD,M,
Boys,109.77,11,Westen Cannon,Sudan,102.06,102.06,95.25,142.88,340.19,Unlimited,SBD,M,
Boys,109.77,12,Anthony Frausto,Tulia,106.37,124.74,102.06,108.86,335.66,Unlimited,SBD,M,
Boys,109.77,DQ,Ryan Sosa,Tahoka,100.38,131.54,,,,Unlimited,SBD,M,
Boys,109.77,DQ,Gabriel Harper,Seagraves,103.74,133.81,20.41,,,Unlimited,SBD,M,
Boys,124.74,1,Logan Castaneda,Meadow,124.47,272.16,226.8,244.94,743.89,Unlimited,SBD,M,
Boys,124.74,2,Carlos Salcido,Stanton,120.88,278.96,142.88,204.12,625.96,Unlimited,SBD,M,
Boys,124.74,3,Cooper Gernentz,Stanton,115.67,215.46,154.22,213.19,582.87,Unlimited,SBD,M,
Boys,124.74,4,Justus Johns,Wolfforth Frenship,115.76,204.12,167.83,190.51,562.45,Unlimited,SBD,M,
Boys,124.74,5,Abel Vizcarra,Morton,119.39,199.58,147.42,192.78,539.77,Unlimited,SBD,M,
Boys,124.74,6,Jordan Burns,Kress,120.79,183.7,172.37,183.7,539.77,Unlimited,SBD,M,
Boys,124.74,7,Samuel Espinoza,Muleshoe,118.48,192.78,102.06,142.88,437.72,Unlimited,SBD,M,
Boys,124.74,8,Dallas Barron,Muleshoe,111.27,151.95,97.52,142.88,392.36,Unlimited,SBD,M,
Boys,124.74,9,Jose Rodriguez,Idalou,110.59,147.42,97.52,142.88,387.82,Unlimited,SBD,M,
Boys,124.74,10,Elijah Bilbo,Wolfforth Frenship,117.16,145.15,92.99,145.15,383.29,Unlimited,SBD,M,
Boys,124.74,11,Austin Alvarado,Wolfforth Frenship,113.9,127.01,102.06,151.95,381.02,Unlimited,SBD,M,
Boys,124.74,12,Isaiah Hernandez,Tulia,112.99,142.88,83.91,142.88,369.68,Unlimited,SBD,M,
Boys,124.74,DQ,Mayson Heiberger,Seagraves,110.99,,,,,Unlimited,SBD,M,
Boys,124.74,DQ,Ryder Valdez,Plains,113.9,,,,,Unlimited,SBD,M,
Boys,124.74,DQ,Taige Tindel,Levelland,123.97,,,,,Unlimited,SBD,M,
Boys,139.71,1,Jon Conley,Sudan,136.98,285.76,183.7,229.06,698.53,Unlimited,SBD,M,
Boys,139.71,2,Padro Loredo,Wolfforth Frenship,137.76,263.08,183.7,249.48,696.26,Unlimited,SBD,M,
Boys,139.71,3,Diego Molina,Muleshoe,129.95,206.38,102.06,165.56,474,Unlimited,SBD,M,
Boys,139.71,4,Brayden Chance,Idalou,134.49,170.1,83.91,174.63,428.64,Unlimited,SBD,M,
Boys,139.71+,1,Jesús Rodríguez,Sundown,157.76,272.16,158.76,226.8,657.71,Unlimited,SBD,M,
Boys,139.71+,2,Richard Woodworth,Tahoka,162.98,195.04,115.67,170.1,480.81,Unlimited,SBD,M,
Boys,139.71+,3,Orlando Ortiz,Brownfield,141.61,145.15,97.52,145.15,387.82,Unlimited,SBD,M,
Boys,,NS,Kole Lutrick,Idalou,,,,,,Unlimited,SBD,M,
