Name,Team,Sex,BirthDate,Division,BodyweightKg,WeightClassKg,Squat1Kg,Squat2Kg,Squat3Kg,Best3SquatKg,Bench1Kg,Bench2Kg,Bench3Kg,Best3BenchKg,Deadlift1Kg,Deadlift2Kg,Deadlift3Kg,Best3DeadliftKg,TotalKg,Place,Event,Equipment
Sabine Guillaume,Trilport,F,1963-09-28,F-M4,47.3,47.5,-80,80,-85,80,52.5,-55,55,55,120,125,,125,260,1,SBD,Raw
Marie-Thérèse Jallais,Force,F,1957-07-02,F-M5,49.8,50.5,-75,-75,75,75,-50,50,,50,-85,85,,85,210,1,SBD,Raw
Emilie Martin,Trilport,F,1986-09-01,F-O,54,55.5,90,95,100,100,50,55,60,60,100,110,120,120,280,1,SBD,Raw
Alice Brossault,Individuel,F,1988-04-29,F-O,56.9,58.5,85,90,95,95,45,50,-55,50,120,135,140,140,285,1,SBD,Raw
Blevenecnina Le,Ponnier,F,1972-01-31,F-M2,61.6,63,100,,,100,50,,,50,130,,,130,280,2,SBD,Raw
Marie-Christine Liège,Ponnier,F,1955-07-16,F-M5,67.1,70,72.5,80,85,85,57.5,62.5,-65,62.5,92.5,102.5,,102.5,250,1,SBD,Raw
Ugo Delaunay,Ponnier,M,2002-07-09,M-T2,54.2,56,95,102.5,105,105,60,62.5,-67.5,62.5,105,112.5,117.5,117.5,285,1,SBD,Raw
Kalpakdjian Alexis,Trilport,M,2003-02-20,M-T2,66.6,67.5,100,-112.5,112.5,112.5,60,65,70,70,130,140,150,150,332.5,1,SBD,Raw
Pierre Nguyen,Ponnier,M,1976-12-25,M-M1,67.3,67.5,130,-140,140,140,115,120,,120,150,-162.5,162.5,162.5,422.5,1,SBD,Raw
Nina Leblenec,Ponnier,F,1972-01-31,F-M2,61.6,63,110,,,110,55,,,55,140,150,,150,315,1,SBD,Raw
Yohan Ovarbury,Trilport,M,2001-03-13,M-T3,71.6,75,110,-120,127.5,127.5,60,67.5,-72.5,67.5,135,145,155,155,350,1,SBD,Raw
Eric Lagarde,Bonnelles,M,1980-11-10,M-O,73.6,75,125,135,145,145,110,115,-117.5,115,155,165,175,175,435,2,SBD,Raw
Yohann Grandjean,Ponnier,M,1992-01-17,M-O,73.8,75,117.5,125,-130,125,95,100,105,105,160,170,-182.5,170,400,3,SBD,Raw
Paul Reiners,Ponnier,M,1993-10-22,M-O,73.3,75,160,-167.5,-170,160,112.5,-117.5,,112.5,200,210,,210,482.5,1,SBD,Raw
Pascal Costa,Vitry,M,1967-01-04,M-M3,,75,,,,,,,,,,,,,,DQ,SBD,Raw
Philippe Courtois,Force,M,1964-09-24,M-M4,73.7,75,-160,160,,160,125,132.5,137.5,137.5,180,200,,200,497.5,1,SBD,Raw
Patrick Tellier,Bonnelles,M,1955-06-21,M-M5,74.5,75,100,-107.5,107.5,107.5,87.5,92.5,-95,92.5,127.5,137.5,142.5,142.5,342.5,1,SBD,Raw
Jean Palicot,Trilport,M,1953-05-03,M-M6,73.1,75,110,117.5,122.5,122.5,70,72.5,75,75,145,155,162.5,162.5,360,1,SBD,Raw
Nicola Carbone,Ponnier,M,2001-01-17,M-T3,77.1,82.5,130,137.5,142.5,142.5,75,80,82.5,82.5,135,-142.5,-142.5,135,360,1,SBD,Raw
Kenny Bourgeois,Ponnier,M,1981-03-06,M-O,79.6,82.5,180,190,200,200,-105,105,110,110,210,230,240,240,550,1,SBD,Raw
Jérémy Froment,Trilport,M,1991-12-23,M-O,79.5,82.5,170,177.5,182.5,182.5,115,120,-125,120,205,215,227.5,227.5,530,2,SBD,Raw
Stéphane Jezequel,Trilport,M,1973-05-29,M-M2,83.8,90,122.5,132.5,135,135,122.5,127.5,132.5,132.5,152.5,162.5,,162.5,430,2,SBD,Raw
Morvillez Florian,Ponnier,M,1981-07-18,M-O,86.8,90,170,180,,180,130,135,,135,200,210,220,220,535,2,SBD,Raw
William Kadmiry,Ponnier,M,1991-03-04,M-O,90,90,170,180,185,185,125,-132.5,,125,207.5,220,227.5,227.5,537.5,1,SBD,Raw
Sami Abdo,Individuel,M,1994-03-21,M-O,88.6,90,160,170,-180,170,120,125,130,130,215,225,235,235,535,3,SBD,Raw
Denis Handala,Ponnier,M,1970-04-03,M-M2,85.5,90,180,,,180,120,,,120,202.5,,,202.5,502.5,1,SBD,Raw
Patrick Valfrey,Rioz,M,1965-02-23,M-M3,88.3,90,160,170,180,180,120,127.5,132.5,132.5,187.5,200,,200,512.5,1,SBD,Raw
Antonio Carbone,Ponnier,M,1956-02-14,M-M5,79.3,82.5,130,140,,140,75,80,,80,160,170,,170,390,1,SBD,Raw
Cédric Munoz,Ponnier,M,1984-08-12,M-O,93.5,100,160,170,185,185,140,150,160,160,220,235,250,250,595,1,SBD,Raw
David Mssa,Ponnier,M,1981-10-10,M-O,91.7,100,-170,170,,170,120,130,-137.5,130,220,240,260,260,560,2,SBD,Raw
François Kalic,Trilport,M,1965-06-12,M-M3,99,100,192.5,202.5,,202.5,165,170,,170,200,212.5,230,230,602.5,1,SBD,Raw
Jean-Michel Mattera,Force,M,1956-07-15,M-M5,96,100,-190,-190,190,190,130,,,130,180,200,-220,200,520,1,SBD,Raw
Serge Bustreel,Trilport,M,1946-05-24,M-M7,98.5,100,190,-200,-200,190,95,105,115,115,215,225,235,235,540,1,SBD,Raw
Julien Villin,Castelnau,M,1989-09-08,M-O,101,110,170,190,202.5,202.5,130,142.5,-150,142.5,250,270,280,280,625,1,SBD,Raw
Martineau Yannick,Ponnier,M,1985-12-13,M-O,104,110,150,160,-170,160,95,102.5,-107.5,102.5,150,165,175,175,437.5,2,SBD,Raw
Gilles Hubert,Bonnelles,M,1965-06-04,M-M3,103.5,110,180,190,200,200,122.5,127.5,-130,127.5,225,240,-250,240,567.5,1,SBD,Raw
Sophie Angenot,Force,F,1966-04-10,F-M3,61.2,63,,,,,52.5,-57.5,57.5,57.5,,,,,57.5,2,B,Raw
Marie Julien,Ponnier,F,1994-02-17,F-O,,63,,,,,,,,,,,,,,DQ,B,Raw
Jean-Michel Moreiro,Vitry,M,1953-04-13,M-M6,59.3,60,,,,,72.5,77.5,-80,77.5,,,,,77.5,2,B,Raw
Thomas Dupre,Soissons,M,1985-12-01,M-O,67.1,67.5,,,,,-130,130,-140,130,,,,,130,1,B,Raw
Sébastien Britó,Individuel,M,1986-03-23,M-O,66.7,67.5,,,,,117.5,122.5,-127.5,122.5,,,,,122.5,2,B,Raw
Mathieu Coudriaud,Vitry,M,1986-08-26,M-O,71.2,75,,,,,135,-145,-145,135,,,,,135,2,B,Raw
Frédéric Saunois,Physic,M,1965-05-15,M-M3,73.6,75,,,,,130,135,-137.5,135,,,,,135,2,B,Raw
Thierry Behier,Bonnelles,M,1962-07-19,M-M4,74,75,,,,,92.5,97.5,-100,97.5,,,,,97.5,1,B,Raw
Nicolas Isacesco,Vitry,M,1962-12-07,M-M4,75.3,82.5,,,,,82.5,-90,90,90,,,,,90,5,B,Raw
Pierre Soumagne,Soissons,M,1987-10-01,M-O,79.9,82.5,,,,,112.5,-117.5,-117.5,112.5,,,,,112.5,1,B,Raw
Fabrice Mounaboro,Trilport,M,1973-12-21,M-M2,81.2,82.5,,,,,105,110,-117.5,110,,,,,110,1,B,Raw
Frédéric Creste,Bonnelles,M,1971-03-08,M-M2,81.6,82.5,,,,,100,-105,-105,100,,,,,100,2,B,Raw
Gilles Laversanne,Soissons,M,1961-02-07,M-M4,80.9,82.5,,,,,105,110,120,120,,,,,120,3,B,Raw
Pascal Gourdin,Sedan,M,1961-06-06,M-M4,78.7,82.5,,,,,-115,117.5,120,120,,,,,120,2,B,Raw
Michel Soranzo,Bonnelles,M,1958-03-21,M-M5,81.7,82.5,,,,,112.5,117.5,120,120,,,,,120,2,B,Raw
Freddy Blanchart,Soissons,M,1957-08-19,M-M5,80.8,82.5,,,,,95,100,105,105,,,,,105,3,B,Raw
Yann Leroy,Vitry,M,1982-03-17,M-O,107.1,110,,,,,160,170,180,180,,,,,180,1,B,Raw
David Hernandez #1,Iron,M,1981-07-07,M-O,138.8,145,,,,,200,,,200,,,,,200,1,B,Raw
Vincent Virly,Trilport,M,1981-12-22,M-O,,90,,,,,,,,,,,,,,DQ,B,Raw
Rudy Pereira,Physic,M,1971-08-31,M-M2,89.9,90,,,,,125,130,-135,130,,,,,130,3,B,Raw
Jean-Michel Flandre,Physic,M,1974-05-31,M-M2,85.1,90,,,,,150,160,162.5,162.5,,,,,162.5,2,B,Raw
Patrick Blevenec,Ponnier,M,1963-04-08,M-M4,89.4,90,,,,,140,,,140,,,,,140,2,B,Raw
Patrick Simonin,Rioz,M,1956-07-21,M-M5,87.8,90,,,,,120,125,130,130,,,,,130,1,B,Raw
Michel Rioland,Vitry,M,1948-04-21,M-M7,82.5,82.5,,,,,95,-100,100,100,,,,,100,2,B,Raw
Cédric Gérard,Physic,M,1984-09-14,M-O,97.7,100,,,,,147.5,155,-160,155,,,,,155,1,B,Raw
Patrick Lecoche,Physic,M,1974-08-12,M-M2,97.8,100,,,,,-132.5,132.5,137.5,137.5,,,,,137.5,2,B,Raw
Armand Petitjean,Soissons,M,1971-10-19,M-M2,94.2,100,,,,,125,132.5,140,140,,,,,140,1,B,Raw
William Thiec,Trilport,M,1968-09-12,M-M3,96.6,100,,,,,125,-132.5,132.5,132.5,,,,,132.5,1,B,Raw
Régis Rousseau,Soissons,M,1965-06-03,M-M3,98.2,100,,,,,110,112.5,115,115,,,,,115,2,B,Raw
Sophie Angenot,Force,F,1966-04-10,F-M3,61.2,63,,,,,70,75,-80,75,,,,,75,1,B,Raw
Jean-Michel Moreiro,Vitry,M,1953-04-13,M-M6,59.3,60,,,,,85,-90,-90,85,,,,,85,1,B,Raw
Mathieu Coudriaud,Vitry,M,1986-08-26,M-O,71.2,75,,,,,160,-170,,160,,,,,160,1,B,Raw
Frédéric Saunois,Physic,M,1965-05-15,M-M3,73.6,75,,,,,150,155,-160,155,,,,,155,1,B,Raw
Nicolas Isacesco,Vitry,M,1962-12-07,M-M4,75.3,82.5,,,,,105,-110,110,110,,,,,110,4,B,Raw
Patrick Tellier,Bonnelles,M,1955-06-21,M-M5,74.5,75,,,,,112.5,117.5,-122.5,117.5,,,,,117.5,1,B,Raw
Frédéric Creste,Bonnelles,M,1971-03-08,M-M2,81.6,82.5,,,,,-110,-110,,,,,,,,DQ,B,Raw
Pascal Gourdin,Sedan,M,1961-06-06,M-M4,78.7,82.5,,,,,140,145,-147.5,145,,,,,145,1,B,Raw
Michel Soranzo,Bonnelles,M,1958-03-21,M-M5,81.7,82.5,,,,,135,140,-145,140,,,,,140,1,B,Raw
Patrick Phelippe,Bonnelles,M,1952-05-22,M-M6,81.8,82.5,,,,,100,105,-110,105,,,,,105,1,B,Raw
Jean-Michel Flandre,Physic,M,1974-05-31,M-M2,85.1,90,,,,,155,175,-180,175,,,,,175,1,B,Raw
Patrick Valfrey,Rioz,M,1965-02-23,M-M3,88.3,90,,,,,155,165,170,170,,,,,170,1,B,Raw
Patrick Blevenec,Ponnier,M,1963-04-08,M-M4,89.4,90,,,,,145,-155,165,165,,,,,165,1,B,Raw
Michel Rioland,Vitry,M,1948-04-21,M-M7,82.5,82.5,,,,,-105,-105,105,105,,,,,105,1,B,Raw
Marie Julien,Ponnier,F,1994-02-17,F-O,,70,,,,,,,,,,,,,,DQ,D,Raw
Adriano Costa,Trilport,M,1963-01-13,M-M4,70.1,75,,,,,,,,,180,190,202.5,202.5,202.5,1,D,Raw
Antoine Vasco,Trilport,M,1992-05-20,M-O,78.4,82.5,,,,,,,,,175,-187.5,187.5,187.5,187.5,2,D,Raw
Antoine Vasco,Trilport,M,1992-05-20,M-O,78.4,82.5,,,,,,,,,180,-200,200,200,200,1,D,Raw
David Mssa,Ponnier,M,1981-10-10,M-O,91.7,100,,,,,,,,,-232.5,232.5,,232.5,232.5,1,D,Raw
Emmanuel Preclaire,Ponnier,M,1970-08-16,M-M2,89.2,90,,,,,,,,,200,,,200,200,2,D,Raw
Emmanuel Preclaire,Ponnier,M,1970-08-16,M-M2,89.2,90,,,,,,,,,210,,,210,210,1,D,Raw
Mathieu Baudin,Trilport,M,1998-12-28,M-JR,98,100,,,,,,,,,205,210,-225,210,210,1,D,Raw
Marlène Bachelard,Trilport,F,1997-10-09,F-JR,57.5,58.5,120,125,130,130,,,,,,,,,130,1,S,Raw
Annabelle Daijardin,Trilport,F,1989-11-08,F-O,69,70,115,120,-125,120,,,,,,,,,120,1,S,Raw
Adriano Costa,Trilport,M,1963-01-13,M-M4,70.1,75,145,155,162.5,162.5,,,,,,,,,162.5,1,S,Raw
Emmanuel Preclaire,Ponnier,M,1970-08-16,M-M2,89.2,90,-180,-180,180,180,,,,,,,,,180,1,S,Raw
