Division,WeightClassKg,Place,Name,Team,BodyweightKg,Best3SquatKg,Best3BenchKg,Best3DeadliftKg,TotalKg,Equipment,Event,Sex,BirthDate
Boys,51.71,1,Miguel Juarez,Rosebud-Lott,50.8,131.54,72.57,151.95,356.07,Unlimited,SBD,M,
Boys,51.71,2,Aiden Cruz,Rosebud-Lott,49.9,115.67,81.65,136.08,333.39,Unlimited,SBD,M,
Boys,51.71,3,Joshwa Marquez,Hutto,50.44,113.4,70.31,136.08,319.78,Unlimited,SBD,M,
Boys,51.71,4,Jonny Cartwright,Rosebud-Lott,46.63,111.13,65.77,122.47,299.37,Unlimited,SBD,M,
Boys,51.71,5,Mark Delgado,Killeen Shoemaker,51.12,117.93,52.16,111.13,281.23,Unlimited,SBD,M,
Boys,51.71,6,James Braden,Copperas Cove,49.71,90.72,65.77,113.4,269.89,Unlimited,SBD,M,
Boys,55.79,1,Christopher Varona,Copperas Cove,54.93,158.76,88.45,161.03,408.23,Unlimited,SBD,M,
Boys,55.79,2,Aiden Pankow,Gatesville,55.38,120.2,68.04,122.47,310.71,Unlimited,SBD,M,
Boys,55.79,3,Alan Fabela,Waco University,55.79,111.13,68.04,129.27,308.44,Unlimited,SBD,M,
Boys,55.79,DQ,Marshall Naumann,Waco Midway,55.2,140.61,,,,Unlimited,SBD,M,
Boys,59.87,1,Tim Kruger,Rosebud-Lott,58.11,151.95,102.06,145.15,399.16,Unlimited,SBD,M,
Boys,59.87,2,Austin Pickle,Gatesville,59.24,142.88,92.99,145.15,381.02,Unlimited,SBD,M,
Boys,59.87,3,Colby Aaron,Gatesville,59.42,115.67,81.65,145.15,342.46,Unlimited,SBD,M,
Boys,59.87,4,Taven Draper,Copperas Cove,55.93,61.23,61.23,108.86,231.33,Unlimited,SBD,M,
Boys,59.87,4,Ethan Walker,Belton,58.2,104.33,77.11,136.08,317.51,Unlimited,SBD,M,
Boys,59.87,5,Cristian Ramirez-Vega,Bartlett,59.19,122.47,70.31,124.74,317.51,Unlimited,SBD,M,
Boys,59.87,6,Austin Easter,Copperas Cove,58.24,86.18,58.97,86.18,231.33,Unlimited,SBD,M,
Boys,59.87,7,Psalms Jones,Killeen Shoemaker,56.43,81.65,43.09,102.06,226.8,Unlimited,SBD,M,
Boys,59.87,8,Josh Hogue,Belton,59.83,72.57,43.09,83.91,199.58,Unlimited,SBD,M,
Boys,59.87,DQ,Jerome Benie,Killeen,59.42,136.08,,,,Unlimited,SBD,M,
Boys,67.13,1,Daniel Rincon,Rosebud-Lott,66.27,231.33,117.93,188.24,537.51,Unlimited,SBD,M,
Boys,67.13,2,Adrian Cashaw,Waco Midway,66.45,210.92,111.13,192.78,514.83,Unlimited,SBD,M,
Boys,67.13,4,Tamarion Travis,Rosebud-Lott,66.5,181.44,92.99,185.97,460.4,Unlimited,SBD,M,
Boys,67.13,5,Stephen Midturi,Temple,64.41,163.29,111.13,158.76,433.18,Unlimited,SBD,M,
Boys,67.13,6,Bryce Andrews,Copperas Cove,66.72,151.95,106.59,158.76,417.3,Unlimited,SBD,M,
Boys,67.13,7,Martin Solhaug,Gatesville,63.23,147.42,99.79,147.42,394.63,Unlimited,SBD,M,
Boys,67.13,8,Evan Studebaker,Hutto,66.86,161.03,88.45,145.15,394.63,Unlimited,SBD,M,
Boys,67.13,9,Omar Shipmon,Killeen,65.23,142.88,92.99,142.88,378.75,Unlimited,SBD,M,
Boys,67.13,10,Alex Perez,Bartlett,67.13,117.93,95.25,133.81,347,Unlimited,SBD,M,
Boys,67.13,11,Josue Ramirez,Bartlett,65.82,145.15,81.65,117.93,344.73,Unlimited,SBD,M,
Boys,67.13,12,Fernando Jumique,Killeen,66.09,120.2,63.5,122.47,306.17,Unlimited,SBD,M,
Boys,67.13,13,Jakoby Perez,Belton,63.96,117.93,63.5,117.93,299.37,Unlimited,SBD,M,
Boys,67.13,14,Cory Hudgins,Killeen Shoemaker,66.27,92.99,63.5,122.47,278.96,Unlimited,SBD,M,
Boys,67.13,DQ,Angel Lemus,Killeen Shoemaker,65.95,149.69,95.25,,,Unlimited,SBD,M,
Boys,67.13,DQ,Bo Ferrell,Waco Midway,64.77,,,,,Unlimited,SBD,M,
Boys,74.84,1,Tristan Pettit,Copperas Cove,67.54,204.12,115.67,222.26,542.04,Unlimited,SBD,M,
Boys,74.84,2,Joshua Beckett,Hutto,70.85,185.97,124.74,179.17,489.88,Unlimited,SBD,M,
Boys,74.84,3,Kyson Ignacio,Copperas Cove,67.31,170.1,90.72,201.85,462.66,Unlimited,SBD,M,
Boys,74.84,3,Darius Thomas,Waco University,72.21,181.44,104.33,176.9,462.66,Unlimited,SBD,M,
Boys,74.84,4,Andrew Spence,Waco Midway,74.43,174.63,106.59,170.1,451.32,Unlimited,SBD,M,
Boys,74.84,5,William Dickerson,Hutto,73.12,149.69,90.72,181.44,421.84,Unlimited,SBD,M,
Boys,74.84,6,Evan Echipare,Belton,70.62,158.76,102.06,156.49,417.3,Unlimited,SBD,M,
Boys,74.84,7,Cody Avant,Rosebud-Lott,73.3,165.56,77.11,161.03,403.7,Unlimited,SBD,M,
Boys,74.84,8,Ladarious Cole,Killeen,74.21,147.42,97.52,154.22,399.16,Unlimited,SBD,M,
Boys,74.84,9,Jamell Shiekh,Copperas Cove,73.98,149.69,79.38,147.42,376.48,Unlimited,SBD,M,
Boys,74.84,10,Jeremiah Martinez,Waco University,72.08,129.27,86.18,151.95,367.41,Unlimited,SBD,M,
Boys,74.84,11,Hunter Frenette,Hutto,72.76,131.54,90.72,142.88,365.14,Unlimited,SBD,M,
Boys,74.84,12,Noah Hernandez,Belton,68.81,136.08,90.72,136.08,362.87,Unlimited,SBD,M,
Boys,74.84,13,Dominic Weinert,Belton,74.39,145.15,83.91,133.81,362.87,Unlimited,SBD,M,
Boys,74.84,DQ,Jaxson Allen,Belton,73.66,129.27,74.84,,,Unlimited,SBD,M,
Boys,74.84,DQ,Sean Mawson,Hutto,72.98,,,,,Unlimited,SBD,M,
Boys,74.84,DQ,Dustin Cruz,Waco University,67.27,,,,,Unlimited,SBD,M,
Boys,82.1,1,Trent Ingram,Waco Midway,81.06,247.21,156.49,208.65,612.35,Unlimited,SBD,M,
Boys,82.1,2,Brayden Mills,Gatesville,80.69,195.04,140.61,244.94,580.6,Unlimited,SBD,M,
Boys,82.1,3,Dutch Nielsen,Gatesville,78.93,208.65,154.22,210.92,573.79,Unlimited,SBD,M,
Boys,82.1,4,Hugo Costilla,Rosebud-Lott,79.06,215.46,136.08,204.12,555.65,Unlimited,SBD,M,
Boys,82.1,5,Logan Morgan,Gatesville,79.06,192.78,129.27,210.92,532.97,Unlimited,SBD,M,
Boys,82.1,6,Keyshawn Dooley,Copperas Cove,75.93,204.12,97.52,181.44,483.08,Unlimited,SBD,M,
Boys,82.1,7,Irving Vences,Bartlett,81.24,204.12,90.72,188.24,483.08,Unlimited,SBD,M,
Boys,82.1,8,Zechariah Ruiz,Waco University,77.43,176.9,106.59,190.51,474,Unlimited,SBD,M,
Boys,82.1,9,Corrion Nealy,Temple,81.69,165.56,106.59,170.1,442.25,Unlimited,SBD,M,
Boys,82.1,10,Justin Yi,Hutto,79.2,149.69,95.25,172.37,417.3,Unlimited,SBD,M,
Boys,82.1,11,Cody Behnk,Belton,77.75,149.69,88.45,147.42,385.55,Unlimited,SBD,M,
Boys,82.1,12,Amiri Bolton,Killeen,75.89,127.01,74.84,154.22,356.07,Unlimited,SBD,M,
Boys,82.1,14,Taven Dudley,Copperas Cove,75.48,79.38,54.43,90.72,224.53,Unlimited,SBD,M,
Boys,82.1,DQ,Byron Crittendon,Temple,78.79,165.56,,,,Unlimited,SBD,M,
Boys,89.81,1,Logan Tays,Rosebud-Lott,86.09,235.87,136.08,204.12,576.06,Unlimited,SBD,M,
Boys,89.81,2,Andrew Solomon,Temple,88.18,204.12,129.27,224.53,557.92,Unlimited,SBD,M,
Boys,89.81,3,Kaden Coffman,Gatesville,89.09,215.46,145.15,195.04,555.65,Unlimited,SBD,M,
Boys,89.81,4,Brayden Daniel,Hutto,86.41,192.78,120.2,210.92,523.9,Unlimited,SBD,M,
Boys,89.81,5,Ross Yharte,Hutto,85.23,188.24,122.47,204.12,514.83,Unlimited,SBD,M,
Boys,89.81,6,Aiden Burdicki,Copperas Cove,83.82,181.44,127.01,204.12,512.56,Unlimited,SBD,M,
Boys,89.81,7,Chase Hamilton,Copperas Cove,85.55,204.12,117.93,190.51,512.56,Unlimited,SBD,M,
Boys,89.81,8,Thomas Vidana,Waco University,89.22,192.78,113.4,192.78,498.95,Unlimited,SBD,M,
Boys,89.81,9,Marcuantonio Caballero,Killeen,85.68,172.37,97.52,165.56,435.45,Unlimited,SBD,M,
Boys,89.81,10,Anthony Navarro,Waco University,89.81,151.95,124.74,158.76,435.45,Unlimited,SBD,M,
Boys,89.81,11,Teiaurone Thomas,Temple,87.09,133.81,113.4,174.63,421.84,Unlimited,SBD,M,
Boys,89.81,12,Demetrius Easterling,Killeen,88.04,102.06,97.52,147.42,347,Unlimited,SBD,M,
Boys,89.81,DQ,Draven Henderson,Gatesville,89.22,192.78,,,,Unlimited,SBD,M,
Boys,89.81,DQ,Dominic Miles,Copperas Cove,84.32,,,,,Unlimited,SBD,M,
Boys,99.79,1,Gilbert Davis,Copperas Cove,99.65,226.8,156.49,249.48,632.76,Unlimited,SBD,M,
Boys,99.79,2,Luke Price,Rosebud-Lott,98.07,229.06,188.24,190.51,607.81,Unlimited,SBD,M,
Boys,99.79,3,Chris Hiatt,Waco Midway,94.03,247.21,142.88,210.92,601.01,Unlimited,SBD,M,
Boys,99.79,4,Willie Thomas,Killeen Shoemaker,93.98,242.67,122.47,231.33,596.47,Unlimited,SBD,M,
Boys,99.79,5,Joe Cox,Gatesville,99.11,217.72,145.15,208.65,571.53,Unlimited,SBD,M,
Boys,99.79,6,Jammie Smart,Killeen Shoemaker,95.3,183.7,120.2,219.99,523.9,Unlimited,SBD,M,
Boys,99.79,7,Brody Brown,Gatesville,92.03,190.51,138.35,163.29,492.15,Unlimited,SBD,M,
Boys,99.79,8,Gabe Armenta,Copperas Cove,95.62,154.22,115.67,176.9,446.79,Unlimited,SBD,M,
Boys,99.79,9,David Wehr,Hutto,98.88,127.01,106.59,183.7,417.3,Unlimited,SBD,M,
Boys,99.79,10,Cameron Jones,Belton,94.39,97.52,81.65,142.88,322.05,Unlimited,SBD,M,
Boys,99.79,11,Sylas Lopez,Belton,95.39,102.06,77.11,113.4,292.57,Unlimited,SBD,M,
Boys,99.79,DQ,Brayden Chelmo,Waco University,93.44,224.53,161.03,233.6,,Unlimited,SBD,M,
Boys,109.77,1,Garrett Cook,Rosebud-Lott,103.28,231.33,167.83,256.28,655.44,Unlimited,SBD,M,
Boys,109.77,2,Jay Garcia,Bartlett,102.56,265.35,133.81,235.87,635.03,Unlimited,SBD,M,
Boys,109.77,3,Konner Ziegelt,Waco Midway,105.91,256.28,158.76,213.19,628.23,Unlimited,SBD,M,
Boys,109.77,4,Wacey Saunders,Gatesville,108.36,206.38,124.74,188.24,519.36,Unlimited,SBD,M,
Boys,109.77,5,Jackson Walker,Rosebud-Lott,103.1,185.97,133.81,183.7,503.49,Unlimited,SBD,M,
Boys,109.77,6,Kellen Littles,Hutto,104.14,181.44,129.27,190.51,501.22,Unlimited,SBD,M,
Boys,109.77,7,Zephaniah Sio,Temple,105.6,167.83,127.01,204.12,498.95,Unlimited,SBD,M,
Boys,109.77,8,Samuel Johnson,Hutto,104.83,170.1,99.79,226.8,496.68,Unlimited,SBD,M,
Boys,109.77,9,Le'Andro Ruiz,Killeen Shoemaker,109.68,181.44,120.2,163.29,464.93,Unlimited,SBD,M,
Boys,109.77,10,Justin Portillo,Rosebud-Lott,108.82,172.37,88.45,176.9,437.72,Unlimited,SBD,M,
Boys,109.77,11,Malakai Thornton,Killeen,103.56,158.76,102.06,172.37,433.18,Unlimited,SBD,M,
Boys,109.77,12,Jayce Ceglarek,Temple,103.87,158.76,113.4,158.76,430.91,Unlimited,SBD,M,
Boys,109.77,DQ,Javier Agard,Temple,102.33,195.04,,,,Unlimited,SBD,M,
Boys,109.77,DQ,Mark Aleman,Hutto,107.86,233.6,113.4,,,Unlimited,SBD,M,
Boys,109.77,DQ,Michael Morgan,Copperas Cove,105.05,224.53,165.56,,,Unlimited,SBD,M,
Boys,124.74,1,Brady Strickland,Hutto,123.65,297.1,147.42,249.48,694,Unlimited,SBD,M,
Boys,124.74,2,David Gallegos,Bartlett,120.2,247.21,122.47,219.99,589.67,Unlimited,SBD,M,
Boys,124.74,3,Lane Gardner,Waco Midway,115.26,226.8,145.15,215.46,587.4,Unlimited,SBD,M,
Boys,124.74,4,Xavier Watkins,Killeen Shoemaker,120.66,208.65,124.74,235.87,569.26,Unlimited,SBD,M,
Boys,124.74,5,Kobe Hadley,Copperas Cove,118.66,247.21,129.27,181.44,557.92,Unlimited,SBD,M,
Boys,124.74,6,Gilberto Dowling,Waco University,113.85,204.12,124.74,190.51,519.36,Unlimited,SBD,M,
Boys,124.74,7,Douglas Houser,Hutto,121.88,192.78,108.86,190.51,492.15,Unlimited,SBD,M,
Boys,124.74,8,Fredrick Clarke,Killeen,113.4,185.97,102.06,185.97,474,Unlimited,SBD,M,
Boys,124.74,9,Levi Compton,Hutto,118.39,174.63,92.99,185.97,453.59,Unlimited,SBD,M,
Boys,124.74,10,Rion Childers,Copperas Cove,116.48,265.35,165.56,,430.91,Unlimited,SB,M,
Boys,124.74,11,John Santa,Killeen Shoemaker,112.72,115.67,54.43,142.88,312.98,Unlimited,SBD,M,
Boys,124.74,DQ,Ayden Tuiaana,Killeen Shoemaker,113.13,179.17,115.67,,,Unlimited,SBD,M,
Boys,124.74,DQ,Harris Clark,Killeen,124.42,136.08,102.06,122.47,,Unlimited,SBD,M,
Boys,139.71,1,Grayson Burden,Copperas Cove,136.21,272.16,170.1,242.67,684.92,Unlimited,SBD,M,
Boys,139.71,2,Bradley Fillmore,Temple,132.54,208.65,149.69,210.92,569.26,Unlimited,SBD,M,
Boys,139.71,3,Patrick Douglas,Temple,129.46,226.8,145.15,190.51,562.45,Unlimited,SBD,M,
Boys,139.71,4,Teron Jackson,Killeen,138.98,233.6,142.88,170.1,546.58,Unlimited,SBD,M,
Boys,139.71,5,Armando Rodriguez,Waco University,134.72,188.24,127.01,183.7,498.95,Unlimited,SBD,M,
Boys,139.71,6,Rocky Sosa,Hutto,132.59,167.83,102.06,210.92,480.81,Unlimited,SBD,M,
Boys,139.71,7,Yovani Enriquez,Waco University,134.08,174.63,102.06,197.31,474,Unlimited,SBD,M,
Boys,139.71,8,Christian Bennett,Copperas Cove,137.85,188.24,95.25,147.42,430.91,Unlimited,SBD,M,
Boys,139.71,9,Timothy Shaw,Killeen,134.04,142.88,88.45,120.2,351.53,Unlimited,SBD,M,
Boys,139.71+,1,Carlos Navarro,Waco University,140.3,294.84,170.1,229.06,694,Unlimited,SBD,M,
Boys,139.71+,2,Jayden Mack,Hutto,155.31,276.69,154.22,238.14,669.05,Unlimited,SBD,M,
Boys,139.71+,3,Q'Terrius White,Temple,154.67,172.37,136.08,185.97,494.42,Unlimited,SBD,M,
Boys,139.71+,4,Isaiah Guerra,Temple,149.32,185.97,117.93,188.24,492.15,Unlimited,SBD,M,
