Division,WeightClassKg,Place,Name,Team,BodyweightKg,Best3SquatKg,Best3BenchKg,Best3DeadliftKg,TotalKg,Equipment,Event,Sex,BirthDate
Boys,59.87,1,Johnathan Guerrero,Yorktown,59.69,183.7,102.06,188.24,474,Unlimited,SBD,M,
Boys,59.87,2,Paiton Cantu,Poth,57.52,149.69,90.72,142.88,383.29,Unlimited,SBD,M,
Boys,59.87,3,Jo Nathan Garcia,Floresville,59.87,140.61,92.99,138.35,371.95,Unlimited,SBD,M,
Boys,67.13,1,Jared Dadear,Kenedy,65.86,181.44,138.35,190.51,510.29,Unlimited,SBD,M,
Boys,67.13,2,Nathaniel Serna,Kenedy,67.13,188.24,124.74,183.7,496.68,Unlimited,SBD,M,
Boys,67.13,3,Justin Edison,Goliad,65.86,167.83,120.2,179.17,467.2,Unlimited,SBD,M,
Boys,67.13,4,Jose Cervantes,Kenedy,64.68,165.56,102.06,181.44,449.06,Unlimited,SBD,M,
Boys,67.13,5,Alexis Santos,Stockdale,66.95,156.49,86.18,165.56,408.23,Unlimited,SBD,M,
Boys,67.13,6,Fransisco Aleman,Kenedy,65.59,147.42,92.99,165.56,405.97,Unlimited,SBD,M,
Boys,67.13,7,Conner Serece,Cuero,66.5,124.74,86.18,142.88,353.8,Unlimited,SBD,M,
Boys,67.13,8,Maddox Simpson,Goliad,65.86,131.54,70.31,142.88,344.73,Unlimited,SBD,M,
Boys,67.13,9,Alexis Cano-Rodriguez,Converse Judson,62.23,117.93,79.38,133.81,331.12,Unlimited,SBD,M,
Boys,67.13,10,Christian Gips,Yorktown,65.95,120.2,83.91,113.4,317.51,Unlimited,SBD,M,
Boys,67.13,DQ,Andrew Briones,Floresville,66.86,142.88,,,,Unlimited,SBD,M,
Boys,74.84,1,Ricky Ayala,Stockdale,70.85,183.7,115.67,208.65,508.02,Unlimited,SBD,M,
Boys,74.84,2,Philip Alm,Cuero,71.03,176.9,131.54,183.7,492.15,Unlimited,SBD,M,
Boys,74.84,3,C J Rucker,Stockdale,70.76,183.7,102.06,174.63,460.4,Unlimited,SBD,M,
Boys,74.84,4,Elian Sanchez,Goliad,74.57,165.56,106.59,183.7,455.86,Unlimited,SBD,M,
Boys,74.84,5,Jerusha Velasquez,Kenedy,68.86,183.7,102.06,161.03,446.79,Unlimited,SBD,M,
Boys,74.84,6,Caqmden Derricoatte,Stockdale,68.86,167.83,97.52,174.63,439.98,Unlimited,SBD,M,
Boys,74.84,7,Ja'Corey Dukes,Converse Judson,74.84,142.88,83.91,185.97,412.77,Unlimited,SBD,M,
Boys,74.84,8,Travis Warklas,Yorktown,74.12,151.95,106.59,151.95,410.5,Unlimited,SBD,M,
Boys,74.84,9,Daniel Schaefer,Floresville,71.67,165.56,79.38,147.42,392.36,Unlimited,SBD,M,
Boys,74.84,10,Zachary Maldonado,Cuero,68.76,140.61,68.04,174.63,383.29,Unlimited,SBD,M,
Boys,74.84,11,Hunter Mullins,Kenedy,70.85,127.01,77.11,174.63,378.75,Unlimited,SBD,M,
Boys,74.84,12,Kendall Robinson,Converse Judson,73.84,106.59,88.45,179.17,374.21,Unlimited,SBD,M,
Boys,82.1,1,Josh Valdez,Goliad,80.38,226.8,147.42,195.04,569.26,Unlimited,SBD,M,
Boys,82.1,2,Barrett Smith,Cuero,80.92,188.24,136.08,188.24,512.56,Unlimited,SBD,M,
Boys,82.1,3,Ray Espinoza,Beeville Jones,80.29,183.7,142.88,176.9,503.49,Unlimited,SBD,M,
Boys,82.1,4,Lucas Gaitan,Beeville Jones,76.93,195.04,113.4,163.29,471.74,Unlimited,SBD,M,
Boys,82.1,5,Nathan Gonzales,Floresville,77.47,167.83,102.06,192.78,462.66,Unlimited,SBD,M,
Boys,82.1,6,Jack LaFleur,Floresville,80.83,181.44,102.06,172.37,455.86,Unlimited,SBD,M,
Boys,82.1,7,Korbin Flessner,Cuero,79.74,145.15,92.99,136.08,374.21,Unlimited,SBD,M,
Boys,82.1,8,Manuel Macias,Yorktown,81.56,129.27,74.84,136.08,340.19,Unlimited,SBD,M,
Boys,82.1,9,Scott Oberheide,Pawnee,81.01,104.33,54.43,113.4,272.16,Unlimited,SBD,M,
Boys,82.1,DQ,Marquis Gonzales,Floresville,81.83,163.29,,,,Unlimited,SBD,M,
Boys,89.81,1,Michael Romo,Kenedy,88.99,197.31,156.49,192.78,546.58,Unlimited,SBD,M,
Boys,89.81,2,Richard Wilson,Kenedy,87.36,217.72,131.54,170.1,519.36,Unlimited,SBD,M,
Boys,89.81,3,Jojo Martinez,Goliad,85.91,190.51,124.74,190.51,505.76,Unlimited,SBD,M,
Boys,89.81,4,Dominic Smith,Beeville Jones,87.63,183.7,127.01,190.51,501.22,Unlimited,SBD,M,
Boys,89.81,5,Jackson Austin,Floresville,89.63,185.97,106.59,179.17,471.74,Unlimited,SBD,M,
Boys,89.81,6,Gavin Flessner,Cuero,86.45,181.44,120.2,163.29,464.93,Unlimited,SBD,M,
Boys,89.81,7,Ryan Bradstreet,Floresville,85.55,165.56,88.45,176.9,430.91,Unlimited,SBD,M,
Boys,89.81,8,Jesse Ventura,Converse Judson,89.81,151.95,102.06,165.56,419.57,Unlimited,SBD,M,
Boys,89.81,9,Ethan Engler,Stockdale,89.63,158.76,102.06,154.22,415.04,Unlimited,SBD,M,
Boys,89.81,DQ,Ryne Espinoza,Beeville Jones,86.91,288.03,190.51,,,Unlimited,SBD,M,
Boys,99.79,1,Jacob Martin,Beeville Jones,98.07,251.74,170.1,219.99,641.83,Unlimited,SBD,M,
Boys,99.79,2,Justin Guerrero,Yorktown,95.62,233.6,136.08,181.44,551.11,Unlimited,SBD,M,
Boys,99.79,3,Johnathan Perez,Cuero,99.7,204.12,136.08,195.04,535.24,Unlimited,SBD,M,
Boys,99.79,4,Brady McClure,Poth,98.97,226.8,104.33,185.97,517.1,Unlimited,SBD,M,
Boys,99.79,5,Carlos Loredo,Beeville Jones,90.81,204.12,111.13,192.78,508.02,Unlimited,SBD,M,
Boys,99.79,6,Trent Leal,Floresville,93.98,192.78,111.13,197.31,501.22,Unlimited,SBD,M,
Boys,99.79,7,Julian Black,Converse Judson,97.89,179.17,104.33,201.85,485.34,Unlimited,SBD,M,
Boys,99.79,8,John Baca,Stockdale,90.26,185.97,95.25,167.83,449.06,Unlimited,SBD,M,
Boys,99.79,9,Christian Holland,Converse Judson,96.89,151.95,102.06,183.7,437.72,Unlimited,SBD,M,
Boys,99.79,10,Noah Weghorst,Cuero,94.44,161.03,92.99,142.88,396.89,Unlimited,SBD,M,
Boys,99.79,11,Austin Hernandez,Pawnee,91.44,108.86,54.43,113.4,276.69,Unlimited,SBD,M,
Boys,109.77,1,Adahir Ruiz,Poth,109.77,263.08,183.7,215.46,662.24,Unlimited,SBD,M,
Boys,109.77,2,Jesse Fraga,Kenedy,108.14,249.48,158.76,174.63,582.87,Unlimited,SBD,M,
Boys,109.77,3,Gianni Gibson,Kenedy,104.87,219.99,147.42,197.31,564.72,Unlimited,SBD,M,
Boys,109.77,4,Ethan Sanchez,Beeville Jones,103.06,242.67,115.67,204.12,562.45,Unlimited,SBD,M,
Boys,109.77,5,Rayshawn Black,Converse Judson,100.97,188.24,131.54,192.78,512.56,Unlimited,SBD,M,
Boys,109.77,6,Conner Hajovsky,Stockdale,103.96,181.44,104.33,181.44,467.2,Unlimited,SBD,M,
Boys,109.77,7,Benjamin Flores,Pawnee,100.7,136.08,61.23,124.74,322.05,Unlimited,SBD,M,
Boys,124.74,1,Arnulfo Puga,Beeville Jones,124.65,294.84,185.97,226.8,707.6,Unlimited,SBD,M,
Boys,124.74,2,Daniel Weidner,Poth,124.56,272.16,147.42,249.48,669.05,Unlimited,SBD,M,
Boys,124.74,3,Luke Harris,Converse Judson,122.47,210.92,115.67,233.6,560.19,Unlimited,SBD,M,
Boys,124.74,4,Dj Scott,Poth,120.11,161.03,102.06,167.83,430.91,Unlimited,SBD,M,
Boys,124.74,5,Marcelo Armenta,Beeville Jones,117.66,111.13,102.06,172.37,385.55,Unlimited,SBD,M,
Boys,139.71,1,Jesus Martinez,Beeville Jones,136.53,244.94,183.7,226.8,655.44,Unlimited,SBD,M,
Boys,139.71,2,Alex Brown,Cuero,139.71,260.82,154.22,208.65,623.69,Unlimited,SBD,M,
Boys,139.71+,1,Hunter Hall,Yorktown,146.69,317.51,204.12,242.67,764.3,Unlimited,SBD,M,
Boys,139.71+,2,Peyton Torres,Beeville Jones,151.68,265.35,195.04,226.8,687.19,Unlimited,SBD,M,
Boys,139.71+,3,Lupito Vela,Goliad,142.7,140.61,127.01,147.42,415.04,Unlimited,SBD,M,
