Division,WeightClassKg,Place,Name,Team,BodyweightKg,Best3SquatKg,Best3BenchKg,Best3DeadliftKg,TotalKg,Equipment,Event,Sex,BirthDate
Girls,44.23,1,Callie Greenberg,Hillsboro,44,122.47,63.5,106.59,292.57,Unlimited,SBD,F,
Girls,44.23,2,Alyssa Ruiz,McGregor,43.27,83.91,31.75,74.84,190.51,Unlimited,SBD,F,
Girls,44.23,3,Natalye Oleavrre,Waco Connally,39.01,56.7,31.75,81.65,170.1,Unlimited,SBD,F,
Girls,44.23,4,Leilah Pineda,Moody,43.73,54.43,22.68,49.9,127.01,Unlimited,SBD,F,
Girls,47.85,1,Maria Reyes,Hillsboro,46.81,102.06,61.23,111.13,274.42,Unlimited,SBD,F,
Girls,47.85,2,Lainey Holecek,West,46.81,111.13,49.9,111.13,272.16,Unlimited,SBD,F,
Girls,47.85,3,Sydney Cecil,Clifton,45.27,102.06,54.43,104.33,260.82,Unlimited,SBD,F,
Girls,47.85,4,Marely Villegas,Hillsboro,45.27,92.99,54.43,92.99,240.4,Unlimited,SBD,F,
Girls,47.85,5,Emily Wiethorn,Crawford,46.99,92.99,38.56,97.52,229.06,Unlimited,SBD,F,
Girls,47.85,6,Haley Roman,Waco Connally,47.45,81.65,38.56,95.25,215.46,Unlimited,SBD,F,
Girls,47.85,7,Yozelin Sarabia,Waco La Vega,47.36,77.11,38.56,97.52,213.19,Unlimited,SBD,F,
Girls,47.85,8,Aracelli Munoz,West,46.72,83.91,47.63,77.11,208.65,Unlimited,SBD,F,
Girls,47.85,DQ,Kylie Aerl,Robinson,47.45,,,,,Unlimited,SBD,F,
Girls,51.94,1,Kasey Fitzer,Gatesville,50.8,113.4,81.65,113.4,308.44,Unlimited,SBD,F,
Girls,51.94,2,Reese Finney,Clifton,51.44,90.72,74.84,99.79,265.35,Unlimited,SBD,F,
Girls,51.94,3,Layla Morales,Clifton,49.08,111.13,45.36,104.33,260.82,Unlimited,SBD,F,
Girls,51.94,4,Baylyn Roberts,Gatesville,48.17,86.18,58.97,97.52,242.67,Unlimited,SBD,F,
Girls,51.94,5,Cloe Creech,Hillsboro,51.26,90.72,47.63,102.06,240.4,Unlimited,SBD,F,
Girls,51.94,6,Mello Richardson,Waxahachie Life,48.44,79.38,65.77,90.72,235.87,Unlimited,SBD,F,
Girls,51.94,7,Emmely Sarabia,Waco La Vega,50.98,92.99,38.56,102.06,233.6,Unlimited,SBD,F,
Girls,51.94,8,Sierra Campbell,Moody,50.89,86.18,52.16,88.45,226.8,Unlimited,SBD,F,
Girls,51.94,9,Cinthia Matus,Moody,51.53,86.18,45.36,95.25,226.8,Unlimited,SBD,F,
Girls,51.94,10,Devida Anderson,McGregor,49.08,86.18,36.29,95.25,217.72,Unlimited,SBD,F,
Girls,51.94,DQ,Rori McPherson,Moody,48.17,77.11,,,,Unlimited,SBD,F,
Girls,51.94,DQ,Cerenity Mills,West,50.08,77.11,,,,Unlimited,SBD,F,
Girls,56.02,1,Jaylen Olson,West,55.07,136.08,61.23,131.54,328.85,Unlimited,SBD,F,
Girls,56.02,2,Flor Scott,Hillsboro,54.25,133.81,65.77,124.74,324.32,Unlimited,SBD,F,
Girls,56.02,3,Kensley Eary,Gatesville,52.34,106.59,63.5,113.4,283.5,Unlimited,SBD,F,
Girls,56.02,4,Mckenzie Carmichael,West,54.88,104.33,56.7,113.4,274.42,Unlimited,SBD,F,
Girls,56.02,5,Payton Lalonde-Lee,McGregor,55.16,97.52,61.23,108.86,267.62,Unlimited,SBD,F,
Girls,56.02,6,Marin Seagraves,Gatesville,53.71,88.45,65.77,106.59,260.82,Unlimited,SBD,F,
Girls,56.02,7,Britny Willis,Waco Connally,54.07,90.72,49.9,117.93,258.55,Unlimited,SBD,F,
Girls,56.02,8,Karsyn Cosper,Clifton,55.52,83.91,47.63,104.33,235.87,Unlimited,SBD,F,
Girls,56.02,9,Emory Slater,Clifton,55.16,81.65,52.16,97.52,231.33,Unlimited,SBD,F,
Girls,56.02,10,Aaliyah Medloch,Waco Connally,54.61,83.91,45.36,99.79,229.06,Unlimited,SBD,F,
Girls,56.02,11,Mariah Kerns,Bosqueville,51.98,65.77,43.09,97.52,206.38,Unlimited,SBD,F,
Girls,56.02,12,Anela Johnson,Robinson,53.16,65.77,38.56,92.99,197.31,Unlimited,SBD,F,
Girls,56.02,13,Kathryn Rivera,Robinson,53.07,63.5,36.29,83.91,183.7,Unlimited,SBD,F,
Girls,60.1,1,Addison Macik,West,59.6,158.76,88.45,151.95,399.16,Unlimited,SBD,F,
Girls,60.1,2,Julee Beltran,Hillsboro,60.06,165.56,88.45,127.01,381.02,Unlimited,SBD,F,
Girls,60.1,3,Cameron Ritz,Clifton,56.61,108.86,74.84,122.47,306.17,Unlimited,SBD,F,
Girls,60.1,4,Bela Mondragon,Gatesville,58.06,124.74,77.11,102.06,303.91,Unlimited,SBD,F,
Girls,60.1,5,Alexis Harn,McGregor,59.87,106.59,58.97,102.06,267.62,Unlimited,SBD,F,
Girls,60.1,6,Gracie Schuetz,West,59.69,97.52,56.7,106.59,260.82,Unlimited,SBD,F,
Girls,60.1,7,Avani Olvera,McGregor,58.33,99.79,43.09,111.13,254.01,Unlimited,SBD,F,
Girls,60.1,8,Liberty Braswell,Lorena,58.69,90.72,61.23,99.79,251.74,Unlimited,SBD,F,
Girls,60.1,9,Finley Schill,Robinson,58.88,92.99,52.16,95.25,240.4,Unlimited,SBD,F,
Girls,60.1,10,Caylee Kent,Bosqueville,56.79,81.65,58.97,92.99,233.6,Unlimited,SBD,F,
Girls,60.1,11,Maryella Castano,Waco Connally,58.97,90.72,45.36,97.52,233.6,Unlimited,SBD,F,
Girls,60.1,12,Lola Jaska,West,59.96,90.72,40.82,90.72,222.26,Unlimited,SBD,F,
Girls,60.1,13,Gabriella Turnbo,Moody,58.42,79.38,49.9,81.65,210.92,Unlimited,SBD,F,
Girls,60.1,14,Adalyn Hand,West,58.97,83.91,45.36,70.31,199.58,Unlimited,SBD,F,
Girls,60.1,DQ,Anahi Garcia,Moody,57.33,52.16,,,,Unlimited,SBD,F,
Girls,60.1,DQ,Abigale Warden,Crawford,59.15,,,,,Unlimited,SBD,F,
Girls,67.36,1,Shaylie Teague,Gatesville,64.68,156.49,102.06,156.49,415.04,Unlimited,SBD,F,
Girls,67.36,2,Leslie Lara,West,63.59,145.15,88.45,167.83,401.43,Unlimited,SBD,F,
Girls,67.36,3,Saide Cardenas,Hillsboro,62.78,149.69,90.72,142.88,383.29,Unlimited,SBD,F,
Girls,67.36,4,Roisin Healy,West,62.78,136.08,77.11,147.42,360.61,Unlimited,SBD,F,
Girls,67.36,5,Gloria Guzman,Dallas A+,61.33,124.74,70.31,129.27,324.32,Unlimited,SBD,F,
Girls,67.36,6,Helen Adam,West,66.41,111.13,79.38,117.93,308.44,Unlimited,SBD,F,
Girls,67.36,7,Piper Bennette,Clifton,61.42,113.4,61.23,127.01,301.64,Unlimited,SBD,F,
Girls,67.36,8,Brynlie Vantreese,Hillsboro,62.23,113.4,61.23,122.47,297.1,Unlimited,SBD,F,
Girls,67.36,9,Marli Rieger,West,64.05,117.93,52.16,117.93,288.03,Unlimited,SBD,F,
Girls,67.36,10,Reigan Davidson,Gatesville,65.41,113.4,58.97,108.86,281.23,Unlimited,SBD,F,
Girls,67.36,11,Autumn Smith,Bosqueville,67.31,99.79,58.97,108.86,267.62,Unlimited,SBD,F,
Girls,67.36,12,Rubi Barrios,West,65.45,104.33,52.16,106.59,263.08,Unlimited,SBD,F,
Girls,67.36,13,Kirsten Strelsky,Lorena,63.87,97.52,56.7,102.06,256.28,Unlimited,SBD,F,
Girls,67.36,14,Mayra Ibarra,Waco La Vega,67.04,99.79,45.36,90.72,235.87,Unlimited,SBD,F,
Girls,67.36,15,ALyssa Valadez,Lorena,65.32,90.72,47.63,83.91,222.26,Unlimited,SBD,F,
Girls,67.36,16,Calliegh Roy,Robinson,61.87,65.77,47.63,102.06,215.46,Unlimited,SBD,F,
Girls,67.36,17,Rylie DeLeon,Crawford,60.69,77.11,43.09,90.72,210.92,Unlimited,SBD,F,
Girls,67.36,18,Hailey Nelson,Crawford,61.23,83.91,38.56,81.65,204.12,Unlimited,SBD,F,
Girls,67.36,19,Kaiyah Valasquez,Crawford,60.78,70.31,47.63,74.84,192.78,Unlimited,SBD,F,
Girls,75.07,1,Kaitlyn Baker,Clifton,73.3,149.69,92.99,147.42,390.09,Unlimited,SBD,F,
Girls,75.07,2,Ellie King,Clifton,73.57,145.15,79.38,145.15,369.68,Unlimited,SBD,F,
Girls,75.07,3,Maybree Rosanbalm,Bosqueville,72.12,120.2,72.57,136.08,328.85,Unlimited,SBD,F,
Girls,75.07,4,Timia Bowers,McGregor,74.39,131.54,68.04,120.2,319.78,Unlimited,SBD,F,
Girls,75.07,5,Abigail Vasser,Lorena,70.03,136.08,68.04,113.4,317.51,Unlimited,SBD,F,
Girls,75.07,6,Zoe Garcia,Moody,72.03,117.93,68.04,131.54,317.51,Unlimited,SBD,F,
Girls,75.07,7,MaKenzi Longstreet,West,73.57,122.47,58.97,127.01,308.44,Unlimited,SBD,F,
Girls,75.07,8,Georgina Jasso,Waxahachie Life,73.94,97.52,88.45,113.4,299.37,Unlimited,SBD,F,
Girls,75.07,9,Amy Keeland,Lorena,73.57,111.13,47.63,115.67,274.42,Unlimited,SBD,F,
Girls,75.07,10,Caitlyn Schrank,Lorena,71.3,108.86,43.09,104.33,256.28,Unlimited,SBD,F,
Girls,75.07,11,Jocelyn Barrera,Waco Connally,74.48,97.52,47.63,111.13,256.28,Unlimited,SBD,F,
Girls,75.07,12,Milla Leon,Waxahachie Life,74.66,86.18,56.7,106.59,249.48,Unlimited,SBD,F,
Girls,75.07,13,Hailey Christman,Moody,73.66,77.11,52.16,88.45,217.72,Unlimited,SBD,F,
Girls,75.07,14,Megan Obstoj,Moody,69.58,79.38,49.9,86.18,215.46,Unlimited,SBD,F,
Girls,75.07,DQ,Ashley Gallegos,Hillsboro,72.48,,,,,Unlimited,SBD,F,
Girls,82.33,1,Emma Turner,Robinson,81.65,183.7,106.59,163.29,453.59,Unlimited,SBD,F,
Girls,82.33,2,Sara Silvas,Hillsboro,80.38,149.69,90.72,140.61,381.02,Unlimited,SBD,F,
Girls,82.33,3,Nylah Goff,Clifton,81.83,151.95,86.18,142.88,381.02,Unlimited,SBD,F,
Girls,82.33,4,Lourdes Soria,Hillsboro,79.65,151.95,83.91,140.61,376.48,Unlimited,SBD,F,
Girls,82.33,5,Madison Rhodes,West,80.92,133.81,79.38,145.15,358.34,Unlimited,SBD,F,
Girls,82.33,6,Mykah Salgado,Dallas A+,79.83,142.88,61.23,142.88,347,Unlimited,SBD,F,
Girls,82.33,7,Gabby Gomez,Lorena,75.21,131.54,74.84,136.08,342.46,Unlimited,SBD,F,
Girls,82.33,8,Honor Searcy,Gatesville,80.01,111.13,81.65,117.93,310.71,Unlimited,SBD,F,
Girls,82.33,9,Keyana Webb,Gatesville,80.29,102.06,79.38,129.27,310.71,Unlimited,SBD,F,
Girls,82.33,10,Presley Eubank,Bosqueville,76.38,108.86,63.5,136.08,308.44,Unlimited,SBD,F,
Girls,82.33,11,Xochitl Candelario,Dallas A+,81.74,111.13,61.23,124.74,297.1,Unlimited,SBD,F,
Girls,82.33,12,Kenzie Davis,West,81.1,111.13,61.23,108.86,281.23,Unlimited,SBD,F,
Girls,82.33,13,Chloe Cunningham,Crawford,80.1,111.13,61.23,99.79,272.16,Unlimited,SBD,F,
Girls,82.33,14,Daniela Calzada,Waco Connally,78.38,113.4,49.9,99.79,263.08,Unlimited,SBD,F,
Girls,90.04,1,Lenora Busby,Clifton,84.28,179.17,102.06,179.17,460.4,Unlimited,SBD,F,
Girls,90.04,2,Carli Wright,Bosqueville,88.9,163.29,117.93,158.76,439.98,Unlimited,SBD,F,
Girls,90.04,3,Karissa Treat,Robinson,89.27,170.1,88.45,156.49,415.04,Unlimited,SBD,F,
Girls,90.04,4,Flor Benitez,McGregor,87.09,149.69,77.11,145.15,371.95,Unlimited,SBD,F,
Girls,90.04,5,Aralina Acosta,Lake Belton,84.91,140.61,77.11,142.88,360.61,Unlimited,SBD,F,
Girls,90.04,6,Alondra Medina,Dallas A+,86.91,106.59,52.16,127.01,285.76,Unlimited,SBD,F,
Girls,90.04,7,Christine Brown,Waco Connally,84.91,111.13,61.23,104.33,276.69,Unlimited,SBD,F,
Girls,90.04,8,Rilee Nichols,Dallas A+,88.85,83.91,47.63,92.99,224.53,Unlimited,SBD,F,
Girls,90.04,DQ,Avery Park,Lake Belton,87.82,,,,,Unlimited,SBD,F,
Girls,100.02,1,Taryn Busby,Clifton,94.71,167.83,120.2,179.17,467.2,Unlimited,SBD,F,
Girls,100.02,2,Emma Davidson,Gatesville,97.43,161.03,120.2,120.2,401.43,Unlimited,SBD,F,
Girls,100.02,3,Dakota Vaughn,Clifton,98.52,154.22,83.91,142.88,381.02,Unlimited,SBD,F,
Girls,100.02,4,Sarah Cobarrubias,Waxahachie Life,96.8,158.76,83.91,136.08,378.75,Unlimited,SBD,F,
Girls,100.02,5,Jami Rodriguez,Hillsboro,96.43,165.56,86.18,124.74,376.48,Unlimited,SBD,F,
Girls,100.02,6,Kyli Higginbotham,Lorena,93.35,142.88,63.5,115.67,322.05,Unlimited,SBD,F,
Girls,100.02,7,Kaydence Moss,Bosqueville,97.61,111.13,88.45,120.2,319.78,Unlimited,SBD,F,
Girls,100.02,8,Mi'kel Curtis-Horne,Robinson,99.43,124.74,54.43,136.08,315.25,Unlimited,SBD,F,
Girls,100.02,9,Ana Brown,Waxahachie Life,94.8,83.91,52.16,74.84,210.92,Unlimited,SBD,F,
Girls,100.02,DQ,Autumn Gillaspy,Bosqueville,97.07,138.35,86.18,,,Unlimited,SBD,F,
Girls,110,1,Amariya Watson,Waco La Vega,109.95,176.9,111.13,154.22,442.25,Unlimited,SBD,F,
Girls,110,2,Isabella Perez,Moody,106.05,165.56,92.99,142.88,401.43,Unlimited,SBD,F,
Girls,110,3,Ariya Green,Waco La Vega,104.42,151.95,90.72,124.74,367.41,Unlimited,SBD,F,
Girls,110,4,Alaina Martinez,Waco Connally,108.59,147.42,77.11,120.2,344.73,Unlimited,SBD,F,
Girls,110,5,Julia Petty,Gatesville,107.59,120.2,81.65,124.74,326.59,Unlimited,SBD,F,
Girls,110,6,Mya Perez,Waco Connally,101.33,127.01,68.04,120.2,315.25,Unlimited,SBD,F,
Girls,110,7,Analicia Silva,Gatesville,100.06,111.13,61.23,120.2,292.57,Unlimited,SBD,F,
Girls,110,DQ,Natalia Davis,Waxahachie Life,102.06,156.49,,,,Unlimited,SBD,F,
Girls,110+,1,Brianna Mares,Dallas A+,117.39,199.58,102.06,151.95,453.59,Unlimited,SBD,F,
Girls,110+,2,Juliana Vigil,Bosqueville,130.36,174.63,97.52,138.35,410.5,Unlimited,SBD,F,
Girls,110+,3,Hailey Obstoj,Moody,113.13,154.22,83.91,151.95,390.09,Unlimited,SBD,F,
Girls,110+,4,Perla Escalante,Waco La Vega,159.57,170.1,90.72,113.4,374.21,Unlimited,SBD,F,
Girls,110+,5,Briana Rojas,Dallas A+,132.18,158.76,74.84,133.81,367.41,Unlimited,SBD,F,
Girls,110+,6,Reyna Williams,Waxahachie Life,111.22,131.54,95.25,131.54,358.34,Unlimited,SBD,F,
Girls,110+,7,Alyssa Saxon,Gatesville,111.31,129.27,83.91,136.08,349.27,Unlimited,SBD,F,
Girls,110+,8,Janiah Smith,Waco Connally,112.22,120.2,61.23,120.2,301.64,Unlimited,SBD,F,
Girls,110+,9,Liliana Newton,Robinson,115.03,115.67,47.63,133.81,297.1,Unlimited,SBD,F,
Girls,110+,10,Jasmine Wheaton,Waxahachie Life,127.1,99.79,43.09,129.27,272.16,Unlimited,SBD,F,
Girls,110+,11,Evelyn Capistran,Dallas A+,121.38,102.06,43.09,113.4,258.55,Unlimited,SBD,F,
Girls,110+,12,Angelica Mendoza,Dallas A+,122.56,102.06,40.82,111.13,254.01,Unlimited,SBD,F,
