Place,Sex,Division,WeightClassKg,Equipment,Name,BirthYear,BodyweightKg,Country,Best3SquatKg,Best3BenchKg,Best3DeadliftKg,TotalKg,Event,Squat1Kg,Squat2Kg,Squat3Kg,Squat4Kg,Bench1Kg,Bench2Kg,Bench3Kg,Bench4Kg,Deadlift1Kg,Deadlift2Kg,Deadlift3Kg,Deadlift4Kg,BirthDate
1,F,T1,60,Wraps,Kristína Hasáková,2010,57.15,Slovakia,85,50,82.5,217.5,SBD,,,,,,,,,,,,,
1,F,T2,67.5,Wraps,Elen Kanalošová,2007,65.9,Czechia,102.5,65,140,307.5,SBD,,,,,,,,,,,,,
DQ,F,T2,67.5,Wraps,Vanesa Valentová,2006,66.25,Czechia,115,,,,SBD,,,,,,,,,,,,,
1,F,T3,60,Wraps,Liliana Némethyová,2005,58.7,Slovakia,122.5,52.5,120,295,SBD,,,,,,,,,,,,,
2,F,T3,60,Wraps,Vendula Kuxová,2005,57.25,Czechia,80,55,100,235,SBD,,,,,,,,,,,,,
1,F,T3,75,Wraps,Pavlína Chovancová,2005,72.8,Slovakia,137.5,70,140,347.5,SBD,,,,,,,,,,,,,
1,F,T3,82.5,Wraps,Agáta Čechová,2005,77.15,Czechia,112.5,45,132.5,290,SBD,,,,,,,,,,,,,
1,F,J,60,Wraps,Hana Matějková,2003,58.75,Czechia,120,50,125,295,SBD,,,,,,,,,,,,,
2,F,J,60,Wraps,Simona Rančev,2002,59.45,Czechia,100,55,125,280,SBD,,,,,,,,,,,,,
1,F,J,67.5,Wraps,Barbora Vanská,2002,66.25,Czechia,120,50,130,300,SBD,,,,,,,,,,,,,
1,F,J,82.5,Wraps,Daria Postrożna,2000,75.85,Poland,182.5,105,190,477.5,SBD,,,,,,,,,,,,,
1,F,J,90,Wraps,Tereza Šimková,2004,87.8,Czechia,115,60,162.5,337.5,SBD,,,,,,,,,,,,,
1,F,J,110,Wraps,Jamie-Lee Shapcott,2004,99.15,England,160,80,175,415,SBD,,,,,,,,,,,,,
DQ,F,J,110+,Wraps,Emily Parkinson,2000,129.2,England,,77.5,140,,SBD,,,,,,,,,,,,,
1,F,O,60,Wraps,Roksolana Busko,1996,59.7,Ukraine,185,97.5,175,457.5,SBD,,,,,,,,,,,,,
1,F,O,67.5,Wraps,Marija Gajevskaja,1998,66.35,Czechia,165,97.5,200,462.5,SBD,,,,,,,,,,,,,
G,F,O,67.5,Wraps,Claire Rutland,1996,66,England,145,80,150,375,SBD,,,,,,,,,,,,,
2,F,O,67.5,Wraps,Adéla Fridrich,1997,66.35,Czechia,135,55,150,340,SBD,,,,,,,,,,,,,
1,F,O,75,Wraps,Andrea Gregorová,1999,71.45,Slovakia,200,107.5,210,517.5,SBD,,,,,,,,,,,,,
2,F,O,75,Wraps,Viktoria Ernestová,1998,73.4,Czechia,135,70,142.5,347.5,SBD,,,,,,,,,,,,,
1,F,O,82.5,Wraps,Kristýna Kohoutová,1996,78,Czechia,185,102.5,182.5,470,SBD,,,,,,,,,,,,,
1,F,O,110,Wraps,Marie Tomečková,1998,91.8,Czechia,215,105,220,540,SBD,,,,,,,,,,,,,
2,F,O,110,Raw,Emilija Zailac,1992,94.3,Croatia,140,67.5,160,367.5,SBD,,,,,,,,,,,,,
1,F,M2,67.5,Wraps,Aija Mikulica,1978,60.9,Latvia,127.5,62.5,155,345,SBD,,,,,,,,,,,,,
1,F,M3,67.5,Wraps,Annjanette Saunders,1969,66.7,England,150,87.5,175,412.5,SBD,,,,,,,,,,,,,
1,F,M4,67.5,Multi-ply,Lesley Jayne Thomas,1966,66.4,England,150,82.5,162.5,395,SBD,,,,,,,,,,,,,
1,F,M4,67.5,Wraps,Amanda Dewhurst,1965,65.85,England,127.5,77.5,165,370,SBD,,,,,,,,,,,,,
1,F,M5,60,Wraps,Jana Janoušková,1960,58.65,Czechia,40,35,80,155,SBD,,,,,,,,,,,,,
1,M,J,110,Multi-ply,Sebastian Petrů,2004,103.2,Czechia,230,200,275,705,SBD,,,,,,,,,,,,,
1,M,T1,67.5,Wraps,Mikołaj Przewodek,2008,66.4,Poland,160,142.5,170,472.5,SBD,,,,,,,,,,,,,
2,M,T1,67.5,Wraps,Rodrigo Zonbergs,2009,65.2,Latvia,100,65,130,295,SBD,,,,,,,,,,,,,
1,M,T1,82.5,Wraps,Daniel Verner,2008,80.6,Czechia,192.5,102.5,220,515,SBD,,,,,,,,,,,,,
1,M,T1,125,Wraps,Gvido Ozols,2008,118.2,Latvia,205,105,205,515,SBD,,,,,,,,,,,,,
1,M,T2,75,Wraps,Vojtěch Štegner,2006,74.15,Czechia,220,115,242.5,577.5,SBD,,,,,,,,,,,,,
2,M,T2,75,Wraps,Bořek Chudina,2006,74,Czechia,155,105,235,495,SBD,,,,,,,,,,,,,
3,M,T2,75,Wraps,Adam Kuric,2007,73.15,Czechia,170,107.5,200,477.5,SBD,,,,,,,,,,,,,
4,M,T2,75,Wraps,Andrii Viazkov,2006,74.3,Poland,137.5,115,190,442.5,SBD,,,,,,,,,,,,,
5,M,T2,75,Wraps,Ivan Khudiakov,2006,72,Czechia,130,90,162.5,382.5,SBD,,,,,,,,,,,,,
6,M,T2,75,Wraps,Jakub Šefl,2006,69.85,Czechia,130,67.5,152.5,350,SBD,,,,,,,,,,,,,
1,M,T2,82.5,Wraps,Vít Vencelides,2006,81.55,Czechia,205,115,220,540,SBD,,,,,,,,,,,,,
DQ,M,T2,90,Wraps,Petr Hendrych,2006,89,Czechia,,,,,SBD,,,,,,,,,,,,,
1,M,T2,100,Multi-ply,Ondřej Ščuglík,2006,97.55,Czechia,305,200,270,775,SBD,,,,,,,,,,,,,
1,M,T3,67.5,Wraps,Justin Sutherland,2005,67.3,Scotland,220,127.5,220,567.5,SBD,,,,,,,,,,,,,
2,M,T3,67.5,Wraps,Vojtěch Svoboda,2005,63.6,Czechia,170,100,210,480,SBD,,,,,,,,,,,,,
3,M,T3,67.5,Wraps,Lukáš Kupčík,2004,66.6,Czechia,140,85,180,405,SBD,,,,,,,,,,,,,
4,M,T3,67.5,Wraps,Přemysl Látal,2006,63.7,Czechia,125,67.5,150,342.5,SBD,,,,,,,,,,,,,
5,M,T3,67.5,Wraps,Adam Kuba,2005,66.8,Czechia,125,75,140,340,SBD,,,,,,,,,,,,,
1,M,T3,75,Wraps,Lukáš Lhoták,2005,72.8,Czechia,150,100,175,425,SBD,,,,,,,,,,,,,
1,M,T3,82.5,Wraps,Radek Pospíšil,2005,82.2,Czechia,190,140,230,560,SBD,,,,,,,,,,,,,
2,M,T3,82.5,Wraps,Martin Čurda,2006,79.65,Czechia,170,100,190,460,SBD,,,,,,,,,,,,,
1,M,T3,90,Wraps,Petr Formánek,2005,88.9,Czechia,200,120,240,560,SBD,,,,,,,,,,,,,
1,M,T3,100,Wraps,Michal Svoboda,2004,93.8,Czechia,282.5,150,300,732.5,SBD,,,,,,,,,,,,,
2,M,T3,100,Wraps,Milan Raška,2006,98.3,Czechia,215,140,215,570,SBD,,,,,,,,,,,,,
1,M,T3,110,Wraps,Vítek Lorenc,2005,108.3,Czechia,240,150,265,655,SBD,,,,,,,,,,,,,
1,M,J,75,Multi-ply,Tomáš Kunz,2002,72.9,Czechia,260,145,200,605,SBD,,,,,,,,,,,,,
1,M,J,75,Wraps,Martin Chudoba,2002,73.65,Czechia,250,145,240,635,SBD,,,,,,,,,,,,,
1,M,J,82.5,Wraps,Tomáš Korel,2004,78.65,Czechia,140,90,210,440,SBD,,,,,,,,,,,,,
1,M,J,90,Wraps,Adam Páník,2003,87,Czechia,250,160,275,685,SBD,,,,,,,,,,,,,
2,M,J,90,Wraps,Jan Cafourek,2002,88.65,Czechia,240,145,275,660,SBD,,,,,,,,,,,,,
3,M,J,90,Wraps,Petr Gerberg,2004,87,Czechia,250,150,240,640,SBD,,,,,,,,,,,,,
4,M,J,90,Wraps,Petr Sadílek,2002,85,Czechia,220,130,280,630,SBD,,,,,,,,,,,,,
5,M,J,90,Wraps,Daniel Převrátil,2002,83.15,Czechia,185,120,200,505,SBD,,,,,,,,,,,,,
1,M,J,100,Wraps,Matěj Bělina,2003,98.9,Czechia,210,117.5,240,567.5,SBD,,,,,,,,,,,,,
1,M,J,110,Wraps,Viktor Strážnický,2003,104.1,Czechia,265,185,310,760,SBD,,,,,,,,,,,,,
2,M,J,110,Wraps,Ondřej Šťastný,2002,110,Czechia,220,160,280,660,SBD,,,,,,,,,,,,,
3,M,J,110,Wraps,Krystian Walkowski,2002,100.9,Poland,225,150,240,615,SBD,,,,,,,,,,,,,
4,M,J,110,Wraps,Patrik Kosmál,2002,105.2,Slovakia,230,145,230,605,SBD,,,,,,,,,,,,,
5,M,J,110,Wraps,Jakub Čurda,2003,103,Czechia,220,140,240,600,SBD,,,,,,,,,,,,,
6,M,J,110,Wraps,Tomáš Holeš,2003,107.2,Slovakia,225,160,210,595,SBD,,,,,,,,,,,,,
1,M,J,125,Wraps,Adam Kyzlink,2002,112.2,Czechia,320,200,330,850,SBD,,,,,,,,,,,,,
2,M,J,125,Wraps,Adam Egermaier,2000,120,Czechia,325,190,280,795,SBD,,,,,,,,,,,,,
3,M,J,125,Wraps,Nikola Pelikán,2000,112.2,Czechia,250,175,275,700,SBD,,,,,,,,,,,,,
4,M,J,125,Wraps,Jonas Kirpeit,2002,120.6,Germany,210,130,220,560,SBD,,,,,,,,,,,,,
5,M,J,125,Wraps,Tomáš Vidlička,2003,121.5,Slovakia,205,112.5,200,517.5,SBD,,,,,,,,,,,,,
1,M,J,140,Multi-ply,Oliver Krajčovič,2002,125.8,Slovakia,100,200,100,400,SBD,,,,,,,,,,,,,
1,M,J,140,Wraps,Jiří Pokorný,2002,128.3,Czechia,180,130,250,560,SBD,,,,,,,,,,,,,
1,M,J,140+,Wraps,Tomáš Madzura,2003,142.1,Czechia,150,110,205,465,SBD,,,,,,,,,,,,,
DQ,M,J,140+,Wraps,Tomáš Komjaty,2001,165.2,Slovakia,,,,,SBD,,,,,,,,,,,,,
1,M,O,75,Wraps,Michael Štěpánek,1995,74.15,Czechia,242.5,122.5,260,625,SBD,,,,,,,,,,,,,
2,M,O,75,Wraps,Robin Richter,1997,72.6,Czechia,200,112.5,200,512.5,SBD,,,,,,,,,,,,,
3,M,O,75,Wraps,Matyáš Staněk,1997,71.9,Czechia,170,100,190,460,SBD,,,,,,,,,,,,,
1,M,O,82.5,Wraps,Gordon McGuinness,1991,80.9,Scotland,220,125,240,585,SBD,,,,,,,,,,,,,
2,M,O,82.5,Wraps,Andrew Donaghy,1986,79.9,Scotland,205,130,225,560,SBD,,,,,,,,,,,,,
3,M,O,82.5,Wraps,Oldřich Janoušek,1999,80.8,Czechia,170,140,210,520,SBD,,,,,,,,,,,,,
1,M,O,90,Wraps,Marcus Rosmalm,1992,89.15,Sweden,250,195,280,725,SBD,,,,,,,,,,,,,
2,M,O,90,Wraps,Alexander Globa,1993,89.35,Czechia,270,160,290,720,SBD,,,,,,,,,,,,,
3,M,O,90,Wraps,Patrik Tomáš,1996,84.15,Czechia,245,155,265,665,SBD,,,,,,,,,,,,,
4,M,O,90,Wraps,David Šimeček,1998,86.8,Czechia,200,105,220,525,SBD,,,,,,,,,,,,,
1,M,O,100,Raw,Ján Špais,1995,91.75,Slovakia,285,240,320,845,SBD,,,,,,,,,,,,,
2,M,O,100,Wraps,Tomáš Suchánek,1999,97,Czechia,290,180,300,770,SBD,,,,,,,,,,,,,
3,M,O,100,Wraps,Michal Švec,1985,94.8,Czechia,200,130,250,580,SBD,,,,,,,,,,,,,
4,M,O,100,Wraps,Tomáš Vtípil,1993,99.2,Czechia,100,100,100,300,SBD,,,,,,,,,,,,,
1,M,O,110,Wraps,Tomáš Komárek,1993,105.5,Czechia,305,197.5,310,812.5,SBD,,,,,,,,,,,,,
2,M,O,110,Wraps,Leon Pavlovic,1992,106.1,Norway,305,175,302.5,782.5,SBD,,,,,,,,,,,,,
3,M,O,110,Wraps,David Kovanda,1998,104.1,Czechia,280,175,275,730,SBD,,,,,,,,,,,,,
4,M,O,110,Wraps,Patryk Gierczak,1990,110,Poland,257.5,150,272.5,680,SBD,,,,,,,,,,,,,
5,M,O,110,Wraps,Jakub Chlumecký,1999,102.7,Czechia,195,105,235,535,SBD,,,,,,,,,,,,,
1,M,O,125,Wraps,Sebastian Pawlik,1992,120.6,Poland,355,230,300,885,SBD,,,,,,,,,,,,,
2,M,O,125,Wraps,Martin Medvedyk,1999,124.2,Czechia,390,180,310,880,SBD,,,,,,,,,,,,,
3,M,O,125,Wraps,Juraj Kačmárik,1985,115.7,Slovakia,300,180,355,835,SBD,,,,,,,,,,,,,
4,M,O,125,Wraps,Immanuel Adenubi,1998,117.3,Czechia,275,195,305,775,SBD,,,,,,,,,,,,,
5,M,O,125,Raw,Leevi Leppäjärvi,1993,116.9,Finland,272.5,180,275,727.5,SBD,,,,,,,,,,,,,
6,M,O,125,Wraps,John Sutherland,1987,118.5,Scotland,260,202.5,260,722.5,SBD,,,,,,,,,,,,,
1,M,O,140,Wraps,Dražen Filipovič,1987,137.7,Montenegro,290,215,330,835,SBD,,,,,,,,,,,,,
2,M,O,140,Wraps,Ashley Quigley,1987,138.9,England,235,172.5,245,652.5,SBD,,,,,,,,,,,,,
DQ,M,O,140+,Multi-ply,Gary Boulton,1964,148.5,England,,,,,SBD,,,,,,,,,,,,,
1,M,O,140+,Wraps,Tomáš Komjaty,2001,165.8,Slovakia,360,235,330,925,SBD,,,,,,,,,,,,,
2,M,O,140+,Wraps,Ladislav Kašpar,1994,172.3,Czechia,317.5,230,330,877.5,SBD,,,,,,,,,,,,,
1,M,M1,75,Wraps,Nael Tassabehji,1980,74.52,England,230,120,250,600,SBD,,,,,,,,,,,,,
1,M,M1,82.5,Wraps,Přemysl Rychtera,1980,81.35,Czechia,170,140,175,485,SBD,,,,,,,,,,,,,
1,M,M1,100,Wraps,Federico Sipione,1980,92.25,Italy,260,150,290,700,SBD,,,,,,,,,,,,,
1,M,M1,110,Wraps,Matthew Fealey,1980,108.7,England,275,190,295,760,SBD,,,,,,,,,,,,,
1,M,M1,125,Wraps,John Nelson #1,1982,118.5,Scotland,230,175,265,670,SBD,,,,,,,,,,,,,
1,M,M2,75,Wraps,Gleb Kryss,1978,70.2,Israel,110,105,100,315,SBD,,,,,,,,,,,,,
1,M,M2,90,Wraps,Robert Kucza,1977,89,Poland,125,115,180,420,SBD,,,,,,,,,,,,,
1,M,M2,100,Wraps,Zdeněk Tyl,1976,99.7,Czechia,240,165,250,655,SBD,,,,,,,,,,,,,
1,M,M2,110,Wraps,Martin Hurdálek,1978,103.5,Czechia,250,165,230,645,SBD,,,,,,,,,,,,,
1,M,M3,82.5,Multi-ply,Anton Frič,1973,81.95,Slovakia,300,182.5,280,762.5,SBD,,,,,,,,,,,,,
1,M,M3,90,Wraps,Miroslav Šefl,1971,88.65,Czechia,170,130,215,515,SBD,,,,,,,,,,,,,
2,M,M3,90,Wraps,Miroslav Madzura,1973,87.8,Czechia,170,125,215,510,SBD,,,,,,,,,,,,,
1,M,M3,110,Multi-ply,Josef Jeníček,1973,104.4,Czechia,210,142.5,235,587.5,SBD,,,,,,,,,,,,,
DQ,M,M3,125,Wraps,Radek Lešiga,1971,119.3,Czechia,230,,,,SBD,,,,,,,,,,,,,
1,M,M4,75,Wraps,Roman Mandík,1968,74.15,Czechia,140,95,160,395,SBD,,,,,,,,,,,,,
1,M,M4,90,Wraps,István Gyuricska Jr,1967,87.45,Hungary,205,160,220,585,SBD,,,,,,,,,,,,,
2,M,M4,90,Wraps,Petr Rambousek,1964,83.4,Czechia,155,135,225,515,SBD,,,,,,,,,,,,,
DQ,M,M4,100,Multi-ply,Valery Tomilov,1965,97.1,Israel,,,,,SBD,,,,,,,,,,,,,
1,M,M4,100,Wraps,Darren Walker,1968,97.75,England,245,157.5,297.5,700,SBD,,,,,,,,,,,,,
DQ,M,M4,100,Wraps,Vladimír Gosin,1965,91.3,Israel,260,160,,,SBD,,,,,,,,,,,,,
1,M,M4,110,Multi-ply,Andrew Saunders,1967,103.8,England,255,225,200,680,SBD,,,,,,,,,,,,,
2,M,M4,110,Multi-ply,Robert Graham #1,1965,102.2,England,240,180,220,640,SBD,,,,,,,,,,,,,
1,M,M4,110,Wraps,František Nováček,1964,109.2,Czechia,250,192.5,265,707.5,SBD,,,,,,,,,,,,,
1,M,M5,60,Multi-ply,Pavel Malina,1960,59.6,Czechia,195,100,165,460,SBD,,,,,,,,,,,,,
1,M,M5,67.5,Multi-ply,Karol Brečka,1961,67.4,Czechia,165,100,190,455,SBD,,,,,,,,,,,,,
1,M,M5,110,Wraps,Juhani Kärkkäinen,1959,107.8,Finland,217.5,142.5,245,605,SBD,,,,,,,,,,,,,
1,M,M6,82.5,Multi-ply,Mieczysłąw Maczka,1954,82.3,Germany,140,105,165,410,SBD,,,,,,,,,,,,,
1,M,M6,82.5,Wraps,Abram Jukovsky,1958,79.35,Israel,190,130,212.5,532.5,SBD,,,,,,,,,,,,,
2,M,M6,82.5,Wraps,Mieczysłąw Maczka,1954,82.5,Germany,150,110,160,420,SBD,,,,,,,,,,,,,
1,M,M6,90,Multi-ply,Stanislav Hoza,1956,87.95,Czechia,250,167.5,220,637.5,SBD,,,,,,,,,,,,,
1,M,M6,100,Wraps,Jan Suda,1956,91.8,Czechia,125,77.5,165,367.5,SBD,,,,,,,,,,,,,
DQ,M,M6,125,Wraps,Olavi Rintanen,1955,119.6,Finland,,90,230,,SBD,,,,,,,,,,,,,
1,M,M7,56,Wraps,Valentin Mashkovitch,1952,51.7,Israel,125,55,150,330,SBD,,,,,,,,,,,,,
1,M,M7,75,Wraps,Boris Laishin,1950,70.7,Estonia,112.5,107.5,185,405,SBD,,,,,,,,,,,,,
1,M,M7,125,Multi-ply,Hynek Stružka,1951,115.1,Czechia,150,125,175,450,SBD,,,,,,,,,,,,,
1,M,M8,82.5,Multi-ply,Alexander Papir,1945,77.85,Israel,130,120,175,425,SBD,,,,,,,,,,,,,
1,M,M9,90,Multi-ply,Vilém Žák,1942,83.6,Czechia,85,75,110,270,SBD,,,,,,,,,,,,,
1,F,T2,52,Multi-ply,Anna Homolová,2007,51.3,Czechia,95,,,95,S,90,95,,,,,,,,,,,
1,F,J,52,Wraps,Alena Bartoňková,2002,51.8,Czechia,80,,,80,S,80,-92.5,-92.5,,,,,,,,,,
1,F,J,60,Wraps,Simona Rančev,2002,59.25,Czechia,105,,,105,S,100,-105,105,,,,,,,,,,
1,F,O,75,Wraps,Aimee Brown,1995,74,Scotland,185,,,185,S,165,175,185,-190,,,,,,,,,
2,F,O,75,Wraps,Viktoria Ernestová,1998,73.45,Czechia,145,,,145,S,135,145,-150,,,,,,,,,,
1,F,O,82.5,Wraps,Nives Tokić,1994,76.05,Croatia,140,,,140,S,-120,130,140,,,,,,,,,,
1,F,O,110,Wraps,Kateřina Švecová,1989,98.8,Czechia,135,,,135,S,120,135,-150,,,,,,,,,,
1,F,O,110+,Wraps,Petra Pokorná,1988,126.2,Czechia,155,,,155,S,145,155,-160,,,,,,,,,,
1,M,J,82.5,Multi-ply,Tomáš Kunz,2002,77,Czechia,250,,,250,S,230,250,-270,,,,,,,,,,
1,M,J,110,Wraps,Jan Kolář,2002,102.8,Czechia,205,,,205,S,180,200,205,,,,,,,,,,
1,M,J,125,Wraps,Jonas Kirpeit,2002,122.5,Germany,200,,,200,S,-200,200,-210,,,,,,,,,,
1,M,O,90,Multi-ply,Adam Vokál,1993,87,Czechia,270,,,270,S,270,-300,-300,,,,,,,,,,
1,M,O,100,Multi-ply,Martin Studnička,1993,96.95,Czechia,240,,,240,S,220,230,240,,,,,,,,,,
1,M,O,100,Wraps,Rostislav Chlebek,1997,94.6,Czechia,250,,,250,S,-230,250,-260,,,,,,,,,,
2,M,O,100,Wraps,Kristóf Sohajda,1993,92.95,Hungary,180,,,180,S,-180,-180,180,,,,,,,,,,
1,M,O,110,Wraps,Filip Rotter,1999,102.7,Czechia,260,,,260,S,-260,260,-280,,,,,,,,,,
1,M,M1,100,Wraps,Károly Horváth,1980,98.6,Hungary,270,,,270,S,-270,270,-285,,,,,,,,,,
1,M,M2,75,Wraps,Karel Sazma,1975,74.75,Czechia,162.5,,,162.5,S,140,150,162.5,-171.5,,,,,,,,,
2,M,M2,75,Wraps,Gleb Kryss,1978,71.35,Israel,142.5,,,142.5,S,120,142.5,-160,,,,,,,,,,
DQ,M,M3,100,Wraps,Ivan Obert,1973,97.1,Czechia,,,,,S,,,,,,,,,,,,,
1,M,M4,100,Multi-ply,Vladimír Gosin,1965,91.75,Israel,240,,,240,S,-200,240,-260,,,,,,,,,,
1,M,M4,100,Wraps,Ivan Giňovský,1967,96.2,Slovakia,210,,,210,S,200,210,-215,,,,,,,,,,
1,M,M4,125,Multi-ply,Tibor Manzera,1968,110.9,Hungary,100,,,100,S,100,,,,,,,,,,,,
1,M,M4,125,Wraps,Tibor Manzera,1968,110.9,Hungary,100,,,100,S,100,,,,,,,,,,,,
1,M,M5,100,Wraps,Jiří Táborský,1963,99.65,Czechia,172.5,,,172.5,S,155,165,172.5,,,,,,,,,,
1,M,M6,90,Multi-ply,Mieczysłąw Maczka,1954,83.45,Germany,160,,,160,S,145,160,,,,,,,,,,,
1,M,M6,90,Wraps,Mieczysłąw Maczka,1954,83.45,Germany,152.5,,,152.5,S,140,152.5,-160,,,,,,,,,,
1,M,M7,110,Multi-ply,David Rex Thomas,1951,108.3,England,140,,,140,S,140,,,,,,,,,,,,
1,M,M7,110,Wraps,David Rex Thomas,1951,108.3,England,135,,,135,S,115,126,135,,,,,,,,,,
1,F,T3,90,Raw,Nikol Lenghatrová,2006,86,Slovakia,,84,,84,B,,,,,75,82.5,84,-86,,,,,
1,F,M5,67.5,Raw,Brigitte Maczka,1961,66.05,Germany,,40,,40,B,,,,,32.5,37.5,40,,,,,,
1,F,M4,75,Raw,Romana Hurdálková,1967,69.7,Czechia,,40,,40,B,,,,,37.5,40,-42.5,,,,,,
1,F,M4,67.5,Raw,Mária Hegedűs,1965,66.4,Hungary,,52.5,,52.5,B,,,,,47.5,50,52.5,,,,,,
1,F,M3,56,Raw,Ester Cichá,1970,55.3,Czechia,,67.5,,67.5,B,,,,,60,65,67.5,,,,,,
1,F,M3,75,Raw,Joanne Caldwell,1970,73.1,Scotland,,95,,95,B,,,,,82.5,90,95,,,,,,
2,F,M3,75,Raw,Mónika Molnár,1973,70.7,Hungary,,55,,55,B,,,,,50,55,-57.5,,,,,,
1,F,M3,82.5,Raw,Mónika Bazsó,1974,81.5,Hungary,,125.5,,125.5,B,,,,,112.5,120,125.5,126.5,,,,,
1,F,M2,67.5,Raw,Daniela Poláková,1976,60.3,Czechia,,105,,105,B,,,,,97.5,102.5,105,,,,,,
1,F,M1,56,Raw,Eva Strnadová,1983,53.1,Czechia,,55,,55,B,,,,,50,52.5,55,,,,,,
1,F,M1,82.5,Raw,Beáta Szalay,1979,78.9,Hungary,,80,,80,B,,,,,75,80,-85,,,,,,
1,F,M1,110,Raw,Andrea Antal,1980,95.4,Hungary,,70,,70,B,,,,,65,70,-77.5,,,,,,
1,F,T3,67.5,Raw,Sára Gobernacová,2005,64.4,Czechia,,65,,65,B,,,,,-62.5,-65,65,,,,,,
1,F,M3,110,Raw,Marianna Óvári,1973,99.1,Hungary,,77.5,,77.5,B,,,,,70,75,77.5,,,,,,
1,F,T1,60,Raw,Kristína Hasáková,2010,56.7,Slovakia,,50,,50,B,,,,,45,50,-52.5,52.5,,,,,
1,F,T1,75,Raw,Vanda Savanyú,2009,71,Hungary,,67,,67,B,,,,,60,66,67,,,,,,
1,F,T1,110,Raw,Sára Luca Sátor,2009,97.8,Hungary,,60,,60,B,,,,,50,55,60,,,,,,
1,F,J,60,Raw,Kateřina Janoutová,2002,60,Czechia,,77.5,,77.5,B,,,,,75,77.5,-80,,,,,,
1,F,J,56,Raw,Iveta Mikesková,2002,56,Czechia,,70,,70,B,,,,,65,67.5,70,,,,,,
1,F,J,75,Raw,Zuzana Lošťáková,2001,74,Czechia,,62.5,,62.5,B,,,,,50,55,62.5,,,,,,
1,F,J,110,Raw,Diana Balážová,2003,99.5,Slovakia,,55,,55,B,,,,,45,50,55,,,,,,
1,F,O,52,Raw,Stella Širmerová,1999,51,Czechia,,47.5,,47.5,B,,,,,45,47.5,-50,,,,,,
1,F,O,75,Raw,Karolina Czuryło,1996,72.6,Poland,,100,,100,B,,,,,95,100,-105,,,,,,
1,F,O,82.5,Raw,Marta Chachuła,1987,79.1,Poland,,120,,120,B,,,,,110,115,120,,,,,,
1,F,O,90,Raw,Małgorzata Kopiec,1985,86.2,Poland,,176,,176,B,,,,,165,170,176,,,,,,
1,F,O,110,Raw,Kateřina Švecová,1989,100.8,Czechia,,80,,80,B,,,,,70,80,-90,,,,,,
1,F,O,110+,Raw,Alyson Smith,1986,116.4,Scotland,,137.5,,137.5,B,,,,,127.5,132.5,137.5,141,,,,,
1,M,T3,75,Raw,Mattia Mariani,2004,72.9,Italy,,102.5,,102.5,B,,,,,87.5,97.5,102.5,,,,,,
1,M,T3,82.5,Raw,Kacper Wawrzyniak,2004,80.1,Poland,,140,,140,B,,,,,135,137.5,140,,,,,,
1,M,T3,110,Raw,Ferenc Busznyák,2005,108.9,Hungary,,125,,125,B,,,,,115,125,-135,,,,,,
1,M,T3,140,Raw,Kacper Łukomski,2005,130.7,Poland,,142.5,,142.5,B,,,,,135,-142.5,142.5,,,,,,
1,M,T3,140+,Raw,Kristóf Lajos Szalay,2006,147.7,Hungary,,180,,180,B,,,,,160,170,180,,,,,,
1,M,T2,67.5,Raw,Václav Spurný,2006,67.1,Czechia,,100,,100,B,,,,,90,95,100,,,,,,
2,M,T2,82.5,Raw,Nadav Eliyahu,2006,81.5,Israel,,107.5,,107.5,B,,,,,100,107.5,-110,,,,,,
1,M,T2,82.5,Raw,Josef Švestka,2006,82.2,Czechia,,115,,115,B,,,,,105,110,115,,,,,,
1,M,T1,56,Raw,Benjamín Hojsík,2010,50.3,Slovakia,,62.5,,62.5,B,,,,,55,60,62.5,,,,,,
1,M,T1,82.5,Raw,Mark Lutsyshyn,2009,82.3,Czechia,,75,,75,B,,,,,-70,70,75,,,,,,
1,M,M9,90,Raw,Heiner Schildbach,1943,86.8,Germany,,85,,85,B,,,,,80,85,-87.5,,,,,,
1,M,M8,75,Raw,Jozef Bartek,1945,72.1,Slovakia,,50,,50,B,,,,,50,-55,-60,,,,,,
1,M,M8,82.5,Raw,Giuseppe Cersosimo,1946,78.1,Italy,,82.5,,82.5,B,,,,,77.5,-82.5,82.5,,,,,,
1,M,M8,100,Raw,Albert Olomek,1946,90.7,Germany,,135,,135,B,,,,,120,130,135,,,,,,
1,M,M7,60,Raw,Antoni Kaliňski,1953,59.95,Poland,,92.5,,92.5,B,,,,,80,87.5,92.5,95,,,,,
1,M,M7,75,Raw,Boris Laishin,1950,71.65,Estonia,,110,,110,B,,,,,105,110,-112.5,,,,,,
1,M,M7,90,Raw,György Kerékgyártó,1949,89.5,Hungary,,135,,135,B,,,,,-125,130,135,,,,,,
3,M,M7,100,Raw,Pavel Erban,1952,96.2,Czechia,,85,,85,B,,,,,80,-85,85,,,,,,
1,M,M7,100,Raw,Miroslav Kolek,1954,90.1,Czechia,,127.5,,127.5,B,,,,,120,125,127.5,,,,,,
2,M,M7,100,Raw,Jozef Matej,1954,97.35,Slovakia,,122.5,,122.5,B,,,,,-117.5,117.5,122.5,,,,,,
1,M,M6,75,Raw,Jozef Gabrhel,1955,73.6,Slovakia,,100,,100,B,,,,,90,95,100,,,,,,
2,M,M6,82.5,Raw,Mirosław Fugiel,1955,81.9,Poland,,137.5,,137.5,B,,,,,130,135,137.5,,,,,,
2,M,M6,90,Raw,Mieczysłąw Maczka,1954,84.55,Germany,,100,,100,B,,,,,100,,,,,,,,
3,M,M6,82.5,Raw,Karel Shoř,1955,80.9,Czechia,,130,,130,B,,,,,120,130,-132.5,,,,,,
1,M,M6,90,Raw,Longins Augstkalns,1954,87.9,Latvia,,140,,140,B,,,,,130,135,140,,,,,,
1,M,M6,82.5,Raw,Rémy Krayzel,1955,82.2,Czechia,,170,,170,B,,,,,160,165,170,,,,,,
1,M,M6,100,Raw,Ryszard Wilczak,1955,98.5,Poland,,142.5,,142.5,B,,,,,135,140,142.5,,,,,,
1,M,M5,82.5,Raw,Zdeno Pupiš,1964,80.1,Slovakia,,90,,90,B,,,,,85,90,-95,,,,,,
2,M,M5,90,Raw,Gábor Kovács,1962,87.9,Hungary,,125,,125,B,,,,,115,120,125,,,,,,
1,M,M5,90,Raw,Marek Strzałkowski,1959,89.2,Poland,,150,,150,B,,,,,145,150,-155,,,,,,
2,M,M5,100,Raw,Peter Herák,1960,97,Slovakia,,125,,125,B,,,,,115,122.5,125,,,,,,
1,M,M5,100,Raw,Miklós Pomázi,1963,94.55,Hungary,,165,,165,B,,,,,160,165,-170,,,,,,
1,M,M5,110,Raw,Fabio Rotondi,1963,104.1,Italy,,160,,160,B,,,,,160,-170,-170,,,,,,
1,M,M4,75,Raw,Artur Średniawski,1967,70.6,Poland,,115,,115,B,,,,,100,110,115,,,,,,
1,M,M4,82.5,Raw,Josef St. Peška,1965,80.55,Czechia,,130,,130,B,,,,,-130,130,-140,,,,,,
1,M,M4,90,Raw,Robert Sielicki,1964,83.7,England,,95,,95,B,,,,,90,95,-100,,,,,,
1,M,M4,100,Raw,Piotr Strzała,1966,97.35,Poland,,175,,175,B,,,,,165,175,-185,,,,,,
1,M,M4,110,Raw,Jałocha Krzysztof Bożyczko,1965,109.5,Poland,,205,,205,B,,,,,200,205,-210,,,,,,
2,M,M4,110,Raw,František Nováček,1964,109,Czechia,,195,,195,B,,,,,182.5,190,195,,,,,,
3,M,M4,100,Raw,Roman Růžička,1965,98.75,Czechia,,145,,145,B,,,,,140,145,-150,,,,,,
1,M,M4,125,Raw,Ronen Eliyahu,1968,113.9,Israel,,160,,160,B,,,,,145,155,160,,,,,,
2,M,M4,100,Raw,Valery Tomilov,1965,99.5,Israel,,162.5,,162.5,B,,,,,150,157.5,162.5,,,,,,
1,M,M3,60,Raw,János Tóth,1974,57.4,Hungary,,75,,75,B,,,,,70,75,-80,,,,,,
1,M,M3,75,Raw,Giuseppe Loiotile,1972,70.65,Italy,,120,,120,B,,,,,120,-122.5,-125,,,,,,
1,M,M3,82.5,Raw,Plewa Roch Szumarowski,1973,81.9,Poland,,147.5,,147.5,B,,,,,135,142.5,147.5,,,,,,
2,M,M3,82.5,Raw,Robert Tomáš,1972,81.45,Czechia,,135,,135,B,,,,,-125,125,135,,,,,,
2,M,M3,90,Raw,Jasmin Kočan,1971,89.45,Montenegro,,140,,140,B,,,,,125,135,140,,,,,,
3,M,M3,82.5,Raw,Armando Pistilli,1969,82.25,Italy,,85,,85,B,,,,,80,85,-90,,,,,,
1,M,M3,90,Raw,Vladan Zapletal,1971,89.1,Czechia,,165,,165,B,,,,,155,160,165,,,,,,
2,M,M3,100,Raw,Petr Kábrt,1972,97.1,Czechia,,160,,160,B,,,,,155,160,-165,,,,,,
1,M,M3,100,Raw,Hovhannes Yazichyan,1971,98.3,Poland,,200,,200,B,,,,,180,190,200,-208,,,,,
1,M,M3,125,Raw,Adam Eikman,1971,124,Poland,,210,,210,B,,,,,195,202.5,210,,,,,,
2,M,M3,125,Raw,Pavel Žibrita,1970,119.9,Czechia,,200,,200,B,,,,,182.5,192.5,200,,,,,,
1,M,M3,140+,Raw,Grzegorz Kantor,1972,140.4,Poland,,172.5,,172.5,B,,,,,165,172.5,-180,,,,,,
1,M,M2,75,Raw,Gleb Kryss,1978,70.3,Israel,,100,,100,B,,,,,90,100,-110,,,,,,
1,M,M2,90,Raw,Stanislav Tůma,1977,89.2,Czechia,,162.5,,162.5,B,,,,,155,162.5,-167.5,,,,,,
3,M,M2,100,Raw,Andrey Glukhov,1978,98,Israel,,190,,190,B,,,,,185,190,-197.5,,,,,,
4,M,M2,100,Raw,Andrzej Juraszek,1977,96.7,Poland,,157.5,,157.5,B,,,,,150,157.5,-160,,,,,,
5,M,M2,100,Raw,Pietro Molinari,1975,97.4,Italy,,135,,135,B,,,,,125,132.5,135,,,,,,
1,M,M2,100,Raw,Petr Novák,1977,97.4,Czechia,,210,,210,B,,,,,200,205,210,,,,,,
2,M,M2,100,Raw,František Štěpánek,1978,90.1,Czechia,,200,,200,B,,,,,180,195,200,,,,,,
2,M,M2,110,Raw,Marcel Baláž,1977,106.6,Slovakia,,195,,195,B,,,,,180,190,195,,,,,,
1,M,M2,110,Raw,Jindřich Dressler,1977,108.8,Czechia,,220,,220,B,,,,,205,215,220,,,,,,
4,M,M2,110,Raw,Maris Kipurs,1978,104.8,Latvia,,165,,165,B,,,,,-145,155,165,,,,,,
3,M,M2,110,Raw,Adam Łukomski,1975,109.2,Poland,,170,,170,B,,,,,155,160,170,,,,,,
1,M,M2,125,Raw,Michal Jandora,1979,115.3,Czechia,,165,,165,B,,,,,155,165,-167.5,,,,,,
1,M,M2,140+,Raw,Milan Mrázek,1979,153.9,Czechia,,250,,250,B,,,,,240,250,-255,,,,,,
1,M,M2,140,Raw,Marcin Czaja,1976,137.7,Poland,,185,,185,B,,,,,170,172.5,185,,,,,,
2,M,M2,125,Raw,Krzysztof Halczyk,1974,123.8,Poland,,162.5,,162.5,B,,,,,155,162.5,-167.5,,,,,,
1,M,M1,75,Raw,Łukasz Kozłowski,1982,72.1,Poland,,167.5,,167.5,B,,,,,155,162.5,167.5,,,,,,
1,M,M1,82.5,Raw,Robert Kovačík,1980,81,Czechia,,90,,90,B,,,,,90,-100,-100,,,,,,
1,M,M1,90,Raw,Marcin Szreiber,1981,86.3,Poland,,170,,170,B,,,,,170,-177.5,-177.5,,,,,,
2,M,M1,90,Raw,Arkadiusz Biel,1981,89.85,Poland,,150,,150,B,,,,,130,140,150,,,,,,
1,M,M1,100,Raw,László Németh,1980,97.8,Hungary,,192.5,,192.5,B,,,,,180,190,192.5,,,,,,
2,M,M1,100,Raw,Gracjan Podpora,1982,99.25,Poland,,127.5,,127.5,B,,,,,120,125,127.5,,,,,,
2,M,M1,110,Raw,Ivan Polichetti,1981,109,Italy,,160,,160,B,,,,,150,160,-162.5,,,,,,
1,M,M1,110,Raw,Pavel Rychtera,1982,104.6,Czechia,,167.5,,167.5,B,,,,,155,162.5,167.5,,,,,,
1,M,M1,140,Raw,Radovan Tellner,1981,139.2,Czechia,,200,,200,B,,,,,190,-200,200,,,,,,
1,M,J,75,Raw,Filip Prchal,2003,68.1,Czechia,,150,,150,B,,,,,142.5,147.5,150,,,,,,
2,M,J,82.5,Raw,Marco De Candia,2003,77.3,Italy,,135,,135,B,,,,,130,135,-145,,,,,,
1,M,J,82.5,Raw,Pavel Janíček,2002,81.1,Czechia,,147.5,,147.5,B,,,,,130,140,147.5,,,,,,
2,M,J,100,Raw,Petr Bartošík,2001,93.4,Czechia,,155,,155,B,,,,,150,155,-160,,,,,,
1,M,J,100,Raw,Paolo Savarese,2001,90.6,Italy,,157.5,,157.5,B,,,,,145,152.5,157.5,,,,,,
3,M,J,82.5,Raw,Filippo Trapanese,2003,82.45,Italy,,125,,125,B,,,,,115,122.5,125,,,,,,
2,M,J,110,Raw,Kacper Grabowski,2003,104.9,Poland,,155,,155,B,,,,,140,150,155,,,,,,
1,M,J,110,Raw,Hubert Bąbrych,2001,108.1,Poland,,212.5,,212.5,B,,,,,200,207.5,212.5,,,,,,
1,M,Para,67.5,Raw,Stanislav Cimpa,1991,65.6,Czechia,,92.5,,92.5,B,,,,,85,-92.5,92.5,,,,,,
1,M,O,67.5,Raw,Luděk Šmíd,1996,67.35,Czechia,,130,,130,B,,,,,110,120,130,,,,,,
1,M,O,75,Raw,Francesco Frasca,1984,74.7,Italy,,137.5,,137.5,B,,,,,125,137.5,-142.5,,,,,,
1,M,Para,75,Raw,Tomasz Wolski,1989,72.7,Poland,,140,,140,B,,,,,135,137.5,140,-143,,,,,
1,M,O,82.5,Raw,Filip Stanko,1990,81.85,Slovakia,,195,,195,B,,,,,190,-195,195,,,,,,
1,M,O,90,Raw,Jan Hamr,1984,89.2,Czechia,,200,,200,B,,,,,180,190,200,,,,,,
3,M,O,90,Raw,Lukáš Heřman,1989,88.75,Czechia,,155,,155,B,,,,,140,147.5,155,,,,,,
2,M,O,90,Raw,Jakub Honz,1994,89.4,Czechia,,200,,200,B,,,,,-190,200,-205,,,,,,
4,M,O,90,Raw,Oldřich Janoušek,1999,84.7,Czechia,,130,,130,B,,,,,110,130,-140,,,,,,
2,M,O,82.5,Raw,Riccardo Lubrano Lobianco,1999,80.75,Italy,,137.5,,137.5,B,,,,,137.5,-142.5,-142.5,,,,,,
4,M,O,100,Raw,Dominik Kovalčík,1999,93.3,Czechia,,200,,200,B,,,,,190,200,-202.5,,,,,,
4,M,O,110,Raw,Mariusz Małkowski,1987,101.7,Poland,,170,,170,B,,,,,160,170,-180,,,,,,
3,M,O,100,Raw,Zdeněk Marvan,1997,98.45,Czechia,,202.5,,202.5,B,,,,,195,202.5,-205,,,,,,
2,M,O,100,Raw,Ákos Oláh,1989,99.15,Hungary,,212.5,,212.5,B,,,,,205,212.5,-222.5,,,,,,
1,M,O,110,Raw,David Bartošík,1998,110,Czechia,,225,,225,B,,,,,225,-232.5,-232.5,,,,,,
2,M,O,110,Raw,Lukáš Forejtek,1993,106.6,Czechia,,200,,200,B,,,,,200,-210,-210,,,,,,
3,M,O,110,Raw,Jan Holub,1998,107.9,Czechia,,180,,180,B,,,,,170,-180,180,,,,,,
1,M,O,100,Raw,Matěj Syrovátka,1998,98.9,Czechia,,227.5,,227.5,B,,,,,205,220,227.5,,,,,,
7,M,O,125,Raw,Petr Bezouška,1986,117.9,Czechia,,165,,165,B,,,,,-165,165,,,,,,,
5,M,O,125,Raw,Václav Čáp,1991,122,Czechia,,195,,195,B,,,,,180,190,195,,,,,,
6,M,O,125,Raw,Giovanni Guida,1990,120.4,Italy,,170,,170,B,,,,,-170,-170,170,,,,,,
3,M,O,125,Raw,Rafał Michalski,1993,112.4,Poland,,217.5,,217.5,B,,,,,-217.5,217.5,-222.5,,,,,,
1,M,O,125,Raw,Alexandr Popa,1988,124.8,Czechia,,265,,265,B,,,,,230,250,265,-270,,,,,
2,M,O,125,Raw,Michał Szymańczak,1987,119,Poland,,225,,225,B,,,,,210,220,225,,,,,,
2,M,O,140+,Raw,Matěj Čížek,1999,145.3,Czechia,,127.5,,127.5,B,,,,,110,125,127.5,,,,,,
1,M,O,140+,Raw,Adam Kornak,1988,142.3,Czechia,,202.5,,202.5,B,,,,,192.5,202.5,-205,,,,,,
1,F,O,67.5,Multi-ply,Magdolna Matolcsi,1988,61.35,Hungary,,60,,60,B,,,,,50,57.5,60,,,,,,
DQ,F,M7,60,Multi-ply,Astrid Fehr,1953,57.9,Germany,,,,,B,,,,,-45,-45,-45,,,,,,
1,F,M5,67.5,Multi-ply,Brigitte Maczka,1961,66.05,Germany,,35,,35,B,,,,,35,-40,,,,,,,
4,M,O,125,Raw,John Sutherland,1987,119.5,Scotland,,207.5,,207.5,B,,,,,190,200,207.5,,,,,,
1,M,O,75,Multi-ply,Francesco Frasca,1984,74.7,Italy,,155,,155,B,,,,,155,-165,-165,,,,,,
1,M,O,82.5,Multi-ply,Lukáš Kovačík,1988,78.65,Czechia,,185,,185,B,,,,,170,180,185,,,,,,
1,M,O,100,Multi-ply,Gábor Bujdosó,1995,91.35,Hungary,,170,,170,B,,,,,160,170,-180,,,,,,
1,M,M1,90,Multi-ply,Károly Tölli,1980,87.35,Hungary,,155,,155,B,,,,,150,-155,155,,,,,,
1,M,M1,110,Multi-ply,Václav Mařík,1979,104.3,Czechia,,250,,250,B,,,,,250,-260,-260,,,,,,
1,M,M1,125,Multi-ply,Pavel Hurdálek,1980,115.2,Czechia,,240,,240,B,,,,,240,-250,-250,,,,,,
1,M,M2,100,Multi-ply,Christian Stoebke,1976,99.5,Germany,,125,,125,B,,,,,115,120,125,,,,,,
DQ,M,M2,140,Multi-ply,Oskars Zvarts,1978,139.9,Latvia,,,,,B,,,,,-265,-265,-265,,,,,,
DQ,M,M2,140+,Multi-ply,David Zdražil,1978,157.8,Czechia,,,,,B,,,,,-200,-200,-200,,,,,,
1,M,M2,140+,Multi-ply,Gábor Salamon,1978,158.4,Hungary,,210,,210,B,,,,,170,190,210,,,,,,
1,M,M4,100,Multi-ply,Valery Tomilov,1965,99.5,Israel,,200,,200,B,,,,,190,200,-225,,,,,,
1,M,M3,82.5,Multi-ply,Plewa Roch Szumarowski,1973,81.9,Poland,,160,,160,B,,,,,135,147.5,160,,,,,,
1,M,M3,90,Multi-ply,Miroslav Drnek,1972,89.45,Czechia,,200,,200,B,,,,,182.5,195,200,,,,,,
1,M,M3,110,Multi-ply,József Kovács,1973,102.7,Hungary,,195,,195,B,,,,,185,195,-205,,,,,,
2,M,M3,110,Multi-ply,László Baross,1970,106.8,Hungary,,162.5,,162.5,B,,,,,145,150,162.5,,,,,,
1,M,M3,125,Multi-ply,László Haraszti,1971,115.7,Hungary,,225,,225,B,,,,,225,-235,-240,,,,,,
2,M,M6,82.5,Multi-ply,Mirosław Fugiel,1955,81.9,Poland,,130,,130,B,,,,,120,130,,,,,,,
1,M,M6,90,Multi-ply,Mieczysłąw Maczka,1954,84.55,Germany,,102.5,,102.5,B,,,,,102.5,,,,,,,,
1,M,M6,82.5,Multi-ply,Rémy Krayzel,1955,82.2,Czechia,,185,,185,B,,,,,180,185,,,,,,,
1,M,M6,100,Multi-ply,Franciszek Szabluk,1956,100,Poland,,210,,210,B,,,,,200,-210,210,-220.5,,,,,
1,M,M7,60,Multi-ply,Antoni Kaliňski,1953,59.95,Poland,,105,,105,B,,,,,95,100,105,,,,,,
1,M,M8,82.5,Multi-ply,Alexander Papir,1945,79.8,Israel,,130,,130,B,,,,,110,120,130,,,,,,
1,F,O,75,Unlimited,Vanda Savanyú,2009,71,Hungary,,92.5,,92.5,B,,,,,85,-92.5,92.5,,,,,,
1,F,M2,75,Unlimited,Erika Molnár,1977,68.95,Hungary,,107.5,,107.5,B,,,,,90,100,107.5,,,,,,
1,F,M3,75,Unlimited,Lívia Némethné Tál,1971,71.4,Hungary,,85,,85,B,,,,,80,-85,85,,,,,,
1,M,O,100,Unlimited,Gracjan Hnatów,1992,94.3,Poland,,322.5,,322.5,B,,,,,280,-310,322.5,,,,,,
1,M,O,125,Unlimited,József Somogyi,1992,123.7,Hungary,,280,,280,B,,,,,-280,280,-300,,,,,,
DQ,M,O,125,Unlimited,Marcin Kopiec,1991,110.5,Poland,,,,,B,,,,,,,,,,,,,
DQ,M,O,140+,Unlimited,Lajos Biró,1996,149.7,Hungary,,,,,B,,,,,-380,-400,-400,,,,,,
DQ,M,M1,140,Unlimited,Lajos Víg,1980,134.1,Hungary,,,,,B,,,,,,,,,,,,,
1,M,M2,90,Unlimited,Róbert Csetényi,1977,88.7,Hungary,,240,,240,B,,,,,-240,240,-250,,,,,,
1,M,M2,100,Unlimited,Zoltán Győri,1975,99.7,Hungary,,242.5,,242.5,B,,,,,220,235,242.5,,,,,,
1,M,M2,140,Unlimited,János Savanyú,1978,131.5,Hungary,,240,,240,B,,,,,-240,240,-245,245,,,,,
1,M,M3,125,Unlimited,Ernő Eck,1972,118.6,Hungary,,340,,340,B,,,,,-340,340,-345,,,,,,
1,M,M3,140,Unlimited,Károly Németh,1971,134.5,Hungary,,300,,300,B,,,,,300,,,,,,,,
1,M,M4,140,Unlimited,Csaba Molnár,1964,133.2,Hungary,,300,,300,B,,,,,285,300,,,,,,,
1,M,M5,100,Unlimited,Søren Bertelsen,1961,98.1,Denmark,,285,,285,B,,,,,-282.5,-285,285,,,,,,
1,M,M5,140+,Unlimited,Dirk Lauber,1963,142.9,Germany,,260,,260,B,,,,,-260,260,-272.5,,,,,,
1,M,M7,110,Unlimited,David Rex Thomas,1951,109.5,England,,127.5,,127.5,B,,,,,122.5,127.5,-132.5,,,,,,
1,F,T1,48,Raw,Gabriela Wiktoria Hatłas,2008,45.7,Poland,,,92.5,92.5,D,,,,,,,,,80,90,92.5,,
1,F,T1,67.5,Raw,Helena Wyrozębska,2011,62.3,Poland,,,75,75,D,,,,,,,,,60,-70,75,,
1,F,T1,82.5,Raw,Magdaléna Pšornová,2008,80.1,Czechia,,,115,115,D,,,,,,,,,105,115,-122.5,,
1,F,T2,56,Raw,Aleksandra Jarończyk,2008,53.55,Poland,,,115,115,D,,,,,,,,,-105,105,115,,
1,F,T3,52,Raw,Francesca Tedesco,2004,50.75,Italy,,,125,125,D,,,,,,,,,120,125,-130.5,,
1,F,T3,67.5,Raw,Tereza Pivoňková,2005,65.7,Czechia,,,160,160,D,,,,,,,,,150,160,-162.5,,
1,F,J,52,Raw,Magdalena Szpila,2002,50.8,Poland,,,127.5,127.5,D,,,,,,,,,115,122.5,127.5,,
1,F,J,56,Raw,Tereza Rykrová,2001,54.85,Czechia,,,132.5,132.5,D,,,,,,,,,120,132.5,-145,,
1,F,J,82.5,Raw,Éva Smetanová,2001,76.5,Czechia,,,125,125,D,,,,,,,,,110,125,-140,,
1,F,J,110,Raw,Tereza Šimková,2004,90.7,Czechia,,,160,160,D,,,,,,,,,150,160,-170,,
1,F,O,52,Raw,Stella Širmerová,1999,51.35,Czechia,,,110,110,D,,,,,,,,,100,110,-115,,
1,F,O,60,Raw,Elżbieta Kardaś,1999,58.3,Poland,,,145,145,D,,,,,,,,,135,145,-155,,
1,F,O,67.5,Raw,Erica Lubrano Lobianco,1993,65.2,Italy,,,145,145,D,,,,,,,,,137.5,145,-152.5,,
2,F,O,67.5,Raw,Petra Poupětová,1996,67.5,Czechia,,,105,105,D,,,,,,,,,90,105,-110,,
1,F,O,75,Raw,Jana Studničková,1994,73.85,Czechia,,,120,120,D,,,,,,,,,100,110,120,,
1,F,O,82.5,Raw,Aimee Brown,1995,76.4,Scotland,,,175,175,D,,,,,,,,,165,172.5,175,,
2,F,O,82.5,Raw,Veronika Strolená,1985,78.9,Czechia,,,175,175,D,,,,,,,,,160,170,175,,
3,F,O,82.5,Raw,Nives Tokić,1994,79.1,Croatia,,,145,145,D,,,,,,,,,130,145,-152.5,,
1,F,O,110+,Raw,Petra Pokorná,1988,126.3,Czechia,,,175,175,D,,,,,,,,,155,165,175,,
1,F,M1,56,Raw,Eva Strnadová,1983,53.35,Czechia,,,112.5,112.5,D,,,,,,,,,90,100,112.5,,
1,F,M1,82.5,Raw,Ana Božović,1982,79.35,Montenegro,,,167.5,167.5,D,,,,,,,,,150,160,167.5,,
1,F,M2,67.5,Raw,Daniela Poláková,1976,61.5,Czechia,,,170,170,D,,,,,,,,,145,160,170,,
1,F,M2,82.5,Raw,Éva Manzera,1976,81.35,Hungary,,,160,160,D,,,,,,,,,145,160,,,
2,F,M2,82.5,Raw,Melinda Derdák,1975,79.15,Hungary,,,130,130,D,,,,,,,,,110,120,130,,
1,F,M2,110,Raw,Petra Yamaková,1974,96.4,Czechia,,,140,140,D,,,,,,,,,125,140,-147.5,,
1,F,M3,56,Raw,Ester Cichá,1970,55.45,Czechia,,,137.5,137.5,D,,,,,,,,,130,137.5,-140,,
2,F,M3,56,Raw,Kati Györökné,1973,54.2,Hungary,,,125,125,D,,,,,,,,,-125,125,-132.5,,
1,F,M3,75,Raw,Klaudia Tanczos,1973,74.5,Slovakia,,,105,105,D,,,,,,,,,105,-110,,,
1,F,M3,82.5,Multi-ply,Mónika Bazsó,1974,81.2,Hungary,,,182.5,182.5,D,,,,,,,,,162.5,172.5,182.5,190,
1,F,M4,67.5,Raw,Anikó Csonka,1968,61.65,Hungary,,,170,170,D,,,,,,,,,155,165,170,172.5,
1,F,M5,60,Raw,Jana Janoušková,1960,58.3,Czechia,,,85,85,D,,,,,,,,,70,80,85,,
1,F,M5,67.5,Multi-ply,Brigitte Maczka,1961,66.15,Germany,,,108,108,D,,,,,,,,,100,108,,,
1,F,M5,67.5,Raw,Brigitte Maczka,1961,66.15,Germany,,,103,103,D,,,,,,,,,100,103,,,
1,F,M7,60,Raw,Astrid Fehr,1953,59,Germany,,,70,70,D,,,,,,,,,55,65,70,,
1,F,M7,67.5,Raw,Květuše Baranovičová,1953,60.3,Slovakia,,,90,90,D,,,,,,,,,70,-80,90,,
1,M,T1,60,Raw,Štěpán Král,2008,58.1,Czechia,,,166,166,D,,,,,,,,,155,166,-170,,
1,M,T1,67.5,Raw,Róbert Šimko,2010,61.35,Slovakia,,,130,130,D,,,,,,,,,120,130,-140,,
1,M,T1,75,Raw,Daniel Tomek,2008,74.5,Czechia,,,180,180,D,,,,,,,,,160,170,180,,
1,M,T1,82.5,Raw,Jan Haberny,2008,78.65,Poland,,,150,150,D,,,,,,,,,135,145,150,,
1,M,T1,90,Raw,Filip Legutko,2008,83.65,Poland,,,170,170,D,,,,,,,,,-160,160,170,,
1,M,T2,67.5,Raw,Rocco Struglia,2007,66.75,Italy,,,205,205,D,,,,,,,,,195,205,-210,,
2,M,T2,67.5,Raw,Dominik Czyszczoń,2006,64.45,Poland,,,155,155,D,,,,,,,,,-140,145,155,,
1,M,T2,75,Raw,Josef Scholz,2006,74.2,Czechia,,,250,250,D,,,,,,,,,240.5,250,-260,,
2,M,T2,75,Raw,David Soldán,2006,72.1,Czechia,,,220,220,D,,,,,,,,,200,220,-230,,
1,M,T2,82.5,Raw,David Šos,2006,80.15,Czechia,,,255,255,D,,,,,,,,,-250,255,-266,-266,
2,M,T2,82.5,Raw,Nadav Eliyahu,2006,82.5,Israel,,,185,185,D,,,,,,,,,170,185,-200,,
1,M,T3,67.5,Raw,Vojtěch Svoboda,2005,63.6,Czechia,,,210,210,D,,,,,,,,,-190,210,-215,,
1,M,T3,75,Raw,Mattia Mariani,2004,73.65,Italy,,,195,195,D,,,,,,,,,185,195,-202.5,,
1,M,T3,100,Raw,Jakub Jarończyk,2005,99.05,Poland,,,240,240,D,,,,,,,,,240,-250,,,
1,M,T3,110,Raw,Dawid Wasiuk,2005,106,Poland,,,292.5,292.5,D,,,,,,,,,-292.5,292.5,-305,,
1,M,J,67.5,Raw,Marek Belas,2001,66.85,Czechia,,,220,220,D,,,,,,,,,210,220,-225,,
1,M,J,75,Raw,Szymon Skrudlik,2001,69.85,Poland,,,190,190,D,,,,,,,,,170,180,190,,
1,M,J,82.5,Multi-ply,Václav Jírovec,2004,80.7,Czechia,,,241,241,D,,,,,,,,,220,230,241,,
1,M,J,82.5,Raw,Petr Kalčík,2000,82,Czechia,,,215,215,D,,,,,,,,,-190,190,215,,
2,M,J,82.5,Raw,Tyler Smith #4,2002,80,Scotland,,,210,210,D,,,,,,,,,190,200,210,,
1,M,J,90,Raw,Pavel Mynařík,2002,88,Czechia,,,270,270,D,,,,,,,,,250,270,-280,,
2,M,J,90,Raw,Adam Sokol,2003,83.6,Czechia,,,210,210,D,,,,,,,,,205,210,-215,,
1,M,J,100,Raw,David Mareš,2001,92.35,Czechia,,,240,240,D,,,,,,,,,220,240,-275,,
DQ,M,J,100,Raw,Stanislav Nečas,2004,95.75,Czechia,,,,,D,,,,,,,,,-275,-280,-280,,
1,M,J,110,Raw,Jiří Šmolík,2001,103.7,Czechia,,,237.5,237.5,D,,,,,,,,,225,237.5,-242.5,,
1,M,J,140,Raw,Elias Bergset,2001,137.8,Norway,,,270,270,D,,,,,,,,,-260,270,-300,,
2,M,J,140,Raw,Petr Matěna,2001,127.8,Czechia,,,260,260,D,,,,,,,,,240,260,-280,,
1,M,O,60,Raw,Denis Jarma,1999,59.9,Czechia,,,240,240,D,,,,,,,,,215,230,240,245,
1,M,O,67.5,Raw,Jiří Lacina,1991,66.9,Czechia,,,230,230,D,,,,,,,,,210,230,-240,,
1,M,O,75,Raw,Lubomír Teplý,2000,73.8,Czechia,,,260,260,D,,,,,,,,,260,-270,-270,,
2,M,O,75,Raw,Martin Jindra,1992,74.5,Czechia,,,135,135,D,,,,,,,,,130,-135,135,,
1,M,O,82.5,Raw,Jiří Balabán,1995,78.65,Czechia,,,272.5,272.5,D,,,,,,,,,262.5,272.5,-280,,
2,M,O,82.5,Raw,Martin Ürban,1991,79.5,Czechia,,,247.5,247.5,D,,,,,,,,,230,240,247.5,,
3,M,O,82.5,Raw,Andrea Salvemini,1988,80.15,Italy,,,247.5,247.5,D,,,,,,,,,220,235,247.5,,
4,M,O,82.5,Raw,Marián Lipták,1994,80.8,Slovakia,,,225,225,D,,,,,,,,,225,-227.5,,,
5,M,O,82.5,Raw,Petr Nekvapil,1992,76.15,Czechia,,,160,160,D,,,,,,,,,150,155,160,,
1,M,O,90,Raw,Alessio Turchetti,1999,89.15,Italy,,,287.5,287.5,D,,,,,,,,,270,-285,287.5,,
2,M,O,90,Raw,Šimon Matějka,1994,87.75,Czechia,,,280,280,D,,,,,,,,,-280,280,-290,,
3,M,O,90,Raw,Vojtěch Semerád,1994,89,Czechia,,,280,280,D,,,,,,,,,-270,280,-285,,
4,M,O,90,Raw,Pál Tóth,1991,87.6,Hungary,,,270,270,D,,,,,,,,,270,-280,-280,,
5,M,O,90,Raw,Vojtěch Žemba,1997,88.5,Czechia,,,220,220,D,,,,,,,,,205,-220,220,,
1,M,O,100,Multi-ply,Martin Studnička,1993,97.6,Czechia,,,295,295,D,,,,,,,,,270,290,295,,
1,M,O,100,Raw,Đorđe Miljenović,1999,98.2,Montenegro,,,335,335,D,,,,,,,,,310,325,335,-346,
2,M,O,100,Raw,Lukáš Prekop,1994,95.25,Slovakia,,,300,300,D,,,,,,,,,300,-305,-305,,
3,M,O,100,Raw,Tomáš Obert,1993,93.65,Czechia,,,280,280,D,,,,,,,,,260,280,-290,,
4,M,O,100,Raw,Francesco Cinfrignini,1999,92.85,Italy,,,240,240,D,,,,,,,,,240,-250,-250,,
5,M,O,100,Raw,Lukáš Heřman,1989,91.95,Czechia,,,217.5,217.5,D,,,,,,,,,217.5,-235,,,
1,M,O,110,Multi-ply,Leon Pavlovic,1992,109.2,Norway,,,310,310,D,,,,,,,,,300,310,-317.5,,
2,M,O,110,Multi-ply,Grzegorz Drewniany,1977,102,Poland,,,280,280,D,,,,,,,,,280,-300,-300,,
3,M,O,110,Multi-ply,Ondřej Kratochvíl,1985,106.8,Czechia,,,275,275,D,,,,,,,,,260,275,-290,,
1,M,O,110,Raw,Tomáš Hovorka,1998,108.8,Czechia,,,315,315,D,,,,,,,,,300,315,-325,,
2,M,O,110,Raw,Jakub Telička,1998,105.5,Czechia,,,290,290,D,,,,,,,,,290,-300,-300,,
3,M,O,110,Raw,Ondřej Kratochvíl,1985,106.8,Czechia,,,260,260,D,,,,,,,,,260,-285,,,
1,M,O,125,Raw,Juraj Kačmárik,1985,115.2,Slovakia,,,345,345,D,,,,,,,,,325,345,-360.5,,
2,M,O,125,Raw,Rafał Leszek Wójcik,1987,118.4,Poland,,,300,300,D,,,,,,,,,300,-310,,,
3,M,O,125,Raw,Giovanni Guida,1990,119.2,Italy,,,262.5,262.5,D,,,,,,,,,240,262.5,-280,,
1,M,O,140,Raw,Ondřej Švanda,1985,125.4,Czechia,,,250,250,D,,,,,,,,,240,250,-260,,
1,M,O,140+,Raw,Marko Varagić,1995,162.7,Montenegro,,,327.5,327.5,D,,,,,,,,,300,327.5,-340,,
2,M,O,140+,Raw,Róbert Šimko,1986,145,Slovakia,,,310,310,D,,,,,,,,,300,310,-327.5,,
3,M,O,140+,Raw,Nino Jelčić,1995,162.8,Czechia,,,290,290,D,,,,,,,,,290,-310,-310,,
4,M,O,140+,Raw,Lajos Biró,1996,149.2,Hungary,,,270,270,D,,,,,,,,,255,270,-300,,
1,M,M1,82.5,Raw,Martin Sýkora,1983,82.25,Czechia,,,205,205,D,,,,,,,,,180,200,205,,
1,M,M1,100,Raw,Aleš Korba,1983,98.15,Czechia,,,240,240,D,,,,,,,,,220,230,240,,
2,M,M1,100,Raw,Jörn Erik Baier,1983,95.1,Germany,,,147.5,147.5,D,,,,,,,,,135,147.5,-160,,
1,M,M1,110,Raw,Mariusz Bartołowicz,1979,108.6,Poland,,,295,295,D,,,,,,,,,280,295,-302.5,,
2,M,M1,110,Raw,Štefan Elischer,1982,106.5,Slovakia,,,270,270,D,,,,,,,,,270,-285,,,
3,M,M1,110,Raw,Jan Sztefek,1983,101.4,Czechia,,,250,250,D,,,,,,,,,240,250,-255,,
1,M,M1,125,Multi-ply,Tomáš Kaas,1984,119.1,Czechia,,,310,310,D,,,,,,,,,290,310,-322.5,,
1,M,M1,125,Raw,Nikola Lazović,1982,111.3,Montenegro,,,280,280,D,,,,,,,,,280,-290,-290,,
1,M,M1,140,Multi-ply,Andrew Cairney,1979,130,Scotland,,,270,270,D,,,,,,,,,270,,,,
1,M,M1,140+,Raw,Mariusz Wyrozębski,1982,159.6,Poland,,,250,250,D,,,,,,,,,230,250,-280,,
1,M,M2,75,Raw,Angelo Finelli,1975,69.45,Italy,,,205,205,D,,,,,,,,,200,205,-207.5,,
2,M,M2,75,Raw,Gleb Kryss,1978,71.4,Israel,,,100,100,D,,,,,,,,,-100,100,-120,,
1,M,M2,90,Multi-ply,Konstantin Glok,1975,89.15,Germany,,,165,165,D,,,,,,,,,150,160,165,,
1,M,M2,90,Raw,Konstantin Glok,1975,89.15,Germany,,,180,180,D,,,,,,,,,155,170,180,,
1,M,M2,100,Raw,Vlastimil Kalaš,1979,98.45,Czechia,,,250,250,D,,,,,,,,,225,250,-270,,
2,M,M2,100,Raw,Pietro Molinari,1975,98.85,Italy,,,200,200,D,,,,,,,,,180,200,-210,,
DQ,M,M2,110,Raw,Ľubomír Trstenský,1974,102.6,Slovakia,,,,,D,,,,,,,,,-205,,,,
1,M,M2,125,Raw,Maris Kipurs,1978,111,Latvia,,,240,240,D,,,,,,,,,220,240,-265,,
1,M,M3,75,Raw,Giuseppe Loiotile,1972,71,Italy,,,202.5,202.5,D,,,,,,,,,-200,-202.5,202.5,,
1,M,M3,90,Raw,Jasmin Kočan,1971,88.9,Montenegro,,,230,230,D,,,,,,,,,200,-220,230,,
2,M,M3,90,Raw,Armando Pistilli,1969,83.1,Italy,,,160,160,D,,,,,,,,,135,145,160,,
1,M,M3,100,Multi-ply,Niclas Friberg,1974,93.4,Sweden,,,260,260,D,,,,,,,,,240,260,-280.5,,
1,M,M3,100,Raw,Zdeněk Brauner,1972,96.35,Czechia,,,250,250,D,,,,,,,,,240,250,,,
1,M,M3,110,Multi-ply,Josef Jeníček,1973,105.3,Czechia,,,230,230,D,,,,,,,,,220,230,-240,,
1,M,M3,125,Raw,Robert Nemś,1969,117,Poland,,,255,255,D,,,,,,,,,240,250,255,,
2,M,M3,125,Raw,Jaroslav Troníček,1971,111.2,Czechia,,,220,220,D,,,,,,,,,200,220,-230,,
1,M,M4,82.5,Raw,Liam Beville,1965,81.45,Ireland,,,235,235,D,,,,,,,,,235,-245,-245,,
1,M,M4,90,Raw,Petr Rambousek,1964,84,Czechia,,,225,225,D,,,,,,,,,200,220,225,,
1,M,M4,100,Multi-ply,Valery Tomilov,1965,99.1,Israel,,,235,235,D,,,,,,,,,225,235,,,
1,M,M4,100,Raw,Vladimír Gosin,1965,93.7,Israel,,,260,260,D,,,,,,,,,220,240,260,,
1,M,M4,110,Raw,Attila Heizer,1965,101.1,Hungary,,,190,190,D,,,,,,,,,170,185,190,,
1,M,M4,125,Multi-ply,Tibor Manzera,1968,110.8,Hungary,,,190,190,D,,,,,,,,,160,175,190,,
DQ,M,M4,125,Raw,Ronen Eliyahu,1968,113.8,Israel,,,,,D,,,,,,,,,,,,,
1,M,M5,82.5,Raw,Sejfo Šehović,1959,78.95,Bosnia and Herzegovina,,,280,280,D,,,,,,,,,250,270,280,,
1,M,M5,90,Raw,Gábor Kovács,1962,87.6,Hungary,,,130,130,D,,,,,,,,,100,120,130,,
1,M,M5,100,Raw,Jiří Táborský,1963,99.3,Czechia,,,230,230,D,,,,,,,,,200,215,230,,
1,M,M5,110,Raw,Tibor Gejdoš,1963,103.1,Slovakia,,,240,240,D,,,,,,,,,220,240,-255,,
1,M,M6,82.5,Raw,Karel Shoř,1955,80.05,Czechia,,,150,150,D,,,,,,,,,150,-160,-160,,
1,M,M6,90,Multi-ply,Mieczysłąw Maczka,1954,84.8,Germany,,,162.5,162.5,D,,,,,,,,,145,162.5,,,
1,M,M6,90,Raw,Mieczysłąw Maczka,1954,84.8,Germany,,,140,140,D,,,,,,,,,140,,,,
1,M,M6,100,Raw,Petr Nosek,1959,95.5,Czechia,,,160,160,D,,,,,,,,,150,155,160,,
1,M,M6,110,Multi-ply,Hans Hellsten,1958,103.8,Sweden,,,230,230,D,,,,,,,,,-215,-230,230,,
1,M,M6,125,Multi-ply,Lee Marshall,1959,112.6,England,,,270,270,D,,,,,,,,,250,260,270,280,
1,M,M6,125,Raw,Olavi Rintanen,1955,120.4,Finland,,,262.5,262.5,D,,,,,,,,,230,250,262.5,,
1,M,M7,75,Raw,Boris Laishin,1950,70.9,Estonia,,,182.5,182.5,D,,,,,,,,,165,175,182.5,,
1,M,M7,90,Raw,Lothar Schulze,1950,83.15,Germany,,,165,165,D,,,,,,,,,155,165,-170,,
DQ,M,M7,110,Multi-ply,David Rex Thomas,1951,109.9,England,,,,,D,,,,,,,,,,,,,
DQ,M,M8,67.5,Raw,Carlo Aniello Ricci,1947,65.55,Italy,,,,,D,,,,,,,,,-160,-160,,,
1,M,M8,75,Raw,Jozef Bartek,1945,72.65,Slovakia,,,70,70,D,,,,,,,,,50,60,70,,
1,M,M8,82.5,Multi-ply,Stefan Sochaňski,1948,81.3,Poland,,,200,200,D,,,,,,,,,175,185,200,,
2,M,M8,82.5,Multi-ply,Alexander Papir,1945,79.5,Israel,,,177.5,177.5,D,,,,,,,,,160,170,177.5,,
1,M,M8,82.5,Raw,Stefan Sochaňski,1948,81.3,Poland,,,172.5,172.5,D,,,,,,,,,160,172.5,,,
1,M,M9,82.5,Multi-ply,Jaroslav Tomanec,1943,82.1,Czechia,,,135,135,D,,,,,,,,,135,-140,-140,,
