Name,Team,BodyweightKg,WeightClassKg,Bench1Kg,Bench2Kg,Bench3Kg,Best3BenchKg,TotalKg,Event,Equipment,Sex,Division,BirthDate,Place
Allison Baggett,Baker,44.36,45.81,56.7,58.97,-61.23,58.97,58.97,B,Raw,F,Class 1A,,2
Katie Griffith,Ft. White,44.32,45.81,56.7,61.23,-63.5,61.23,61.23,B,Raw,F,Class 1A,,1
Aislinn Henry,Suwannee,44.68,45.81,47.63,52.16,-54.43,52.16,52.16,B,Raw,F,Class 1A,,4
Andje Costa,Cypress Creek,44.27,45.81,49.9,52.16,-54.43,52.16,52.16,B,Raw,F,Class 1A,,3
Katie Layfield,Altha,44.54,45.81,45.36,49.9,-52.16,49.9,49.9,B,Raw,F,Class 1A,,5
Macy Bowers,Suwannee,43.09,45.81,40.82,45.36,-49.9,45.36,45.36,B,Raw,F,Class 1A,,7
Rylan Chapa,Marathon,44.18,45.81,40.82,43.09,-45.36,43.09,43.09,B,Raw,F,Class 1A,,6
Amelia Nunery,Bozeman,40.78,45.81,40.82,43.09,45.36,45.36,45.36,B,Raw,F,Class 1A,,9
Emily Fine,Umatilla,44.77,45.81,43.09,45.36,49.9,49.9,49.9,B,Raw,F,Class 1A,,8
Rosie Carmichael,Menendez,43.36,45.81,40.82,43.09,-45.36,43.09,43.09,B,Raw,F,Class 1A,,10
Tayler Barberree,Frostproof,44.5,45.81,36.29,40.82,43.09,43.09,43.09,B,Raw,F,Class 1A,,11
Morgan Cox,Trinity Prep,44.5,45.81,38.56,40.82,43.09,43.09,43.09,B,Raw,F,Class 1A,,18
Madison Wilkes,Weeki Wachee,44.04,45.81,36.29,-38.56,38.56,38.56,38.56,B,Raw,F,Class 1A,,15
Angel Poole,Chiefland,43.95,45.81,36.29,38.56,40.82,40.82,40.82,B,Raw,F,Class 1A,,17
Ericka Hoffman,Chiefland,45.27,45.81,40.82,-43.09,-43.09,40.82,,B,Raw,F,Class 1A,,DQ
Annavera Peixoto,Coral Shores,43.77,45.81,-38.56,38.56,-40.82,38.56,38.56,B,Raw,F,Class 1A,,13
Allie Brabenec,Marathon,42.68,45.81,36.29,38.56,40.82,40.82,40.82,B,Raw,F,Class 1A,,14
Nikki Degraff,Interlachen,43.68,45.81,34.02,38.56,40.82,40.82,40.82,B,Raw,F,Class 1A,,16
Jacelyn Crawford,Mulberry,40.69,45.81,36.29,40.82,43.09,43.09,43.09,B,Raw,F,Class 1A,,12
Alyssa Kizer,Menendez,42,45.81,36.29,-38.56,-38.56,36.29,,B,Raw,F,Class 1A,,DQ
Matti Marsee,Suwannee,47.99,49.9,58.97,63.5,65.77,65.77,65.77,B,Raw,F,Class 1A,,1
Brooke Knapp,Lemon Bay,46.36,49.9,56.7,58.97,-61.23,58.97,58.97,B,Raw,F,Class 1A,,3
Emma Respress,Fort Meade,47.81,49.9,47.63,52.16,54.43,54.43,54.43,B,Raw,F,Class 1A,,4
Layla Goins,Altha,47.45,49.9,52.16,56.7,61.23,61.23,61.23,B,Raw,F,Class 1A,,2
Ella Nelson,Jay,47.45,49.9,47.63,52.16,-54.43,52.16,52.16,B,Raw,F,Class 1A,,7
Kaylee Carolan,Wolfson,48.13,49.9,54.43,56.7,58.97,58.97,58.97,B,Raw,F,Class 1A,,5
Kali Christie,Hernando,48.4,49.9,49.9,54.43,56.7,56.7,56.7,B,Raw,F,Class 1A,,6
Gianna Grassi,Central,48.99,49.9,54.43,56.7,-58.97,56.7,56.7,B,Raw,F,Class 1A,,8
Ali McMillan,Suwannee,47.9,49.9,43.09,47.63,49.9,49.9,49.9,B,Raw,F,Class 1A,,9
Ciarra Hernandez,Labelle,48.04,49.9,43.09,45.36,-47.63,45.36,45.36,B,Raw,F,Class 1A,,13
Paola Santos,Villages,45.9,49.9,47.63,49.9,52.16,52.16,52.16,B,Raw,F,Class 1A,,10
Hannah Lynch,Hernando,48.4,49.9,47.63,49.9,52.16,52.16,52.16,B,Raw,F,Class 1A,,11
Rileigh Phelps,Bozeman,46.58,49.9,40.82,43.09,-45.36,43.09,43.09,B,Raw,F,Class 1A,,16
Sienna Silvest,Cypress Creek,46.18,49.9,43.09,45.36,47.63,47.63,47.63,B,Raw,F,Class 1A,,12
Kendall Pumphrey,Blountstown,47.67,49.9,43.09,47.63,-49.9,47.63,47.63,B,Raw,F,Class 1A,,17
Alissa Thompson,Frostproof,48.4,49.9,45.36,49.9,52.16,52.16,52.16,B,Raw,F,Class 1A,,15
Valerie Thene,Key West,49.03,49.9,43.09,45.36,47.63,47.63,47.63,B,Raw,F,Class 1A,,14
Gabby Gonzalez,Cypress Creek,46.81,49.9,43.09,45.36,47.63,47.63,47.63,B,Raw,F,Class 1A,,18
Brooke Andrews,Lemon Bay,46.72,49.9,34.02,-36.29,-36.29,34.02,,B,Raw,F,Class 1A,,DQ
Anna Pham,Bishop Snyder,48.76,49.9,-38.56,-38.56,-38.56,,,B,Raw,F,Class 1A,,DQ
Lexi Lucas,Baker,51.26,53.98,56.7,61.23,65.77,65.77,65.77,B,Raw,F,Class 1A,,1
Haleigh-Ray Harris,Branford,51.21,53.98,54.43,56.7,58.97,58.97,58.97,B,Raw,F,Class 1A,,3
Erica Roseke,Union Co.,53.84,53.98,56.7,61.23,-63.5,61.23,61.23,B,Raw,F,Class 1A,,2
Sarah Metcalf,Port St. Joe,51.62,53.98,-56.7,-56.7,-56.7,-56.7,,B,Raw,F,Class 1A,,DQ
Jada Brown,Vernon,52.25,53.98,45.36,49.9,52.16,52.16,52.16,B,Raw,F,Class 1A,,4
Audra Phillips,Marianna,53.12,53.98,58.97,61.23,-65.77,61.23,61.23,B,Raw,F,Class 1A,,5
Nathalia Veal,Branford,52.12,53.98,47.63,49.9,52.16,52.16,52.16,B,Raw,F,Class 1A,,8
Hayley Hebrock,South Sumter,51.94,53.98,56.7,-58.97,-58.97,56.7,56.7,B,Raw,F,Class 1A,,9
Chloe Martinez,Frostproof,52.25,53.98,54.43,56.7,-61.23,56.7,56.7,B,Raw,F,Class 1A,,7
Caley Sosnowski,Villages,53.43,53.98,49.9,52.16,54.43,54.43,54.43,B,Raw,F,Class 1A,,6
Bryn Atherholt,Lemon Bay,52.57,53.98,52.16,-54.43,-54.43,52.16,,B,Raw,F,Class 1A,,DQ
Maddie Philio,Atlantic,52.75,53.98,52.16,-54.43,54.43,54.43,54.43,B,Raw,F,Class 1A,,18
Alyssa Lake,South Sumter,51.62,53.98,52.16,-54.43,-54.43,52.16,52.16,B,Raw,F,Class 1A,,10
Journey Vidaurri,Labelle,50.76,53.98,49.9,-52.16,-52.16,49.9,49.9,B,Raw,F,Class 1A,,13
Kathryn Farrell,Fernandina Beach,53.16,53.98,47.63,52.16,-54.43,52.16,52.16,B,Raw,F,Class 1A,,12
Hannah Yared,Trinity Prep,53.52,53.98,40.82,-45.36,-47.63,40.82,40.82,B,Raw,F,Class 1A,,17
Alison Woltanski,Coral Shores,53.39,53.98,40.82,43.09,-45.36,43.09,43.09,B,Raw,F,Class 1A,,15
Mikayla Cooper,Bradford,53.75,53.98,43.09,-47.63,-47.63,43.09,43.09,B,Raw,F,Class 1A,,16
Natalie Montgomery,Mount Dora,53.52,53.98,54.43,58.97,-61.23,58.97,58.97,B,Raw,F,Class 1A,,11
Megan Fischer,Lemon Bay,52.53,53.98,-47.63,47.63,-52.16,47.63,47.63,B,Raw,F,Class 1A,,14
Sophia Baldwin,Suwannee,57.24,58.51,58.97,63.5,-65.77,63.5,63.5,B,Raw,F,Class 1A,,3
Kaitlyn Fretwell,Jay,57.38,58.51,68.04,72.57,-74.84,72.57,72.57,B,Raw,F,Class 1A,,2
Braeden Smith #1,Altha,57.24,58.51,70.31,74.84,-77.11,74.84,74.84,B,Raw,F,Class 1A,,1
Allie Weiser,Fernandina Beach,57.11,58.51,63.5,68.04,-72.57,68.04,68.04,B,Raw,F,Class 1A,,4
Aydria Urshan,Lemon Bay,58.01,58.51,63.5,65.77,68.04,68.04,68.04,B,Raw,F,Class 1A,,5
Raven Barnes,Atlantic,57.7,58.51,65.77,-68.04,68.04,68.04,68.04,B,Raw,F,Class 1A,,6
Brianna Dunsford,Jay,57.24,58.51,58.97,63.5,-65.77,63.5,63.5,B,Raw,F,Class 1A,,7
Hannah Terry,Branford,57.92,58.51,56.7,58.97,-61.23,58.97,58.97,B,Raw,F,Class 1A,,8
Krista Leo,Lemon Bay,56.38,58.51,54.43,-58.97,-58.97,54.43,54.43,B,Raw,F,Class 1A,,11
Sofia Bernal,Father Lopez,58.01,58.51,61.23,63.5,-68.04,63.5,63.5,B,Raw,F,Class 1A,,9
Ulicia Grantin,Pahokee,58.38,58.51,52.16,56.7,61.23,61.23,61.23,B,Raw,F,Class 1A,,10
Marissa Sullivan,Villages,56.52,58.51,56.7,58.97,-61.23,58.97,58.97,B,Raw,F,Class 1A,,19
Ariana Manzano,Cypress Creek,57.88,58.51,47.63,49.9,54.43,54.43,54.43,B,Raw,F,Class 1A,,12
Morgan Marshall #2,Bay,56.7,58.51,49.9,-54.43,-54.43,49.9,49.9,B,Raw,F,Class 1A,,16
Alexis Beaulieu,Windermere Prep,56.84,58.51,52.16,54.43,56.7,56.7,56.7,B,Raw,F,Class 1A,,13
Mikah Harvey,Palatka,55.97,58.51,54.43,-58.97,-58.97,54.43,54.43,B,Raw,F,Class 1A,,15
Abbie Light,Villages,55.25,58.51,52.16,54.43,-56.7,54.43,54.43,B,Raw,F,Class 1A,,14
Shelby Young,Weeki Wachee,56.74,58.51,49.9,-52.16,-52.16,49.9,49.9,B,Raw,F,Class 1A,,18
Nyiah Vanhoose,Bonita Springs,58.01,58.51,-54.43,56.7,-58.97,56.7,56.7,B,Raw,F,Class 1A,,17
Evie Pitts,Branford,59.87,63.05,72.57,-74.84,-74.84,72.57,72.57,B,Raw,F,Class 1A,,1
Tyrah Kalandyk,Suwannee,61.87,63.05,72.57,77.11,79.38,79.38,79.38,B,Raw,F,Class 1A,,2
Tiffany Crady,Lemon Bay,61.14,63.05,-79.38,79.38,-83.91,79.38,79.38,B,Raw,F,Class 1A,,4
Alisa Mendes,Frostproof,62.01,63.05,77.11,81.65,83.91,83.91,83.91,B,Raw,F,Class 1A,,3
Flynn Baliton,Father Lopez,60.19,63.05,61.23,65.77,-68.04,65.77,65.77,B,Raw,F,Class 1A,,5
Emily Allen,Mount Dora CA,61.1,63.05,58.97,61.23,-63.5,61.23,61.23,B,Raw,F,Class 1A,,6
Dominica Dennis,Wewahitchka,62.28,63.05,58.97,-63.5,-63.5,58.97,58.97,B,Raw,F,Class 1A,,7
Hannah Taylor,Hernando,61.51,63.05,54.43,58.97,-61.23,58.97,58.97,B,Raw,F,Class 1A,,9
Melissa Raya,Labelle,60.06,63.05,63.5,65.77,-68.04,65.77,65.77,B,Raw,F,Class 1A,,8
Alexis Wagner,Baker,60.01,63.05,52.16,56.7,-58.97,56.7,56.7,B,Raw,F,Class 1A,,10
Christa Sanders,Jay,61.14,63.05,56.7,-61.23,-61.23,56.7,56.7,B,Raw,F,Class 1A,,13
Johanna Alicia,Suwannee,62.14,63.05,52.16,56.7,58.97,58.97,58.97,B,Raw,F,Class 1A,,20
Taylor Foster #3,Wildwood,61.1,63.05,52.16,54.43,-56.7,54.43,54.43,B,Raw,F,Class 1A,,16
Julia Weiser,Fernandina Beach,62.19,63.05,52.16,61.23,-63.5,61.23,61.23,B,Raw,F,Class 1A,,14
Jasmin Guerrero,Chiefland,61.01,63.05,52.16,54.43,56.7,56.7,56.7,B,Raw,F,Class 1A,,11
Emma Willis,Labelle,61.09,63.05,56.7,-58.97,-58.97,56.7,56.7,B,Raw,F,Class 1A,,12
Destiny Cox #3,Bishop Snyder,62.19,63.05,52.16,54.43,-56.7,54.43,54.43,B,Raw,F,Class 1A,,18
Danielle Work,Windermere Prep,61.46,63.05,49.9,52.16,54.43,54.43,54.43,B,Raw,F,Class 1A,,17
Katronica Tape,Crescent City,61.96,63.05,47.63,49.9,52.16,52.16,52.16,B,Raw,F,Class 1A,,19
Laney Maynard,Weeki Wachee,60.47,63.05,54.43,56.7,-58.97,56.7,56.7,B,Raw,F,Class 1A,,15
Marijane Davis,Altha,68.95,69.85,77.11,81.65,83.91,83.91,83.91,B,Raw,F,Class 1A,,1
Brianna Jordan,Bradford,66.41,69.85,72.57,-77.11,-79.38,72.57,72.57,B,Raw,F,Class 1A,,2
Gabrielle Nicodemus,Port St. Joe,66.32,69.85,63.5,68.04,-70.31,68.04,68.04,B,Raw,F,Class 1A,,3
Janet Villa-Rodriguez,Labelle,67.9,69.85,65.77,70.31,-72.57,70.31,70.31,B,Raw,F,Class 1A,,6
Carson Frier,Suwannee,66.9,69.85,54.43,61.23,-63.5,61.23,61.23,B,Raw,F,Class 1A,,4
Casey Whittington,Frostproof,68.27,69.85,63.5,-68.04,-68.04,63.5,63.5,B,Raw,F,Class 1A,,7
Meredith Bailey,Holmes,67,69.85,68.04,-72.57,-72.57,68.04,68.04,B,Raw,F,Class 1A,,5
Presley Engelauf,Lemon Bay,63.28,69.85,56.7,61.23,-63.5,61.23,61.23,B,Raw,F,Class 1A,,8
Emma Brown #2,Suwannee,67.99,69.85,54.43,58.97,63.5,63.5,63.5,B,Raw,F,Class 1A,,9
Jorga Barton,Palatka,69.76,69.85,-56.7,56.7,-61.23,56.7,56.7,B,Raw,F,Class 1A,,11
Kaylee Stokey,Coral Shores,66.04,69.85,52.16,54.43,-56.7,54.43,54.43,B,Raw,F,Class 1A,,10
Kylie Stephens,Marianna,68.36,69.85,54.43,56.7,-61.23,56.7,56.7,B,Raw,F,Class 1A,,20
Jazmin Vidana,Crescent City,68.04,69.85,52.16,56.7,61.23,61.23,61.23,B,Raw,F,Class 1A,,12
Lauren Ragazonne,Lemon Bay,66.59,69.85,52.16,54.43,56.7,56.7,56.7,B,Raw,F,Class 1A,,14
Morgan Casel,Hudson,67.63,69.85,54.43,58.97,-61.23,58.97,58.97,B,Raw,F,Class 1A,,18
Amelia Bunting,Hernando,68.27,69.85,52.16,56.7,-61.23,56.7,56.7,B,Raw,F,Class 1A,,15
Cruz Carreno,Labelle,68.13,69.85,54.43,56.7,-58.97,56.7,56.7,B,Raw,F,Class 1A,,13
Kathleen Johnson,Father Lopez,63.68,69.85,47.63,49.9,52.16,52.16,52.16,B,Raw,F,Class 1A,,16
Miayhel Williams,Bronson,67.09,69.85,45.36,-54.43,56.7,56.7,56.7,B,Raw,F,Class 1A,,17
Kimberly Zambrana,Wildwood,63.82,69.85,47.63,-52.16,-52.16,47.63,47.63,B,Raw,F,Class 1A,,19
Courtney Comer,Union Co.,73.89,76.66,102.06,106.59,111.13,111.13,111.13,B,Raw,F,Class 1A,,1
Kayla Maddox,Marianna,74.71,76.66,-74.84,-77.11,77.11,77.11,77.11,B,Raw,F,Class 1A,,2
Landin Johnson,Wewahitchka,76.57,76.66,-70.31,70.31,72.57,72.57,72.57,B,Raw,F,Class 1A,,3
Brianna Mobley,Hernando,74.8,76.66,68.04,72.57,-77.11,72.57,72.57,B,Raw,F,Class 1A,,4
Marina Goins,Key West,72.53,76.66,65.77,68.04,-70.31,68.04,68.04,B,Raw,F,Class 1A,,5
Carlyn Watson,Jay,70.26,76.66,68.04,72.57,-74.84,72.57,72.57,B,Raw,F,Class 1A,,6
Alexis Adams,South Sumter,76.34,76.66,58.97,-63.5,-63.5,58.97,58.97,B,Raw,F,Class 1A,,19
Abnelle Jean-Louis,Pahokee,75.16,76.66,-65.77,68.04,72.57,72.57,72.57,B,Raw,F,Class 1A,,7
Kristen Adkisson,Mount Dora,75.75,76.66,61.23,-63.5,-63.5,61.23,61.23,B,Raw,F,Class 1A,,12
Naudia Carach,Northview,75.16,76.66,58.97,-61.23,-61.23,58.97,58.97,B,Raw,F,Class 1A,,11
Jalecia Pride,Madison,73.8,76.66,65.77,70.31,-72.57,70.31,70.31,B,Raw,F,Class 1A,,8
Alexis McElroy,Frostproof,73.03,76.66,63.5,65.77,68.04,68.04,68.04,B,Raw,F,Class 1A,,20
Haley Willford,Sneads,72.44,76.66,56.7,61.23,65.77,65.77,65.77,B,Raw,F,Class 1A,,9
Whitney Kelly,Andrew Jackson,73.12,76.66,54.43,56.7,-61.23,56.7,56.7,B,Raw,F,Class 1A,,10
Camden Posey,Palatka,70.35,76.66,58.97,-61.23,-61.23,58.97,58.97,B,Raw,F,Class 1A,,13
Mackenzie Holappa,Bonita Springs,72.03,76.66,54.43,-56.7,-56.7,54.43,54.43,B,Raw,F,Class 1A,,17
Launa Willsey,Mount Dora,70.4,76.66,47.63,49.9,52.16,52.16,52.16,B,Raw,F,Class 1A,,15
Lillyanna Hernandez,Lemon Bay,71.35,76.66,52.16,56.7,-61.23,56.7,56.7,B,Raw,F,Class 1A,,16
Adrienne Alvarado,Villages,75.07,76.66,52.16,54.43,-56.7,54.43,54.43,B,Raw,F,Class 1A,,18
Noema Pinchinat,John Carroll,72.3,76.66,54.43,56.7,-58.97,56.7,56.7,B,Raw,F,Class 1A,,14
Jenna McClain,Labelle,81.69,83.01,97.52,102.06,104.33,104.33,104.33,B,Raw,F,Class 1A,,1
Takeirra Bakken,Bradford,78.02,83.01,65.77,70.31,72.57,72.57,72.57,B,Raw,F,Class 1A,,2
Maddie Carte,Suwannee,81.78,83.01,65.77,70.31,72.57,72.57,72.57,B,Raw,F,Class 1A,,3
Hailey Bradt,Weeki Wachee,82.24,83.01,65.77,70.31,-77.11,70.31,70.31,B,Raw,F,Class 1A,,5
McKayla Cantrell,Cardinal Mooney,79.56,83.01,68.04,72.57,74.84,74.84,74.84,B,Raw,F,Class 1A,,4
Madison Hayes,Bay,81.65,83.01,63.5,65.77,68.04,68.04,68.04,B,Raw,F,Class 1A,,7
Liberty Harahaus,Bradford,81.47,83.01,52.16,56.7,61.23,61.23,61.23,B,Raw,F,Class 1A,,6
Erin Starling,Suwannee,77.29,83.01,52.16,56.7,61.23,61.23,61.23,B,Raw,F,Class 1A,,10
Anna Price,Baker,78.43,83.01,58.97,63.5,-65.77,63.5,,B,Raw,F,Class 1A,,DQ
Mackenzie Glenn,Baker,81.6,83.01,61.23,63.5,-65.77,63.5,63.5,B,Raw,F,Class 1A,,8
Natalie Work,Windermere Prep,79.02,83.01,49.9,52.16,54.43,54.43,54.43,B,Raw,F,Class 1A,,9
Erika Perez,Bishop Snyder,82.87,83.01,58.97,61.23,63.5,63.5,63.5,B,Raw,F,Class 1A,,18
Jhanae Mcfarland,Central,79.47,83.01,52.16,54.43,-56.7,54.43,,B,Raw,F,Class 1A,,DQ
Aurlee Perkins,Sneads,82.92,83.01,56.7,58.97,-61.23,58.97,58.97,B,Raw,F,Class 1A,,13
Gabby Cochran,Trinity Prep,77.11,83.01,52.16,56.7,58.97,58.97,58.97,B,Raw,F,Class 1A,,11
Gabi Cook,Fernandina Beach,80.2,83.01,49.9,52.16,54.43,54.43,54.43,B,Raw,F,Class 1A,,12
Maelynn Allen,Cypress Creek,81.96,83.01,52.16,54.43,-56.7,54.43,54.43,B,Raw,F,Class 1A,,15
Berkely Barton,Villages,81.1,83.01,52.16,54.43,-56.7,54.43,54.43,B,Raw,F,Class 1A,,14
Alexandria Harris,Lemon Bay,76.84,83.01,52.16,56.7,-61.23,56.7,56.7,B,Raw,F,Class 1A,,17
Sadie Beck,Chiefland,77.97,83.01,54.43,-56.7,56.7,56.7,56.7,B,Raw,F,Class 1A,,16
Mariah Baker,Wewahitchka,86.86,90.26,-88.45,88.45,-92.99,88.45,88.45,B,Raw,F,Class 1A,,1
Alicia Horton,Bishop Snyder,88.36,90.26,81.65,-86.18,-86.18,81.65,81.65,B,Raw,F,Class 1A,,3
Marleah Dampier,Fernandina Beach,83.73,90.26,72.57,81.65,86.18,86.18,86.18,B,Raw,F,Class 1A,,2
Gabrielle Oliver,Bradford,83.51,90.26,68.04,72.57,77.11,77.11,77.11,B,Raw,F,Class 1A,,4
Cassandra Heeg,Lemon Bay,83.46,90.26,63.5,68.04,70.31,70.31,70.31,B,Raw,F,Class 1A,,5
Kelsen Cook,Jay,88,90.26,63.5,68.04,-72.57,68.04,68.04,B,Raw,F,Class 1A,,6
Riley Leblanc,Taylor,89.36,90.26,70.31,77.11,79.38,79.38,79.38,B,Raw,F,Class 1A,,7
Jordynn Lansford,Villages,89.22,90.26,68.04,70.31,-72.57,70.31,,B,Raw,F,Class 1A,,DQ
Amber Stevens,Coral Shores,84.82,90.26,70.31,74.84,-77.11,74.84,74.84,B,Raw,F,Class 1A,,9
Audra Dew,Bay,89.86,90.26,65.77,-68.04,68.04,68.04,68.04,B,Raw,F,Class 1A,,8
Gracie Marshall,Blountstown,88.72,90.26,-68.04,68.04,-70.31,68.04,68.04,B,Raw,F,Class 1A,,10
Chiara Perfetto,Bonita Springs,87.5,90.26,65.77,70.31,-72.57,70.31,70.31,B,Raw,F,Class 1A,,19
Brooke-Lyn Hanuszak,Suwannee,87.23,90.26,52.16,56.7,-58.97,56.7,56.7,B,Raw,F,Class 1A,,15
Erin Jones,Desoto,87.72,90.26,61.23,-63.5,-68.04,61.23,61.23,B,Raw,F,Class 1A,,16
Brittney Hasselbroek,Ft. White,88.31,90.26,56.7,58.97,61.23,61.23,61.23,B,Raw,F,Class 1A,,13
Tara Spires,Sante Fe,88.9,90.26,58.97,61.23,-63.5,61.23,61.23,B,Raw,F,Class 1A,,14
Adrienne Boynes,Cardinal Mooney,88.45,90.26,56.7,58.97,61.23,61.23,61.23,B,Raw,F,Class 1A,,12
Kaylee Wright,Keystone Heights,85.91,90.26,63.5,68.04,70.31,70.31,70.31,B,Raw,F,Class 1A,,11
Jayden Richard,Central,87.86,90.26,61.23,-63.5,-63.5,61.23,61.23,B,Raw,F,Class 1A,,17
Taylor Daniel #2,Umatilla,84.37,90.26,54.43,56.7,-58.97,56.7,56.7,B,Raw,F,Class 1A,,18
Mahailya Reeves,Union Co.,146.06,90.26+,129.27,138.35,142.88,142.88,,B,Raw,F,Class 1A,,DQ
Mary Wilhelm,Weeki Wachee,125.01,90.26+,86.18,90.72,-92.99,90.72,90.72,B,Raw,F,Class 1A,,1
Rae'Diah Lewis,Baker,114.03,90.26+,88.45,-90.72,90.72,90.72,90.72,B,Raw,F,Class 1A,,2
Marissa Mc Mckibben,Interlachen,111.13,90.26+,86.18,90.72,-92.99,90.72,90.72,B,Raw,F,Class 1A,,3
Jessica Traylor,Bradford,106.91,90.26+,77.11,81.65,-86.18,81.65,81.65,B,Raw,F,Class 1A,,4
Breanna Allen,Key West,114.53,90.26+,81.65,83.91,86.18,86.18,86.18,B,Raw,F,Class 1A,,5
Samantha Barber,Suwannee,127.64,90.26+,70.31,74.84,-79.38,74.84,74.84,B,Raw,F,Class 1A,,6
Miel Johnson,Eastside,120.56,90.26+,74.84,79.38,81.65,81.65,81.65,B,Raw,F,Class 1A,,8
Autumn Latrielle,Suwannee,116.03,90.26+,72.57,77.11,-81.65,77.11,77.11,B,Raw,F,Class 1A,,7
Mallie Tolley,Blountstown,100.38,90.26+,70.31,72.57,-74.84,72.57,72.57,B,Raw,F,Class 1A,,13
Abigail Stewart,Villages,94.48,90.26+,65.77,68.04,70.31,70.31,70.31,B,Raw,F,Class 1A,,12
Madison Salinas,Villages,95.12,90.26+,65.77,-68.04,68.04,68.04,68.04,B,Raw,F,Class 1A,,18
Ashleigh Silcox,Altha,108,90.26+,74.84,79.38,-81.65,79.38,79.38,B,Raw,F,Class 1A,,9
Nycole Parker,Bronson,162.34,90.26+,-68.04,77.11,79.38,79.38,79.38,B,Raw,F,Class 1A,,11
Kaylie Gasca,Baker,134.76,90.26+,74.84,79.38,-81.65,79.38,79.38,B,Raw,F,Class 1A,,10
Katrice Matthews,Andrew Jackson,130.95,90.26+,72.57,74.84,77.11,77.11,77.11,B,Raw,F,Class 1A,,14
Ashley Jones #4,Desoto,96.39,90.26+,63.5,65.77,68.04,68.04,68.04,B,Raw,F,Class 1A,,15
Tee'aunna Williams,Lemon Bay,96.57,90.26+,61.23,63.5,-65.77,63.5,63.5,B,Raw,F,Class 1A,,16
Desire Odom,Mount Dora,99.84,90.26+,58.97,61.23,65.77,65.77,65.77,B,Raw,F,Class 1A,,17
Emily Oliver,Arnold,44.36,45.81,61.23,63.5,-65.77,63.5,63.5,B,Raw,F,Class 2A,,1
Huyen Le,Charlotte,44.18,45.81,72.57,-77.11,-77.11,72.57,72.57,B,Raw,F,Class 2A,,3
Jillian Vinci,Winter Springs,44.09,45.81,56.7,58.97,-61.23,58.97,58.97,B,Raw,F,Class 2A,,2
Reed Nakia,Washington,44.27,45.81,52.16,-54.43,-56.7,52.16,52.16,B,Raw,F,Class 2A,,5
Ashley Cucchiara,River Ridge,44.86,45.81,54.43,-58.97,58.97,58.97,58.97,B,Raw,F,Class 2A,,4
Camille Penick,Gulf,44.45,45.81,45.36,47.63,-49.9,47.63,47.63,B,Raw,F,Class 2A,,6
Kiara Smith,Eustis,44,45.81,45.36,47.63,-49.9,47.63,47.63,B,Raw,F,Class 2A,,7
Kiara Hobbs,Lake Wales,44.63,45.81,49.9,52.16,-54.43,52.16,52.16,B,Raw,F,Class 2A,,8
Gianna Sheppard,Springstead,44.63,45.81,47.63,52.16,-54.43,52.16,52.16,B,Raw,F,Class 2A,,9
Savannah Dillahay,Bayshore,44.63,45.81,45.36,49.9,-52.16,49.9,49.9,B,Raw,F,Class 2A,,10
Isabella Paul,S199+ake,42.55,45.81,47.63,-49.9,-49.9,47.63,47.63,B,Raw,F,Class 2A,,11
Anna Fiore,Suncoast,43.23,45.81,45.36,-47.63,-47.63,45.36,45.36,B,Raw,F,Class 2A,,12
Kaila Corbridge,Pace,43.23,45.81,38.56,40.82,43.09,43.09,43.09,B,Raw,F,Class 2A,,16
Ella Mclaughlin,Archbishop McCarthy,44.91,45.81,43.09,47.63,-49.9,47.63,47.63,B,Raw,F,Class 2A,,14
Jordan Thomas #6,Archbishop McCarthy,44.68,45.81,43.09,-47.63,-47.63,43.09,43.09,B,Raw,F,Class 2A,,13
Autumn Carter,Milton,44,45.81,45.36,47.63,49.9,49.9,,B,Raw,F,Class 2A,,DQ
Morgan Greer,Clay,44.04,45.81,38.56,40.82,43.09,43.09,43.09,B,Raw,F,Class 2A,,17
Ashley Ciminieri,Milton,45.63,45.81,40.82,-49.9,52.16,52.16,52.16,B,Raw,F,Class 2A,,15
Carolina O'Hara,Jensen Beach,44.63,45.81,38.56,40.82,43.09,43.09,43.09,B,Raw,F,Class 2A,,18
Anjli Deven,Lecanto,42.55,45.81,38.56,40.82,43.09,43.09,43.09,B,Raw,F,Class 2A,,19
Hannah Collett,Belleview,48.4,49.9,61.23,65.77,-68.04,65.77,65.77,B,Raw,F,Class 2A,,1
Daelani Williamson,Mosley,48.94,49.9,61.23,63.5,65.77,65.77,65.77,B,Raw,F,Class 2A,,2
Samantha Migliore,Clay,48.13,49.9,56.7,61.23,63.5,63.5,63.5,B,Raw,F,Class 2A,,3
Gabriella Schwarz,S199+ake,46.95,49.9,58.97,-63.5,63.5,63.5,63.5,B,Raw,F,Class 2A,,4
Angelina Marquez,Port Charlotte,47.26,49.9,49.9,54.43,56.7,56.7,56.7,B,Raw,F,Class 2A,,8
Elizabeth Sanchez #2,Fort Myers,48.22,49.9,56.7,61.23,-63.5,61.23,61.23,B,Raw,F,Class 2A,,5
Kyra Battles,Lake Wales,48.9,49.9,58.97,-61.23,61.23,61.23,61.23,B,Raw,F,Class 2A,,6
Nylla Wilder,Sebring,48.04,49.9,58.97,61.23,-63.5,61.23,61.23,B,Raw,F,Class 2A,,9
Jameka Jones,Baker County,48.58,49.9,52.16,56.7,58.97,58.97,58.97,B,Raw,F,Class 2A,,7
Ava Bautista,Pace,48.9,49.9,54.43,58.97,-61.23,58.97,58.97,B,Raw,F,Class 2A,,11
Jasey Neitzke,Arnold,48.49,49.9,52.16,-54.43,54.43,54.43,54.43,B,Raw,F,Class 2A,,10
Arianna Durrum,Springstead,47.54,49.9,52.16,56.7,58.97,58.97,58.97,B,Raw,F,Class 2A,,19
Lilly Priddy,Milton,49.08,49.9,56.7,-61.23,-61.23,56.7,,B,Raw,F,Class 2A,,DQ
Faith Parton-Reynolds,Gulf Breeze,49.08,49.9,52.16,54.43,56.7,56.7,56.7,B,Raw,F,Class 2A,,12
Alyssa Mero,Pasco,47.49,49.9,-52.16,52.16,-54.43,52.16,52.16,B,Raw,F,Class 2A,,14
Emma Banks,Auburndale,47.76,49.9,43.09,47.63,49.9,49.9,49.9,B,Raw,F,Class 2A,,15
Bliss Weiler,South Fork,48.17,49.9,45.36,47.63,-49.9,47.63,47.63,B,Raw,F,Class 2A,,17
Tristan Rooney,S199+ake,48.76,49.9,47.63,49.9,54.43,54.43,54.43,B,Raw,F,Class 2A,,13
Karli Dosio,Jensen Beach,48.04,49.9,45.36,47.63,-49.9,47.63,47.63,B,Raw,F,Class 2A,,16
Jade Fisher,Southeast,48.26,49.9,38.56,43.09,45.36,45.36,45.36,B,Raw,F,Class 2A,,18
Emily Hart,Auburndale,51.57,53.98,63.5,68.04,-70.31,68.04,68.04,B,Raw,F,Class 2A,,1
Kendal Haff,Nature Coast,51.48,53.98,-65.77,68.04,-70.31,68.04,68.04,B,Raw,F,Class 2A,,2
Raegan Wilks,Milton,52.57,53.98,63.5,68.04,70.31,70.31,70.31,B,Raw,F,Class 2A,,3
Dana Quiroz,Archbishop McCarthy,53.12,53.98,61.23,-65.77,-65.77,61.23,61.23,B,Raw,F,Class 2A,,4
Emma Webb,Gulf,52.66,53.98,63.5,-68.04,-68.04,63.5,63.5,B,Raw,F,Class 2A,,5
Andie Tice,Matanzas,52.98,53.98,54.43,58.97,-61.23,58.97,58.97,B,Raw,F,Class 2A,,9
Emma Huaman,Winter Springs,53.48,53.98,54.43,56.7,58.97,58.97,58.97,B,Raw,F,Class 2A,,11
Jewel Marino,Arnold,52.66,53.98,54.43,56.7,58.97,58.97,58.97,B,Raw,F,Class 2A,,7
Riley Ledford,Clay,52.75,53.98,54.43,-58.97,58.97,58.97,58.97,B,Raw,F,Class 2A,,8
Marissa Schuler,Charlotte,52.71,53.98,63.5,-65.77,-65.77,63.5,63.5,B,Raw,F,Class 2A,,6
Caroline Barwick,Wakulla,53.61,53.98,52.16,54.43,-56.7,54.43,54.43,B,Raw,F,Class 2A,,13
Laurynn Lackey,Leesburg,52.07,53.98,47.63,52.16,54.43,54.43,54.43,B,Raw,F,Class 2A,,17
Acheline Delhomme,Hardee,52.44,53.98,56.7,58.97,-61.23,58.97,58.97,B,Raw,F,Class 2A,,12
Dallas Bonis,Bayshore,53.48,53.98,47.63,52.16,-54.43,52.16,52.16,B,Raw,F,Class 2A,,14
Isabelle Santos,Fort Walton Beach,52.62,53.98,52.16,-56.7,-56.7,52.16,52.16,B,Raw,F,Class 2A,,16
Goldstein Jada,South Fork,53.07,53.98,45.36,-49.9,52.16,52.16,52.16,B,Raw,F,Class 2A,,10
Cassidy Ross,Eustis,52.75,53.98,49.9,52.16,-54.43,52.16,52.16,B,Raw,F,Class 2A,,15
Sana Habib,Arnold,57.92,58.51,83.91,88.45,-92.99,88.45,88.45,B,Raw,F,Class 2A,,1
Samantha Sineath,Port Charlotte,58.2,58.51,72.57,74.84,77.11,77.11,77.11,B,Raw,F,Class 2A,,2
Allison Wilson #1,Lecanto,56.15,58.51,65.77,70.31,72.57,72.57,72.57,B,Raw,F,Class 2A,,3
Madison Gosselin,Lake Wales,57.88,58.51,70.31,72.57,-74.84,72.57,72.57,B,Raw,F,Class 2A,,4
Kennedy Weissman,Nature Coast,56.65,58.51,63.5,-68.04,-68.04,63.5,,B,Raw,F,Class 2A,,DQ
Gianna Creola,Charlotte,56.38,58.51,65.77,-70.31,70.31,70.31,70.31,B,Raw,F,Class 2A,,5
Alexis Gamez,Leesburg,58.01,58.51,61.23,63.5,-65.77,63.5,63.5,B,Raw,F,Class 2A,,7
Lindsay Corazzini,Winter Springs,58.01,58.51,63.5,65.77,68.04,68.04,68.04,B,Raw,F,Class 2A,,6
Marissa Upshaw,Mosley,57.88,58.51,63.5,68.04,-70.31,68.04,68.04,B,Raw,F,Class 2A,,8
Leslie Catlett,Middleburg,58.38,58.51,58.97,63.5,-65.77,63.5,63.5,B,Raw,F,Class 2A,,11
Naomi Francisco,Suncoast,56.84,58.51,56.7,-61.23,-61.23,56.7,,B,Raw,F,Class 2A,,DQ
Elise Corley,Winter Springs,57.06,58.51,58.97,61.23,-63.5,61.23,61.23,B,Raw,F,Class 2A,,18
Lauren Harkins,Jensen Beach,56.88,58.51,65.77,68.04,-70.31,68.04,68.04,B,Raw,F,Class 2A,,10
Karsyn Crews,Baker County,56.56,58.51,49.9,54.43,56.7,56.7,56.7,B,Raw,F,Class 2A,,9
Lauren Vo,Zephyrhills,56.88,58.51,54.43,58.97,-61.23,58.97,58.97,B,Raw,F,Class 2A,,15
Gianna Spadafino,Archbishop McCarthy,57.88,58.51,56.7,-61.23,-61.23,56.7,56.7,B,Raw,F,Class 2A,,13
Jillian Marzicola,River Ridge,56.74,58.51,58.97,61.23,-63.5,61.23,61.23,B,Raw,F,Class 2A,,12
Lindsey Davis,Wakulla,54.66,58.51,54.43,61.23,63.5,63.5,63.5,B,Raw,F,Class 2A,,14
Marina Mckean,Clay,58.11,58.51,52.16,54.43,56.7,56.7,56.7,B,Raw,F,Class 2A,,17
Carly Webb,Sebring,57.88,58.51,56.7,58.97,-61.23,58.97,58.97,B,Raw,F,Class 2A,,16
Madison Upshaw,Mosley,62.6,63.05,68.04,72.57,-74.84,72.57,72.57,B,Raw,F,Class 2A,,1
Adriana Rosa,Harmony,60.33,63.05,61.23,65.77,-68.04,65.77,65.77,B,Raw,F,Class 2A,,3
Alexa Estevez,Port Charlotte,59.74,63.05,70.31,72.57,-74.84,72.57,72.57,B,Raw,F,Class 2A,,2
Kennedi Blevins,Citrus,60.78,63.05,83.91,88.45,,88.45,,B,Raw,F,Class 2A,,DQ
Ella Adams,Fort Walton Beach,61.23,63.05,61.23,-63.5,-63.5,61.23,61.23,B,Raw,F,Class 2A,,9
Taylor Ruth,New Smyrna Beach,62.55,63.05,65.77,68.04,-70.31,68.04,68.04,B,Raw,F,Class 2A,,6
Makiyah Nickerson,S199+ake,60.92,63.05,58.97,61.23,63.5,63.5,63.5,B,Raw,F,Class 2A,,4
Malea Rolle,South Fork,62.41,63.05,58.97,-61.23,-61.23,58.97,58.97,B,Raw,F,Class 2A,,10
Meg O'connor,Washington,60.92,63.05,58.97,-63.5,-63.5,58.97,58.97,B,Raw,F,Class 2A,,5
Ronny Lashley,Arnold,61.55,63.05,68.04,-72.57,-72.57,68.04,68.04,B,Raw,F,Class 2A,,12
Jesse Meyer,Leesburg,60.15,63.05,61.23,63.5,65.77,65.77,65.77,B,Raw,F,Class 2A,,7
Mykayla Dossett,Fivay,62.32,63.05,63.5,65.77,68.04,68.04,68.04,B,Raw,F,Class 2A,,17
Lauren Askeland,Jensen Beach,61.14,63.05,61.23,63.5,-65.77,63.5,63.5,B,Raw,F,Class 2A,,8
Bailey Kumm,Clay,60.74,63.05,54.43,58.97,-61.23,58.97,,B,Raw,F,Class 2A,,DQ
Alyssa Cone,Middleburg,61.33,63.05,56.7,61.23,-63.5,61.23,61.23,B,Raw,F,Class 2A,,11
Alexandria Green,Winter Springs,60.6,63.05,58.97,61.23,63.5,63.5,63.5,B,Raw,F,Class 2A,,15
Reagan Bastemeyer,Pace,62.28,63.05,49.9,52.16,54.43,54.43,54.43,B,Raw,F,Class 2A,,16
Tania Estrada,S199+ake,61.46,63.05,56.7,-58.97,-58.97,56.7,56.7,B,Raw,F,Class 2A,,13
Abbee McCluer,Charlotte,59.01,63.05,58.97,61.23,-63.5,61.23,61.23,B,Raw,F,Class 2A,,14
Amerie Daniels,Arnold,69.26,69.85,77.11,-79.38,-79.38,77.11,77.11,B,Raw,F,Class 2A,,1
Cristina Sweet,Edgewater,68.49,69.85,-77.11,77.11,-79.38,77.11,77.11,B,Raw,F,Class 2A,,3
Janiyah Stevens,Clay,65.14,69.85,65.77,70.31,72.57,72.57,72.57,B,Raw,F,Class 2A,,5
Rebecca Tatun,Citrus,66,69.85,65.77,70.31,72.57,72.57,72.57,B,Raw,F,Class 2A,,6
Angelia Figueroa,Fivay,69.44,69.85,81.65,86.18,-90.72,86.18,86.18,B,Raw,F,Class 2A,,2
Deborah Lee,Gainesville,68.63,69.85,77.11,83.91,88.45,88.45,88.45,B,Raw,F,Class 2A,,4
Isabella Andujar,Eustis,68.54,69.85,68.04,-70.31,-70.31,68.04,68.04,B,Raw,F,Class 2A,,9
Brooke Buchheit,Fort Myers,66.95,69.85,-65.77,-65.77,-65.77,-65.77,,B,Raw,F,Class 2A,,DQ
Kharisma Littles,Pine Ridge,67.36,69.85,72.57,74.84,-77.11,74.84,74.84,B,Raw,F,Class 2A,,7
Jornice Vales,Lake Minneola,68.13,69.85,72.57,74.84,77.11,77.11,77.11,B,Raw,F,Class 2A,,8
Laila Little,Choctaw,68.08,69.85,68.04,72.57,-74.84,72.57,72.57,B,Raw,F,Class 2A,,11
Danielle Garrison,Lake Wales,67,69.85,65.77,68.04,-70.31,68.04,68.04,B,Raw,F,Class 2A,,16
Carolina Crim,S199+ake,69.81,69.85,65.77,68.04,70.31,70.31,70.31,B,Raw,F,Class 2A,,10
Olivia Warrington,St. Augustine,68.22,69.85,68.04,72.57,-77.11,72.57,72.57,B,Raw,F,Class 2A,,13
Angelina Belanger,Suncoast,65.5,69.85,54.43,56.7,58.97,58.97,58.97,B,Raw,F,Class 2A,,12
Malorie Pippins,Baker County,64.5,69.85,54.43,58.97,61.23,61.23,61.23,B,Raw,F,Class 2A,,15
Leslie Martinez,New Smyrna Beach,69.4,69.85,-65.77,-70.31,-72.57,-65.77,,B,Raw,F,Class 2A,,DQ
Isabelle Mitchell,Washington,68.95,69.85,61.23,63.5,-68.04,63.5,63.5,B,Raw,F,Class 2A,,14
Faith Garza,Lake Wales,72.08,76.66,88.45,90.72,92.99,92.99,92.99,B,Raw,F,Class 2A,,2
Daisha Jarvis,New Smyrna Beach,75.89,76.66,74.84,79.38,81.65,81.65,81.65,B,Raw,F,Class 2A,,1
Madison Gomrad,Winter Springs,73.53,76.66,74.84,79.38,-81.65,79.38,79.38,B,Raw,F,Class 2A,,3
Adrianna Sandoval,Fort Myers,75.84,76.66,72.57,77.11,79.38,79.38,79.38,B,Raw,F,Class 2A,,7
U'nitee Brown,Winter Springs,70.94,76.66,72.57,77.11,-81.65,77.11,77.11,B,Raw,F,Class 2A,,6
Daniella Vance,S199+ake,75.89,76.66,68.04,70.31,-72.57,70.31,70.31,B,Raw,F,Class 2A,,4
Graceanne Hoback,S199+ake,70.4,76.66,70.31,72.57,74.84,74.84,74.84,B,Raw,F,Class 2A,,5
Kayden Arliss,Lake Wales,70.13,76.66,65.77,68.04,-70.31,68.04,68.04,B,Raw,F,Class 2A,,8
Hannah Cardon,Mosley,75.02,76.66,68.04,70.31,-72.57,70.31,70.31,B,Raw,F,Class 2A,,10
Da'niya Lewis,Columbia,73.53,76.66,77.11,-79.38,-81.65,77.11,77.11,B,Raw,F,Class 2A,,9
Olivia Wilson #3,New Smyrna Beach,74.53,76.66,65.77,70.31,72.57,72.57,72.57,B,Raw,F,Class 2A,,11
Kayla Vasquez,Charlotte,75.16,76.66,-63.5,-63.5,63.5,63.5,63.5,B,Raw,F,Class 2A,,20
Gianna Torres,Clay,75.75,76.66,63.5,68.04,70.31,70.31,70.31,B,Raw,F,Class 2A,,14
Mia Muth,Sebastian River,74.12,76.66,68.04,-70.31,-70.31,68.04,68.04,B,Raw,F,Class 2A,,15
Lucie Dudley,Matanzas,72.26,76.66,61.23,63.5,-65.77,63.5,63.5,B,Raw,F,Class 2A,,16
Sydney Watson,Milton,74.75,76.66,-63.5,63.5,68.04,68.04,68.04,B,Raw,F,Class 2A,,13
Raegan Jones,Milton,71.35,76.66,61.23,63.5,68.04,68.04,68.04,B,Raw,F,Class 2A,,12
Madison Middleton,Arnold,72.85,76.66,52.16,54.43,-58.97,54.43,54.43,B,Raw,F,Class 2A,,19
Haley Beardin,Ridgeview,76.29,76.66,58.97,61.23,63.5,63.5,63.5,B,Raw,F,Class 2A,,18
Ava Haber,Ridgeview,75.66,76.66,61.23,65.77,-68.04,65.77,65.77,B,Raw,F,Class 2A,,17
Tara Yount,Port Charlotte,82.33,83.01,83.91,88.45,90.72,90.72,90.72,B,Raw,F,Class 2A,,1
Reece Chasteen,Columbia,78.02,83.01,-92.99,92.99,-95.25,92.99,92.99,B,Raw,F,Class 2A,,2
Chantal Ferrer,Cape Coral,80.1,83.01,70.31,74.84,79.38,79.38,79.38,B,Raw,F,Class 2A,,3
Faith Garrison,Leesburg,81.74,83.01,68.04,72.57,77.11,77.11,77.11,B,Raw,F,Class 2A,,4
Jenna Babinski,River Ridge,80.92,83.01,63.5,-68.04,68.04,68.04,68.04,B,Raw,F,Class 2A,,7
Jada Carter,Charlotte,80.51,83.01,70.31,72.57,-74.84,72.57,72.57,B,Raw,F,Class 2A,,8
Chatelle Jordan,Archbishop McCarthy,82.15,83.01,65.77,70.31,-72.57,70.31,70.31,B,Raw,F,Class 2A,,5
Megan Henry,Lincoln,80.69,83.01,70.31,74.84,-77.11,74.84,74.84,B,Raw,F,Class 2A,,10
Naiya Sawtelle,Jensen Beach,81.83,83.01,61.23,63.5,-65.77,63.5,,B,Raw,F,Class 2A,,DQ
Autumn Spoon,Zephyrhills,80.06,83.01,77.11,-79.38,79.38,79.38,79.38,B,Raw,F,Class 2A,,6
Jacqualyn Yorrick,South Fort Myers,79.33,83.01,77.11,79.38,81.65,81.65,81.65,B,Raw,F,Class 2A,,9
Annalee Harbison,Clay,81.42,83.01,65.77,70.31,-72.57,70.31,70.31,B,Raw,F,Class 2A,,16
Temia Hardeman,Ribault,80.1,83.01,61.23,65.77,-70.31,65.77,,B,Raw,F,Class 2A,,DQ
Jewel Taylor,Middleburg,82.74,83.01,65.77,70.31,-72.57,70.31,70.31,B,Raw,F,Class 2A,,11
Kaylin Brown,Milton,81.74,83.01,65.77,-70.31,-70.31,65.77,65.77,B,Raw,F,Class 2A,,12
Tyleah Ponder,Vanguard,80.78,83.01,52.16,54.43,-56.7,54.43,54.43,B,Raw,F,Class 2A,,14
Liang Lee Martinez,Lake Minneola,78.65,83.01,-56.7,-56.7,-56.7,-56.7,,B,Raw,F,Class 2A,,DQ
London Francis,Ridgeview,82.37,83.01,52.16,56.7,-58.97,56.7,56.7,B,Raw,F,Class 2A,,13
Amelia Klaas,Lake Weir,82.24,83.01,56.7,61.23,-63.5,61.23,61.23,B,Raw,F,Class 2A,,15
Daphnie Toussaint,Charlotte,89.72,90.26,81.65,83.91,86.18,86.18,86.18,B,Raw,F,Class 2A,,1
Isabella Fortin,New Smyrna Beach,88.77,90.26,77.11,81.65,-83.91,81.65,81.65,B,Raw,F,Class 2A,,2
Macie Love-Gabutin,Choctaw,86.86,90.26,68.04,72.57,-74.84,72.57,72.57,B,Raw,F,Class 2A,,3
De'Asia Abrams,Auburndale,87.45,90.26,81.65,-86.18,-86.18,81.65,,B,Raw,F,Class 2A,,DQ
Mikayla Williams,Eustis,86.59,90.26,74.84,-77.11,79.38,79.38,79.38,B,Raw,F,Class 2A,,5
Kassidy Gaw,Port Charlotte,87.63,90.26,70.31,72.57,74.84,74.84,74.84,B,Raw,F,Class 2A,,4
Alexi McCaffrey,River Ridge,89.99,90.26,63.5,-68.04,68.04,68.04,68.04,B,Raw,F,Class 2A,,8
Sydney Brown,Ed White,87.45,90.26,70.31,74.84,-77.11,74.84,74.84,B,Raw,F,Class 2A,,11
Briana Boggs,Gainesville,89.13,90.26,54.43,61.23,-63.5,61.23,61.23,B,Raw,F,Class 2A,,7
Madison Misleh,Pace,84.5,90.26,65.77,70.31,74.84,74.84,74.84,B,Raw,F,Class 2A,,9
Hailey Burns,Auburndale,88.09,90.26,68.04,70.31,72.57,72.57,72.57,B,Raw,F,Class 2A,,6
Morgan Fortney,River Ridge,87.82,90.26,54.43,58.97,-63.5,58.97,58.97,B,Raw,F,Class 2A,,18
Kenyatta Hogan,Ridgeview,86.55,90.26,70.31,-74.84,-74.84,70.31,70.31,B,Raw,F,Class 2A,,15
Ashley Jungbauer,S199+ake,90.13,90.26,65.77,68.04,70.31,70.31,70.31,B,Raw,F,Class 2A,,12
Kendal Susi,Mosley,87.68,90.26,65.77,68.04,72.57,72.57,72.57,B,Raw,F,Class 2A,,10
Kennedi Tindall,Leesburg,86.45,90.26,56.7,58.97,-61.23,58.97,58.97,B,Raw,F,Class 2A,,14
Reanna Wilson,Gulf,84.05,90.26,61.23,-65.77,-65.77,61.23,61.23,B,Raw,F,Class 2A,,17
Maggie Moss,Lincoln,90.08,90.26,58.97,61.23,65.77,65.77,65.77,B,Raw,F,Class 2A,,16
Samantha Hemphill,Port Charlotte,83.96,90.26,63.5,68.04,72.57,72.57,72.57,B,Raw,F,Class 2A,,13
Larkin Dees,Mosley,123.1,90.26+,113.4,117.93,-122.47,117.93,117.93,B,Raw,F,Class 2A,,1
Shontell Moore,Choctaw,187.06,90.26+,111.13,115.67,-120.2,115.67,115.67,B,Raw,F,Class 2A,,2
Zamoneey Lamar,Leesburg,131.68,90.26+,77.11,81.65,83.91,83.91,83.91,B,Raw,F,Class 2A,,10
Kyleigh LaFary,Clay,128.82,90.26+,83.91,88.45,92.99,92.99,92.99,B,Raw,F,Class 2A,,3
Trachelle Williams,Columbia,127.23,90.26+,79.38,81.65,83.91,83.91,83.91,B,Raw,F,Class 2A,,7
Juliana Garcia,S199+ake,110.54,90.26+,81.65,86.18,90.72,90.72,90.72,B,Raw,F,Class 2A,,4
Diamond Cowart,Zephyrhills,121.52,90.26+,79.38,83.91,88.45,88.45,88.45,B,Raw,F,Class 2A,,5
Kelly Hall,Seabreeze,107.77,90.26+,81.65,83.91,-88.45,83.91,83.91,B,Raw,F,Class 2A,,11
Robyn Rhem,Vanguard,140.84,90.26+,77.11,81.65,86.18,86.18,86.18,B,Raw,F,Class 2A,,8
Emily Georgiades,Middleburg,96.16,90.26+,74.84,79.38,83.91,83.91,83.91,B,Raw,F,Class 2A,,12
Princess Jean Francois,East Lee,117.75,90.26+,88.45,90.72,97.52,97.52,97.52,B,Raw,F,Class 2A,,9
Brooklyn Baxter,Stanton,107.32,90.26+,77.11,81.65,-86.18,81.65,,B,Raw,F,Class 2A,,DQ
Paige Anderson,Arnold,131.18,90.26+,77.11,81.65,-83.91,81.65,81.65,B,Raw,F,Class 2A,,6
Kendra Davis,Baker County,104.78,90.26+,74.84,79.38,83.91,83.91,83.91,B,Raw,F,Class 2A,,13
Trinity Scott,Tavares,102.78,90.26+,83.91,86.18,-88.45,86.18,86.18,B,Raw,F,Class 2A,,15
Taniya Fisher,Port Charlotte,92.4,90.26+,68.04,72.57,77.11,77.11,77.11,B,Raw,F,Class 2A,,14
Aleah Mitchell,Sebastian River,129.46,90.26+,70.31,72.57,74.84,74.84,74.84,B,Raw,F,Class 2A,,16
Deidre Jones,Pine Ridge,107.32,90.26+,72.57,74.84,-77.11,74.84,74.84,B,Raw,F,Class 2A,,18
Alexis Puga,Port Charlotte,95.44,90.26+,68.04,72.57,-77.11,72.57,72.57,B,Raw,F,Class 2A,,17
Nimscha Massolas,East Lee,114.99,90.26+,68.04,-70.31,-70.31,68.04,,B,Raw,F,Class 2A,,DQ
Jelina Bly,Navarre,45.45,45.81,68.04,72.57,-77.11,72.57,72.57,B,Raw,F,Class 3A,,1
Alyssa Depalo,Vero Beach,45.72,45.81,63.5,-65.77,-68.04,63.5,63.5,B,Raw,F,Class 3A,,2
Kari Brewton,Navarre,45.45,45.81,56.7,61.23,63.5,63.5,63.5,B,Raw,F,Class 3A,,3
Sofia Cianfarra,Spruce Creek,44.72,45.81,-61.23,61.23,-65.77,61.23,61.23,B,Raw,F,Class 3A,,4
Amarise Rodriguez,University,44.54,45.81,54.43,58.97,-61.23,58.97,58.97,B,Raw,F,Class 3A,,6
Karla Hormazadol,Colonial,45.36,45.81,45.36,47.63,49.9,49.9,49.9,B,Raw,F,Class 3A,,5
Gabriela Serpa,Dr Phillips,43.86,45.81,49.9,52.16,-54.43,52.16,52.16,B,Raw,F,Class 3A,,9
Megan Carlson,Hagerty,43.36,45.81,47.63,49.9,-52.16,49.9,49.9,B,Raw,F,Class 3A,,8
Maya Indio,St Cloud,44.81,45.81,49.9,54.43,56.7,56.7,56.7,B,Raw,F,Class 3A,,7
Mia Hernandez,Wellington,43,45.81,45.36,-47.63,47.63,47.63,47.63,B,Raw,F,Class 3A,,11
Carley Fay,Dr Phillips,45.04,45.81,49.9,52.16,-54.43,52.16,52.16,B,Raw,F,Class 3A,,10
Kayla Connelly,Lake Howell,41.69,45.81,43.09,45.36,-47.63,45.36,45.36,B,Raw,F,Class 3A,,20
Sofia Dolmanet,Venice,40.91,45.81,54.43,56.7,-58.97,56.7,56.7,B,Raw,F,Class 3A,,13
Nosharal Harris,Windermere,45.77,45.81,43.09,45.36,47.63,47.63,47.63,B,Raw,F,Class 3A,,12
Alessandra Diaz,Celebration,45.36,45.81,40.82,43.09,-45.36,43.09,43.09,B,Raw,F,Class 3A,,14
Lyndea Parker,North Port,44.54,45.81,29.48,34.02,36.29,36.29,36.29,B,Raw,F,Class 3A,,19
Karma French,Vero Beach,45.63,45.81,38.56,40.82,43.09,43.09,43.09,B,Raw,F,Class 3A,,15
Juliana Herrera,Treasure Coast,44.95,45.81,34.02,36.29,38.56,38.56,38.56,B,Raw,F,Class 3A,,17
Haley Earnest,Bartram,41.46,45.81,34.02,38.56,40.82,40.82,40.82,B,Raw,F,Class 3A,,18
Isabella Gutowski,Treasure Coast,43.86,45.81,34.02,36.29,38.56,38.56,38.56,B,Raw,F,Class 3A,,16
Tamira Briley,Oakleaf,49.44,49.9,72.57,77.11,79.38,79.38,79.38,B,Raw,F,Class 3A,,1
Sarah Eiswerth,Vero Beach,49.44,49.9,61.23,63.5,-65.77,63.5,63.5,B,Raw,F,Class 3A,,2
Madi Muse,Crestview,48.63,49.9,45.36,47.63,49.9,49.9,49.9,B,Raw,F,Class 3A,,3
Aryannah Rosa,Flagler,47.54,49.9,49.9,54.43,-56.7,54.43,54.43,B,Raw,F,Class 3A,,5
Emma Ducharme,Hagerty,48.26,49.9,47.63,49.9,52.16,52.16,52.16,B,Raw,F,Class 3A,,6
Kaitlyn Gallagher,St Cloud,48.44,49.9,49.9,52.16,54.43,54.43,54.43,B,Raw,F,Class 3A,,4
Alexandria Black,Wiregrass,49.17,49.9,49.9,52.16,54.43,54.43,54.43,B,Raw,F,Class 3A,,10
Sandra Bocico,Evans,49.9,49.9,49.9,52.16,-54.43,52.16,52.16,B,Raw,F,Class 3A,,7
Faith West,Nease,48.35,49.9,54.43,56.7,-58.97,56.7,56.7,B,Raw,F,Class 3A,,11
Nicole Russi,East Ridge,48.49,49.9,54.43,58.97,61.23,61.23,61.23,B,Raw,F,Class 3A,,8
Autumn West,Nease,47.9,49.9,52.16,54.43,56.7,56.7,56.7,B,Raw,F,Class 3A,,9
Ashley Aun,St Cloud,48.35,49.9,45.36,49.9,52.16,52.16,52.16,B,Raw,F,Class 3A,,20
Beyanka Cherenfant,Evans,47.81,49.9,-54.43,-54.43,54.43,54.43,54.43,B,Raw,F,Class 3A,,12
Destiny David,University,48.81,49.9,54.43,56.7,-58.97,56.7,56.7,B,Raw,F,Class 3A,,13
Lyzza Zuniga,Hagerty,46.9,49.9,40.82,45.36,-47.63,45.36,45.36,B,Raw,F,Class 3A,,14
Helaina Thompson,Vero Beach,48.53,49.9,43.09,45.36,47.63,47.63,47.63,B,Raw,F,Class 3A,,15
Kaylie Beaulieu,Northport,48.9,49.9,43.09,47.63,49.9,49.9,49.9,B,Raw,F,Class 3A,,16
Sophia Gonzalez,Winter Park,49.26,49.9,45.36,47.63,-49.9,47.63,47.63,B,Raw,F,Class 3A,,17
Tori Cunningham,Lakeland,49.35,49.9,40.82,43.09,-47.63,43.09,43.09,B,Raw,F,Class 3A,,18
Lauren Mcmahon,Venice,48.63,49.9,43.09,45.36,-47.63,45.36,45.36,B,Raw,F,Class 3A,,19
Tyller Bauer,Bartram,51.8,53.98,65.77,68.04,70.31,70.31,70.31,B,Raw,F,Class 3A,,1
Callie Goolgasian,Dwyer,53.98,53.98,58.97,61.23,63.5,63.5,63.5,B,Raw,F,Class 3A,,3
Darla Joyner,Niceville,52.8,53.98,63.5,68.04,-70.31,68.04,68.04,B,Raw,F,Class 3A,,2
Elle Fields,Wellington,52.53,53.98,56.7,61.23,63.5,63.5,63.5,B,Raw,F,Class 3A,,4
Katarina Wilburn,North Port,50.89,53.98,63.5,68.04,-70.31,68.04,68.04,B,Raw,F,Class 3A,,5
Grace Fay,Dr Phillips,52.53,53.98,65.77,68.04,-70.31,68.04,68.04,B,Raw,F,Class 3A,,8
Bella Martin,Navarre,52.89,53.98,58.97,63.5,65.77,65.77,65.77,B,Raw,F,Class 3A,,6
Helena Huyke,Celebration,53.71,53.98,54.43,58.97,-61.23,58.97,58.97,B,Raw,F,Class 3A,,7
Kaylee Sunderlin,Wellington,51.62,53.98,54.43,56.7,-58.97,56.7,56.7,B,Raw,F,Class 3A,,9
Morgan Carroll,Vero Beach,53.07,53.98,58.97,63.5,-65.77,63.5,63.5,B,Raw,F,Class 3A,,12
Naika Belizarie,Dr Phillips,53.43,53.98,58.97,61.23,63.5,63.5,63.5,B,Raw,F,Class 3A,,10
Nora Ejie,Spruce Creek,52.44,53.98,52.16,54.43,-56.7,54.43,54.43,B,Raw,F,Class 3A,,19
Kendall Aldridge,Martin County,53.71,53.98,52.16,-54.43,54.43,54.43,54.43,B,Raw,F,Class 3A,,13
Chassity Llanos,Lake Tohopekaliga,51.26,53.98,49.9,54.43,-58.97,54.43,54.43,B,Raw,F,Class 3A,,15
Leah Perez,Vero Beach,52.98,53.98,49.9,52.16,-54.43,52.16,52.16,B,Raw,F,Class 3A,,14
Leah Elliot,Navarre,51.71,53.98,56.7,61.23,-63.5,61.23,61.23,B,Raw,F,Class 3A,,11
Glorianna Echevarria,East Ridge,51.57,53.98,49.9,-52.16,-52.16,49.9,49.9,B,Raw,F,Class 3A,,18
Jess Henkel,St Cloud,52.8,53.98,47.63,49.9,52.16,52.16,52.16,B,Raw,F,Class 3A,,16
Aaliyah Castro,Winter Park,53.52,53.98,-47.63,-47.63,-49.9,-47.63,,B,Raw,F,Class 3A,,DQ
Haley Lowry,St Cloud,53.25,53.98,45.36,47.63,49.9,49.9,49.9,B,Raw,F,Class 3A,,17
Olivia Lipari,Hagerty,57.2,58.51,70.31,-72.57,-72.57,70.31,70.31,B,Raw,F,Class 3A,,2
Hannah Yilmaz-Rodriguez,Lake Tohopekaliga,55.57,58.51,68.04,-72.57,-72.57,68.04,68.04,B,Raw,F,Class 3A,,3
Kaylee Coughlin,Bartram,58.42,58.51,68.04,70.31,72.57,72.57,72.57,B,Raw,F,Class 3A,,1
Genevieve Frangoulis,Spruce Creek,56.47,58.51,61.23,63.5,-65.77,63.5,63.5,B,Raw,F,Class 3A,,5
Kylie Flaherty-Cohn,Venice,58.01,58.51,-70.31,70.31,72.57,72.57,72.57,B,Raw,F,Class 3A,,4
Alexa Mandujano,Lake Mary,56.2,58.51,58.97,61.23,63.5,63.5,63.5,B,Raw,F,Class 3A,,7
Aleena Ponto,Niceville,54.39,58.51,49.9,54.43,56.7,56.7,56.7,B,Raw,F,Class 3A,,6
Kelsey Gocking,Flagler,57.24,58.51,58.97,61.23,-63.5,61.23,61.23,B,Raw,F,Class 3A,,9
Kalani Wolfgramm,Oak Ridge,54.61,58.51,54.43,56.7,-58.97,56.7,,B,Raw,F,Class 3A,,DQ
Emalee West,North Port,54.48,58.51,56.7,58.97,-61.23,58.97,58.97,B,Raw,F,Class 3A,,8
Chloe Roubique,Navarre,57.42,58.51,54.43,56.7,58.97,58.97,58.97,B,Raw,F,Class 3A,,10
Ellie Bronson,Oakleaf,57.65,58.51,54.43,58.97,-61.23,58.97,58.97,B,Raw,F,Class 3A,,18
Renijah Howard,Dr Phillips,58.51,58.51,54.43,56.7,-58.97,56.7,56.7,B,Raw,F,Class 3A,,13
Julianna Courville,Venice,57.11,58.51,56.7,-58.97,-58.97,56.7,56.7,B,Raw,F,Class 3A,,15
Javani Roberson,St Cloud,57.02,58.51,58.97,61.23,63.5,63.5,63.5,B,Raw,F,Class 3A,,11
Olivia Zammitt,Boca Raton,57.52,58.51,-52.16,52.16,54.43,54.43,54.43,B,Raw,F,Class 3A,,16
Nyla Roberson,St Cloud,57.56,58.51,54.43,56.7,-58.97,56.7,56.7,B,Raw,F,Class 3A,,12
Alondra Navarro,Lake Tohopekaliga,56.29,58.51,49.9,-52.16,-54.43,49.9,49.9,B,Raw,F,Class 3A,,14
Kyndal Green,Haines City,57.47,58.51,-56.7,-56.7,-56.7,-56.7,,B,Raw,F,Class 3A,,DQ
Katie Heeb,Martin County,56.61,58.51,54.43,56.7,-58.97,56.7,56.7,B,Raw,F,Class 3A,,17
Zamora St. Cyr,Dr Phillips,63.05,63.05,74.84,77.11,79.38,79.38,79.38,B,Raw,F,Class 3A,,1
Ariel Michel,Navarre,62.6,63.05,72.57,77.11,79.38,79.38,79.38,B,Raw,F,Class 3A,,2
Makenna Presley,Oviedo,61.05,63.05,65.77,68.04,-70.31,68.04,68.04,B,Raw,F,Class 3A,,3
Isabel Cox,Dr Phillips,61.82,63.05,68.04,70.31,-72.57,70.31,70.31,B,Raw,F,Class 3A,,4
Jacey Tippman,Venice,58.97,63.05,70.31,72.57,-74.84,72.57,72.57,B,Raw,F,Class 3A,,5
Aun'yale Howard,Flagler,59.28,63.05,61.23,-65.77,-65.77,61.23,61.23,B,Raw,F,Class 3A,,11
Christina Montique,Hagerty,60.69,63.05,-63.5,65.77,-68.04,65.77,65.77,B,Raw,F,Class 3A,,10
Katy Garcia,Lake Mary,62.28,63.05,-61.23,63.5,65.77,65.77,65.77,B,Raw,F,Class 3A,,8
Sarah Schumpert,Navarre,62.87,63.05,63.5,-68.04,68.04,68.04,68.04,B,Raw,F,Class 3A,,9
Kayleigh Soler,North Port,61.96,63.05,61.23,65.77,68.04,68.04,68.04,B,Raw,F,Class 3A,,6
Kendall Matoska,Celebration,62.05,63.05,58.97,61.23,-63.5,61.23,61.23,B,Raw,F,Class 3A,,7
Grace Wilson,Vero Beach,62.14,63.05,61.23,63.5,-65.77,63.5,63.5,B,Raw,F,Class 3A,,20
Khaliah Moore,Evans,60.28,63.05,-54.43,-56.7,56.7,56.7,56.7,B,Raw,F,Class 3A,,18
Paige Smith,Vero Beach,61.28,63.05,58.97,61.23,-63.5,61.23,61.23,B,Raw,F,Class 3A,,14
Kyra Brenneman,Creekside,61.14,63.05,-58.97,58.97,-61.23,58.97,58.97,B,Raw,F,Class 3A,,13
Jhane' Sulcer,Atlantic Coast,61.96,63.05,63.5,-65.77,-65.77,63.5,63.5,B,Raw,F,Class 3A,,12
Leigha Sutton,Boca Raton,62.05,63.05,47.63,-49.9,-52.16,47.63,47.63,B,Raw,F,Class 3A,,16
Amber Garcia,University,61.51,63.05,58.97,61.23,-63.5,61.23,61.23,B,Raw,F,Class 3A,,15
Maylee Lanham,Venice,59.06,63.05,56.7,58.97,61.23,61.23,61.23,B,Raw,F,Class 3A,,17
Maddie Peck,Celebration,60.51,63.05,49.9,52.16,54.43,54.43,54.43,B,Raw,F,Class 3A,,19
Tristain Atwood,North Port,67.59,69.85,81.65,-83.91,-83.91,81.65,81.65,B,Raw,F,Class 3A,,2
Jada Thomas,Navarre,68.04,69.85,83.91,88.45,90.72,90.72,90.72,B,Raw,F,Class 3A,,1
Brittney Joseph,Evans,67.27,69.85,-79.38,79.38,81.65,81.65,81.65,B,Raw,F,Class 3A,,3
Aubrey Jarvis,North Port,67.49,69.85,77.11,79.38,81.65,81.65,81.65,B,Raw,F,Class 3A,,4
Sydney Yorton,Bartram,67.99,69.85,79.38,83.91,-88.45,83.91,83.91,B,Raw,F,Class 3A,,5
Shanaiska Guirand,Vero Beach,69.35,69.85,68.04,70.31,72.57,72.57,72.57,B,Raw,F,Class 3A,,9
Sydney Lake,Timber Creek,68.36,69.85,70.31,72.57,74.84,74.84,74.84,B,Raw,F,Class 3A,,6
Riana Rhone,Niceville,68.36,69.85,70.31,74.84,77.11,77.11,77.11,B,Raw,F,Class 3A,,8
Riley Finnegan,Oviedo,67.63,69.85,70.31,74.84,-77.11,74.84,74.84,B,Raw,F,Class 3A,,10
Alexis Hogan,Forest,68.31,69.85,70.31,74.84,79.38,79.38,79.38,B,Raw,F,Class 3A,,7
Cedar Crawford,Mandarin,68.9,69.85,65.77,-68.04,-68.04,65.77,65.77,B,Raw,F,Class 3A,,11
Mckennea Browning,Treasure Coast,67.18,69.85,63.5,65.77,68.04,68.04,68.04,B,Raw,F,Class 3A,,19
Diana Croft,Flagler,66.22,69.85,65.77,70.31,72.57,72.57,72.57,B,Raw,F,Class 3A,,12
Marcela Cardosi,Mitchell,68.31,69.85,68.04,72.57,77.11,77.11,77.11,B,Raw,F,Class 3A,,13
Hali Fildes,Hagerty,65.23,69.85,61.23,63.5,65.77,65.77,65.77,B,Raw,F,Class 3A,,14
Crista Helm,Lake Brantley,69.04,69.85,61.23,63.5,65.77,65.77,65.77,B,Raw,F,Class 3A,,15
Bayli Legg,Martin County,66.18,69.85,58.97,-61.23,-61.23,58.97,58.97,B,Raw,F,Class 3A,,17
Joann Fleurjuste,Treasure Coast,68.31,69.85,68.04,-70.31,-70.31,68.04,68.04,B,Raw,F,Class 3A,,16
Kendall Massey,Lakeland,69.49,69.85,49.9,54.43,-58.97,54.43,54.43,B,Raw,F,Class 3A,,18
Madison Atwood,North Port,74.43,76.66,81.65,83.91,-86.18,83.91,83.91,B,Raw,F,Class 3A,,1
Maria Hincapie,Celebration,72.44,76.66,70.31,-74.84,74.84,74.84,74.84,B,Raw,F,Class 3A,,6
Avery Teske,Vero Beach,74.48,76.66,74.84,79.38,81.65,81.65,81.65,B,Raw,F,Class 3A,,3
Ariana Acosta-Ramirez,Buchholz,76.34,76.66,70.31,74.84,-77.11,74.84,74.84,B,Raw,F,Class 3A,,2
Sophia Lomax,Bartram,71.26,76.66,63.5,68.04,-72.57,68.04,68.04,B,Raw,F,Class 3A,,8
Trinity Tredway,Niceville,71.99,76.66,74.84,79.38,81.65,81.65,81.65,B,Raw,F,Class 3A,,5
Armelle Oliantus,Dr Phillips,72.57,76.66,72.57,74.84,77.11,77.11,77.11,B,Raw,F,Class 3A,,4
Savannah O'Neill,St Cloud,74.21,76.66,72.57,77.11,79.38,79.38,79.38,B,Raw,F,Class 3A,,7
Jacey Harper,Navarre,72.53,76.66,74.84,79.38,-81.65,79.38,79.38,B,Raw,F,Class 3A,,10
Damond Elliot,Colonial,75.11,76.66,-72.57,74.84,77.11,77.11,77.11,B,Raw,F,Class 3A,,9
Marina Marcano,Colonial,75.66,76.66,63.5,65.77,70.31,70.31,70.31,B,Raw,F,Class 3A,,11
Jerneka Davis,Ft Pierce Central,75.34,76.66,68.04,70.31,-72.57,70.31,70.31,B,Raw,F,Class 3A,,19
Ni'kira Smith,Dr Phillips,72.71,76.66,68.04,70.31,72.57,72.57,72.57,B,Raw,F,Class 3A,,13
Emma Brown #4,Windermere,70.44,76.66,63.5,65.77,-68.04,65.77,65.77,B,Raw,F,Class 3A,,14
Sydney Pachter,Venice,73.12,76.66,63.5,65.77,68.04,68.04,68.04,B,Raw,F,Class 3A,,12
Chloe Varady,Hagerty,74.93,76.66,56.7,61.23,-63.5,61.23,,B,Raw,F,Class 3A,,DQ
Natalie Allen,Spruce Creek,74.53,76.66,58.97,63.5,65.77,65.77,65.77,B,Raw,F,Class 3A,,17
Emily Howard,Navarre,71.03,76.66,63.5,68.04,70.31,70.31,70.31,B,Raw,F,Class 3A,,16
Mackenzie Tessier,Vero Beach,70.58,76.66,63.5,65.77,68.04,68.04,68.04,B,Raw,F,Class 3A,,15
Trinity Fuery,Bartow,75.61,76.66,54.43,58.97,-63.5,58.97,58.97,B,Raw,F,Class 3A,,18
Karlie Marini,Hagerty,82.24,83.01,74.84,77.11,-79.38,77.11,77.11,B,Raw,F,Class 3A,,4
Ximena Carrera,Palm Beach Gardens,77.56,83.01,65.77,68.04,70.31,70.31,70.31,B,Raw,F,Class 3A,,1
Lexie Newland,Vero Beach,80.42,83.01,79.38,83.91,-86.18,83.91,83.91,B,Raw,F,Class 3A,,2
Qua'liyah Taylor,Bartram,81.06,83.01,-77.11,-77.11,-77.11,-77.11,,B,Raw,F,Class 3A,,DQ
Tymia McLeod,Evans,77.34,83.01,79.38,81.65,-83.91,81.65,81.65,B,Raw,F,Class 3A,,5
Jy'meria Franklin,Seminole,81.96,83.01,72.57,77.11,79.38,79.38,79.38,B,Raw,F,Class 3A,,3
Maronna Barrs,Mandarin,82.28,83.01,65.77,70.31,-72.57,70.31,70.31,B,Raw,F,Class 3A,,6
Mackenzie Prather,Navarre,77.29,83.01,68.04,72.57,-74.84,72.57,72.57,B,Raw,F,Class 3A,,8
Kathryn Hilt,Navarre,80.1,83.01,61.23,65.77,70.31,70.31,70.31,B,Raw,F,Class 3A,,7
Jemima Touze,Evans,81.87,83.01,68.04,70.31,-72.57,70.31,70.31,B,Raw,F,Class 3A,,9
Dani Liscano,Freedom,,83.01,,,,,,B,Raw,F,Class 3A,,NS
Maria Henen,Lakewood,82.28,83.01,65.77,68.04,70.31,70.31,70.31,B,Raw,F,Class 3A,,16
Ayana Ferguson,Oviedo,81.47,83.01,61.23,65.77,70.31,70.31,70.31,B,Raw,F,Class 3A,,10
Alaina Hussung,Nease,80.47,83.01,63.5,65.77,-68.04,65.77,,B,Raw,F,Class 3A,,DQ
Abbie Phillips,Spruce Creek,79.56,83.01,54.43,-58.97,-58.97,54.43,54.43,B,Raw,F,Class 3A,,13
Megan Peck,Celebration,81.83,83.01,58.97,61.23,-63.5,61.23,61.23,B,Raw,F,Class 3A,,11
Hannah Flores,Vero Beach,80.38,83.01,54.43,-56.7,58.97,58.97,58.97,B,Raw,F,Class 3A,,12
Akiyah Williams,Osceola,81.74,83.01,56.7,58.97,-63.5,58.97,,B,Raw,F,Class 3A,,DQ
Chelsea Taylor,St Cloud,79.11,83.01,54.43,-56.7,56.7,56.7,56.7,B,Raw,F,Class 3A,,15
Julia Stone,Venice,78.2,83.01,61.23,-63.5,63.5,63.5,63.5,B,Raw,F,Class 3A,,14
Anniel Buchanan,Flagler,88.18,90.26,95.25,102.06,106.59,106.59,106.59,B,Raw,F,Class 3A,,1
Dallas Dickey,George Jenkins,87.5,90.26,83.91,88.45,92.99,92.99,92.99,B,Raw,F,Class 3A,,2
Anastasia Marenda,Wiregrass,89.86,90.26,77.11,81.65,83.91,83.91,83.91,B,Raw,F,Class 3A,,3
Da'Moni Kelly,Mandarin,84.73,90.26,77.11,79.38,-81.65,79.38,79.38,B,Raw,F,Class 3A,,5
Tia Harris,Buchholz,88.95,90.26,70.31,-79.38,79.38,79.38,79.38,B,Raw,F,Class 3A,,4
Elaine Vales,Evans,89.99,90.26,68.04,70.31,-72.57,70.31,70.31,B,Raw,F,Class 3A,,8
Abby Routh,Navarre,88.99,90.26,65.77,70.31,72.57,72.57,72.57,B,Raw,F,Class 3A,,6
Alyssa Davis,Nease,88.13,90.26,63.5,-68.04,70.31,70.31,70.31,B,Raw,F,Class 3A,,7
Neashi Glevis,Atlantic,85.91,90.26,63.5,-65.77,-65.77,63.5,63.5,B,Raw,F,Class 3A,,12
Aleysha DeJesus,Osceola,88.13,90.26,-65.77,-68.04,68.04,68.04,68.04,B,Raw,F,Class 3A,,9
Mia Espaillet,University,83.28,90.26,-58.97,-63.5,-65.77,-58.97,,B,Raw,F,Class 3A,,DQ
Khaleisha Bright,Evans,84.41,90.26,-61.23,-61.23,63.5,63.5,63.5,B,Raw,F,Class 3A,,11
Yaden Deehr,Crestview,86.82,90.26,61.23,65.77,-68.04,65.77,65.77,B,Raw,F,Class 3A,,15
Paige Macauley,Windermere,88.77,90.26,68.04,-72.57,-72.57,68.04,68.04,B,Raw,F,Class 3A,,13
Ginger Walker,St Cloud,90.22,90.26,58.97,63.5,65.77,65.77,65.77,B,Raw,F,Class 3A,,10
Kani Binns,Lake Howell,84.78,90.26,68.04,-70.31,-70.31,68.04,68.04,B,Raw,F,Class 3A,,14
Ishaunie Wallace,Manatee,87.45,90.26,56.7,58.97,61.23,61.23,61.23,B,Raw,F,Class 3A,,16
Indiana Ramis,Celebration,84.01,90.26,54.43,56.7,-58.97,56.7,56.7,B,Raw,F,Class 3A,,17
Loudi Joseph,Palm Beach Gardens,86.5,90.26,54.43,-56.7,-56.7,54.43,54.43,B,Raw,F,Class 3A,,18
Aiyana Harrington,Vero Beach,172.37,90.26+,99.79,104.33,-108.86,104.33,104.33,B,Raw,F,Class 3A,,1
Emillia Collins,Navarre,119.02,90.26+,111.13,115.67,117.93,117.93,117.93,B,Raw,F,Class 3A,,2
Samantha Charles,Oak Ridge,130.5,90.26+,104.33,106.59,-108.86,106.59,106.59,B,Raw,F,Class 3A,,3
Nelly West,Niceville,153.36,90.26+,86.18,90.72,92.99,92.99,92.99,B,Raw,F,Class 3A,,4
Jada Lizaire,Evans,129.77,90.26+,88.45,90.72,92.99,92.99,92.99,B,Raw,F,Class 3A,,7
Sarah Munar,Deland,144.47,90.26+,83.91,88.45,-90.72,88.45,88.45,B,Raw,F,Class 3A,,8
Shantay Reid,North Port,106.46,90.26+,81.65,86.18,88.45,88.45,88.45,B,Raw,F,Class 3A,,5
Markayla Madison,Fleming,102.01,90.26+,81.65,83.91,90.72,90.72,90.72,B,Raw,F,Class 3A,,9
Erin Flood,Winter Park,116.21,90.26+,79.38,81.65,-83.91,81.65,81.65,B,Raw,F,Class 3A,,11
Irma Watson,Seminole,126.42,90.26+,74.84,79.38,81.65,81.65,81.65,B,Raw,F,Class 3A,,6
Kenisha Branch,Kathleen,132.72,90.26+,79.38,81.65,-83.91,81.65,,B,Raw,F,Class 3A,,DQ
Jada Green,Bartow,91.72,90.26+,72.57,77.11,-81.65,77.11,77.11,B,Raw,F,Class 3A,,18
Arianna Keyes,Centenniel,104.78,90.26+,70.31,74.84,-79.38,74.84,74.84,B,Raw,F,Class 3A,,12
Avery Brechtel,Niceville,106.59,90.26+,70.31,74.84,79.38,79.38,79.38,B,Raw,F,Class 3A,,10
Carrie Joseph,Palmetto,108.32,90.26+,74.84,79.38,-83.91,79.38,,B,Raw,F,Class 3A,,DQ
Allana Seegert,Boone,117.39,90.26+,77.11,-81.65,81.65,81.65,81.65,B,Raw,F,Class 3A,,13
Emily O'Mara,Creekside,131.63,90.26+,77.11,81.65,-83.91,81.65,81.65,B,Raw,F,Class 3A,,14
Alyssa Shirley,Royal Palm Beach,158.58,90.26+,72.57,77.11,81.65,81.65,81.65,B,Raw,F,Class 3A,,15
Haliegh D'amico,Hagerty,101.11,90.26+,68.04,-72.57,-74.84,68.04,68.04,B,Raw,F,Class 3A,,16
Jamelise Rivas,Poinciana,101.74,90.26+,70.31,74.84,-77.11,74.84,,B,Raw,F,Class 3A,,DQ
Lillian Markowitz,Haines City,126.01,90.26+,63.5,74.84,79.38,79.38,79.38,B,Raw,F,Class 3A,,17
