{
  "lessons": [
    {
      "slug": "1011",
      "introduction": [
        "In this course, you will learn how to write smart contracts that can be used on the Cardano blockchain. In this module, we will take our first look at some of the smart contract languages on Cardano.",
        "All of these languages share some basic design patterns, even though each language looks a little different.",
        "All of these langauges compile to Untyped Plutus Core (UPLC). UPLC can be encoded in Concise Binary Object Representation (CBOR), and this CBOR can be used on the blockchain.",
        "To see what this CBOR looks like, watch this video."
      ],
      "links": [
        { "url": "https://well-typed.com/blog/2022/08/plutus-cores/", "linkText": "Well-Typed Blog: The Plutus Compilation Pipeline" },
        { "url": "https://cbor.io/", "linkText": "About CBOR" }
      ],
      "videoHeading": "What does it mean to \"compile a Plutus script\"?",
      "youtubeId": "dDkAdzvzrbg",
      "successComponent": false,
      "success": {
        "criteria": "you can compile a contract to UPLC from the language of your choice.",
        "text": "To master this learning target, you must attempt at least one of the approaches suggested in Lessons 101.3 through 101.6. Are you ready? If so, move on to Lesson 2."
      },
      "assignmentComponent": true,
      "markdownComponent": false
    },
    {
      "slug": "1012",
      "introduction": [
        "There is some debate over whether the term \"smart contract\" is really the best way to describe the code we use on a blockchain. On Cardano, we use the word \"validator\".",
        "A validator defines the rules for unlocking tokens from a Cardano address.",
        "In this module, you will see how to compile validators to UPLC.",
        "This should raise a new question: after you compile a smart contract to Plutus Core, what can you do with it? Keep this question in mind. We will continue to ask it throughout the course.",
        "Watch this video to see one way to think about the role of validators and UPLC in a decentralized application."
      ],
      "links": [],
      "videoHeading": "What is a Validator? What is Plutus Core?",
      "youtubeId": "cEVNWr8NKi8",
      "successComponent": false,
      "success": {
        "criteria": "you can explain how Plutus scripts are used in a Cardano application.",
        "text": "At the end of this module, you will have your first compiled Plutus scripts. Then, in Modules 102 and 201 you will start to use them."
      },
      "assignmentComponent": true,
      "markdownComponent": true
    },
    {
      "slug": "1013",
      "introduction": [
        "Demeter.run is a cloud-based Cardano development platform built by TxPipe.",
        "Demeter is a very helpful tool for anyone who wants to get started quickly with Cardano development. Many developers start with Demeter to get an initial feel for how Cardano works.",
        "To see how to get started, watch this video."
      ],
      "links": [
        { "url": "https://demeter.run/", "linkText": "demeter.run" },
        { "url": "https://txpipe.io/", "linkText": "TxPipe" },
        {
          "url": "https://iog-academy.gitbook.io/plutus-pioneers-program-fourth-cohort/lectures/lecture-01/lesson-01",
          "linkText": "Demeter.run is introduced in Plutus Pioneers"
        },
        {
          "url": "https://gitlab.com/gimbalabs/ppbl-2023/ppbl2023-plutus-template",
          "linkText": "PPBL2023 Plutus Template"
        }
      ],
      "videoHeading": "Getting Started with Demeter.run",
      "youtubeId": "HQRQcN_zDsI",
      "successComponent": false,
      "success": {
        "criteria": "you can see the file \"always-succeeds.plutus\" in your Demeter development environment.",
        "text": "To complete this lesson, follow the documentation below."
      },
      "assignmentComponent": true,
      "markdownComponent": true
    },
    {
      "slug": "1014",
      "introduction": [
        "Experienced Plutus developers will tell you that setting up a local environment for writing PlutusTX is one of the hardest parts about learning Plutus.",
        "This is one of the reasons that developers are so excited about new languages like Aiken and plu-ts, which we will investigate in Lessons 101.5 and 101.6.",
        "Still, we want you to have the option of building with PlutusTx on your own computer.",
        "Follow along with this video, or join us at Plutus PBL Live coding on 2023-03-23 to see a live demonstration and to ask questions."
      ],
      "links": [
        { "url": "https://nixos.org/", "linkText": "Nix: official site" },
        { "url": "https://github.com/input-output-hk/plutus-apps", "linkText": "Plutus Apps repository on GitHub" },
        { "url": "https://gitlab.com/gimbalabs/ppbl-2023/ppbl2023-plutus-template", "linkText": "PPBL 2023 Plutus Template on GitLab" }
      ],
      "videoHeading": "Setting up your own Plutus development environment",
      "youtubeId": "-lOwuhH4fRk",
      "successComponent": false,
      "success": {
        "criteria": "you can compile always-succeeds.plutus from the PPBL 2023 Plutus Template on your computer.",
        "text": "Review the video above, or follow along with the documentation below. If you get stuck, please ask questions - you are now part of a community where a lot of people know what it's like to struggle with this step!"
      },
      "assignmentComponent": true,
      "markdownComponent": true
    },
    {
      "slug": "1015",
      "introduction": [
        "Aiken is a new language for developing smart contracts on Cardano. If you have a background in Rust development, you might find yourself at home with Aiken.",
        "The Aiken language was written in Rust, but Aiken is not Rust. When we use Aiken, we will use some Rust tooling.",
        "To get started, watch this video or follow along with the documentation below."
      ],
      "links": [
        { "linkText": "Aiken Programming Language", "url": "https://aiken-lang.org/" },
        {
          "linkText": "The Aiken documentation is helpful. We recommend taking a look!",
          "url": "https://aiken-lang.org/fundamentals/getting-started"
        }
      ],
      "videoHeading": "Getting started with Aiken",
      "youtubeId": "gbn8LYkVOG8",
      "successComponent": false,
      "success": {
        "criteria": "you can see a \"plutus.json\" file after running \"aiken build\".",
        "text": "Review the video above, or follow along with the documentation below. If you get stuck, ask for help at Live Coding or on Gimbalabs Discord."
      },
      "assignmentComponent": true,
      "markdownComponent": true
    },
    {
      "slug": "1016",
      "introduction": [
        "plu-ts is a new language for developing smart contracts on Cardano. If you have a background in Javascript or Typescript development, you might find yourself at home with plu-ts.",
        "plu-ts is written in Typescript and can be embedded in any existing Javascript or Typescript project.",
        "To get started, watch this video or follow along with the documentation below."
      ],
      "links": [{ "url": "https://pluts.harmoniclabs.tech/", "linkText": "plu-ts official site" }],
      "videoHeading": "Getting started with plu-ts",
      "youtubeId": "mdXvalGT4U4",
      "successComponent": false,
      "success": {
        "criteria": "you can compile always-succeeds.plutus by running \"npm run start\".",
        "text": "Review the video above, or follow along with the documentation below. If you get stuck, ask for help at Live Coding or on Gimbalabs Discord."
      },
      "assignmentComponent": true,
      "markdownComponent": true
    }
  ]
}
