{
    "app": {
        "port": 8080
    },
    "config": {
        "endpoint": "http://fuseki:3030/config",
        "username": "admin",
        "password": "admin"
    },
    "data": {
        "endpoint": "http://fuseki:3030/data",
        "username": "admin",
        "password": "admin"
    }
}