{
  "clientId": "versd-ui",
  "name": "VERSD",
  "surrogateAuthRequired": false,
  "enabled": true,
  "alwaysDisplayInConsole": false,
  "clientAuthenticatorType": "client-secret",
  "redirectUris": [],
  "webOrigins": [],
  "notBefore": 0,
  "bearerOnly": false,
  "consentRequired": false,
  "standardFlowEnabled": true,
  "implicitFlowEnabled": false,
  "directAccessGrantsEnabled": true,
  "serviceAccountsEnabled": false,
  "publicClient": true,
  "frontchannelLogout": false,
  "protocol": "openid-connect",
  "attributes": {
    "backchannel.logout.revoke.offline.tokens": "false",
    "backchannel.logout.session.required": "true",
    "client_credentials.use_refresh_token": "false",
    "display.on.consent.screen": "false",
    "exclude.session.state.from.auth.response": "false",
    "saml_force_name_id_format": "false",
    "saml.assertion.signature": "false",
    "saml.authnstatement": "false",
    "saml.client.signature": "false",
    "saml.encrypt": "false",
    "saml.force.post.binding": "false",
    "saml.multivalued.roles": "false",
    "saml.onetimeuse.condition": "false",
    "saml.server.signature.keyinfo.ext": "false",
    "saml.server.signature": "false",
    "tls.client.certificate.bound.access.tokens": "false"
  },
  "authenticationFlowBindingOverrides": {},
  "fullScopeAllowed": true,
  "nodeReRegistrationTimeout": -1,
  "defaultClientScopes": [
    "web-origins",
    "role_list",
    "roles",
    "profile",
    "email"
  ],
  "optionalClientScopes": [
    "address",
    "phone",
    "offline_access",
    "microprofile-jwt"
  ],
  "access": {
    "view": true,
    "configure": true,
    "manage": true
  }
}
