<svg width="10" height="6" viewBox="0 0 10 6" fill="none" xmlns="http://www.w3.org/2000/svg">
<path d="M0.606567 1.44863C0.606567 1.34863 0.606567 1.24863 0.706567 1.24863L1.40657 0.548633C1.50657 0.448633 1.70657 0.448633 1.80657 0.548633L4.90657 3.64863L8.00657 0.548633C8.20657 0.448633 8.40657 0.448633 8.50657 0.548633L9.20657 1.24863C9.20657 1.24863 9.30657 1.34863 9.30657 1.44863C9.30657 1.54863 9.30657 1.64863 9.20657 1.64863L5.20657 5.54863C5.10657 5.64863 4.90657 5.64863 4.70657 5.54863L0.706567 1.64863C0.606567 1.54863 0.606567 1.44863 0.606567 1.44863Z" fill="black"/>
</svg>
