<svg width="18" height="19" viewBox="0 0 18 19" fill="none" xmlns="http://www.w3.org/2000/svg">
<path d="M0.545454 9.5C0.545454 4.86364 4.36364 1.04545 9 1.04545C13.6364 1.04545 17.4545 4.86364 17.4545 9.5C17.4545 14.1364 13.6364 17.9545 9 17.9545C4.36364 17.9545 0.545454 14.1364 0.545454 9.5ZM-4.04019e-07 9.5C-1.81196e-07 14.4636 4.03636 18.5 9 18.5C13.9636 18.5 18 14.4636 18 9.5C18 4.53636 13.9636 0.499999 9 0.5C4.03636 0.5 -6.26842e-07 4.53636 -4.04019e-07 9.5Z" fill="black"/>
<path d="M13.7455 11.1367L9.00001 6.50035L4.25456 11.1367L3.87274 10.7549L9.00001 5.68217L14.1273 10.7549L13.7455 11.1367Z" fill="black"/>
</svg>
