<svg viewBox="0 0 24 24">
	<path d="M12,12c2.2,0,4-1.8,4-4s-1.8-4-4-4S8,5.8,8,8S9.8,12,12,12z M14.8,13h-0.5c-0.7,0.3-1.4,0.5-2.3,0.5s-1.6-0.2-2.3-0.5H9.2
	C6.9,13,5,14.9,5,17.2v1.3C5,19.4,5.6,20,6.5,20h11c0.9,0,1.5-0.6,1.5-1.5v-1.3C19,14.9,17.1,13,14.8,13z"/>
</svg>
