<?xml version="1.0" encoding="UTF-8"?>
<svg id="Layer_1" data-name="Layer 1" xmlns="http://www.w3.org/2000/svg" viewBox="0 0 500 500">
  <g id="layer1">
    <path id="path931" d="M328.69,168.66c0,61.09-49.53,110.62-110.62,110.62s-110.62-49.53-110.62-110.62,49.53-110.62,110.62-110.62,110.62,49.53,110.62,110.62h0Z" fill="none" stroke="#f1f2f2" stroke-miterlimit="28.35" stroke-width="7.03"/>
    <path id="path899" d="M164.47,261.42l4.28-6.42,25.11,15.65,44.69-.44,24.77-18.11,8.33,5.53-6.24,8.43s-54.5,28.68-100.94-4.63" fill="#393536"/>
    <path id="path901" d="M165.56,267.39c-7.54-3.41-11.72-9.42-9.33-13.41,2.38-4,10.43-4.49,17.97-1.08,7.54,3.41,11.71,9.41,9.33,13.41-2.38,4.01-10.43,4.49-17.97,1.08" fill="#f1f2f2" fill-rule="evenodd"/>
    <path id="path903" d="M267.65,267.39c7.54-3.41,11.72-9.42,9.33-13.41-2.39-4-10.43-4.49-17.97-1.08-7.55,3.41-11.72,9.41-9.34,13.41,2.39,4.01,10.43,4.49,17.97,1.08" fill="#f1f2f2" fill-rule="evenodd"/>
    <path id="path905" d="M262.07,139.13s8.01,22.06,3.54,42c-.42,1.89,4.17,2.3,6.6,12.5,0,0,46.72-1.42,42.81-68.98,0,0-5.17-9.91-19.1.56,0,0-29.17,4.59-33.85,13.93" fill="#f1f2f2" fill-rule="evenodd"/>
    <path id="path907" d="M308.48,121.93c-3.25-.44-7.18,1.06-11.67,4.44l-.29.22-.36.05c-7.71,1.22-28.18,5.8-32.48,12.62,1.3,3.86,7.5,23.69,3.35,41.94.07.15.45.53.75.84,1.38,1.39,3.88,3.92,5.56,10.01,3.76-.41,15.99-2.59,25.97-13.49,10.8-11.79,15.6-29.78,14.28-53.48-.47-.71-2.05-2.75-5.1-3.15M270.79,193.95c-1.48-6.19-3.75-8.48-5.1-9.86-.9-.9-1.83-1.84-1.5-3.29,4.31-19.28-3.41-40.96-3.49-41.18l-.21-.59.28-.56c4.72-9.43,30.19-13.94,34.57-14.65,5.01-3.71,9.56-5.31,13.53-4.78,5.18.69,7.36,4.75,7.45,4.93l.16.59c1.43,24.7-3.63,43.53-15.03,55.98-12.71,13.88-28.53,14.51-29.19,14.54l-1.19.03" fill="#393536"/>
    <path id="path909" d="M168.76,139.13s-8,22.06-3.54,42c.42,1.89-4.16,2.3-6.6,12.5,0,0-46.72-1.42-42.81-68.98,0,0,5.17-9.91,19.1.56,0,0,29.17,4.59,33.85,13.93" fill="#f1f2f2" fill-rule="evenodd"/>
    <path id="path911" d="M117.25,125.09c-1.32,23.7,3.49,41.69,14.28,53.48,9.98,10.89,22.21,13.07,25.97,13.49,1.68-6.09,4.18-8.62,5.55-10.01.3-.31.68-.69.75-.84-4.14-18.25,2.05-38.08,3.35-41.94-4.29-6.82-24.77-11.41-32.48-12.62l-.36-.05-.29-.22c-4.49-3.38-8.42-4.87-11.67-4.44-3.06.4-4.64,2.44-5.1,3.15M159.77,195.12l-1.19-.03c-.67-.03-16.49-.66-29.2-14.54-11.4-12.45-16.45-31.28-15.02-55.98l.16-.59c.1-.18,2.27-4.25,7.46-4.93,3.97-.52,8.52,1.08,13.53,4.79,4.38.71,29.85,5.23,34.57,14.65l.28.56-.21.59c-.07.22-7.8,21.9-3.49,41.18.32,1.45-.6,2.39-1.5,3.29-1.36,1.38-3.63,3.67-5.11,9.86" fill="#393536"/>
    <path id="path913" d="M234.97,110.14c-7.83,1.09-13.3,10.9-19.79,10.33-3.17-.28-3.74-2.85-6.89-5.16-21.06-15.46-48.6,8.13-34.42,31.84-8.94,13.31-13.81,30.2-13.77,48.19.11,37.94,26.4,71.51,67.1,62.01,43.59-10.16,58.32-71.07,31-111.06,10.74-16.54-1.34-39.16-23.23-36.13M180.76,75.96c5.56,4.77,12.45,15.94,17.44,21.27,12.22-3.9,26.31-3.9,36.16,0,5.68-4.93,11.64-16.86,17.83-21.27,8,19.11,20.73,35.32,23.23,58.27.35,3.23-1.03,7.64,0,11.19,1.71,5.9,6.66,7.14,8.6,12.05,3.58,9.02,3.43,18.27,3.44,26.68.12,47.75-22.86,90.92-66.26,94.65-24.68,2.12-46.76-12.55-58.51-29.25-11.93-16.96-19.16-44.87-17.21-74,.82-12.17,2.48-22.31,12.04-28.4-1.88-28.95,13.2-51.3,23.23-71.18" fill="#f1f2f2" fill-rule="evenodd"/>
    <path id="path915" d="M193.79,111.66c-7.98,0-15.71,4.55-19.7,11.59-4.01,7.08-3.68,15.55.9,23.22l.43.71-.45.69c-8.79,13.07-13.6,29.93-13.55,47.45.09,30.21,18.4,62.33,52.19,62.33,4.29,0,8.77-.54,13.3-1.59,17.53-4.09,31.23-16.72,38.56-35.56,9.23-23.71,5.95-52.56-8.35-73.49l-.49-.72.47-.73c4.59-7.06,5-15.95,1.07-23.18-3.81-7.01-11.02-11.2-19.3-11.2-1.22,0-2.47.08-3.73.26-3.45.47-6.54,2.93-9.51,5.3-3.46,2.76-6.75,5.37-10.58,5.03-2.49-.22-3.71-1.57-5-3-.72-.8-1.46-1.61-2.54-2.4-4.19-3.08-8.93-4.7-13.73-4.7M213.61,260.27h0c-15.79,0-30.01-7.01-40.06-19.74-9.46-11.97-14.69-28.03-14.74-45.19-.05-17.75,4.75-34.84,13.54-48.24-4.69-8.31-4.89-17.43-.52-25.13,4.45-7.85,13.07-12.92,21.98-12.92,5.35,0,10.64,1.8,15.28,5.2,1.29.95,2.16,1.91,2.93,2.76,1.23,1.37,1.89,2.03,3.3,2.15,2.84.25,5.66-2.03,8.72-4.46,3.09-2.47,6.61-5.28,10.78-5.86,1.37-.19,2.75-.28,4.08-.28,9.25,0,17.33,4.7,21.6,12.57,4.26,7.83,3.96,17.37-.72,25.12,14.37,21.56,17.58,50.97,8.15,75.2-7.55,19.39-22.27,32.93-40.41,37.16-4.72,1.1-9.39,1.66-13.89,1.66M181.14,78.08c-1.32,2.58-2.7,5.17-4.15,7.88-9.25,17.33-19.73,36.97-18.16,61.08l.05.77-.65.41c-9.28,5.91-10.67,15.9-11.44,27.39-1.85,27.63,4.65,55.66,16.98,73.16,9.38,13.33,28.8,28.9,52.66,28.9,1.56,0,3.13-.06,4.67-.2,45.1-3.87,65.17-49.67,65.06-93.34v-1.12c-.02-8.2-.03-16.68-3.35-25.07-.79-1.99-2.18-3.34-3.66-4.78-1.86-1.81-3.96-3.86-4.99-7.38-.68-2.34-.42-4.95-.2-7.25.14-1.53.28-2.97.15-4.16-1.69-15.54-8.28-28.21-14.66-40.46-2.67-5.12-5.42-10.41-7.79-15.86-2.77,2.46-5.57,6.38-8.29,10.18-2.8,3.92-5.44,7.63-8.15,9.98l-.6.52-.75-.29c-4.68-1.85-10.46-2.83-16.71-2.83s-12.7.99-18.56,2.86l-.78.25-.57-.6c-2.13-2.27-4.54-5.51-7.1-8.94-3.05-4.08-6.19-8.3-9.02-11.09M216.42,280.3c-24.82,0-44.58-15.5-54.8-30.02-12.65-17.97-19.33-46.64-17.45-74.84.77-11.51,2.28-22.39,12-28.99-1.35-24.5,9.19-44.26,18.51-61.72,1.73-3.25,3.37-6.32,4.91-9.37l.75-1.49,1.27,1.09c3.35,2.87,7.06,7.84,10.64,12.66,2.28,3.06,4.45,5.97,6.35,8.11,5.9-1.79,12.3-2.74,18.56-2.74s12.07.95,16.91,2.73c2.29-2.19,4.67-5.51,7.17-9.01,3.26-4.58,6.64-9.3,10.18-11.83l1.33-.95.64,1.5c2.47,5.92,5.48,11.68,8.38,17.25,6.49,12.47,13.2,25.36,14.94,41.39.16,1.46,0,3.04-.15,4.71-.21,2.16-.43,4.41.11,6.27.84,2.86,2.52,4.49,4.31,6.23,1.61,1.57,3.28,3.18,4.27,5.69,3.5,8.86,3.52,17.98,3.52,26.04v1.12c.07,24.58-5.98,47.5-17.01,64.55-12.14,18.75-29.58,29.61-50.43,31.4-1.62.14-3.27.21-4.9.21" fill="#393536"/>
    <path id="path917" d="M232.39,111.76c-6.58,1.75-10.73,10.43-16.35,10.32-4.69-.09-8.03-7.26-13.77-9.46-20.97-8.05-39.54,16.32-26.68,34.42-27.13,36.97-15.71,92.95,20.47,107.82,7.99,3.28,31.31,3.65,38.67,1.04,39.49-14.03,47.75-72.34,22.6-109.72,11.21-18.83-5.37-39.64-24.95-34.41" fill="#fff" fill-rule="evenodd"/>
    <path id="path919" d="M193.67,141.11c9.81.44,10.43-19.44-2.58-13.77-9.11,3.97-1.53,13.58,2.58,13.77" fill="#fff" fill-rule="evenodd"/>
    <path id="path921" d="M231.53,136.81c2.35,6.86,15.79,5.15,14.63-4.31-.57-4.54-5.28-7.33-10.32-5.15-4.74,2.03-5.85,4.96-4.31,9.46" fill="#fff" fill-rule="evenodd"/>
    <path id="path923" d="M191.09,127.35c13-5.68,12.38,14.21,2.58,13.77-4.11-.19-11.69-9.79-2.58-13.77" fill="#393536" fill-rule="evenodd"/>
    <path id="path925" d="M235.84,127.35c5.05-2.17,9.75.62,10.33,5.16,1.16,9.45-12.28,11.17-14.63,4.3-1.54-4.5-.44-7.43,4.31-9.46" fill="#393536" fill-rule="evenodd"/>
    <path id="path927" d="M207.77,164.47c2.86,4.22,6.41,7.69,7.61,13.7,5.48-2.76,7.1-9.7,10.16-15.08-6.66-.12-4.91-9.32-10.16-10.96.27,7.16-4.42,8.94-7.61,12.34M222.51,136.72c-.09,20.66,30,24.15,31.99,2.46,1.22-13.44-7.36-19.72-16.76-18.92-9.97.85-15.18,7.11-15.23,16.45M177.78,130.57c-5.31,18.5,14.86,31.47,26.85,18.22,11.08-12.23-1.09-30.08-13.04-28.99-9.33.84-12.63,6.64-13.81,10.77M262.41,144.82c27.1,45.58,12.88,111.69-30.78,126.56-8.14,2.76-25.43,2.55-34.25-.91-39.99-15.75-54.98-79.39-28.46-124.94-13.5-22,8.14-44.92,31.32-36.39,6.33,2.32,10.04,9.94,15.22,10.02,6.21.12,10.81-9.08,18.07-10.93,21.64-5.54,38.84,13.05,28.88,36.6" fill="#bf202d" fill-rule="evenodd"/>
    <path id="path929" d="M239.34,121.74c-.49,0-.97.02-1.46.06-8.86.75-13.77,6.05-13.82,14.92-.02,4.43,1.48,8.28,4.32,11.14,2.84,2.86,6.85,4.5,10.98,4.5,5.72,0,12.71-3.49,13.61-13.33.51-5.5-.72-10.05-3.54-13.13-2.45-2.68-6.03-4.16-10.08-4.16M239.35,155.46h0c-4.94,0-9.75-1.98-13.17-5.42-3.44-3.45-5.24-8.06-5.22-13.33.06-10.53,6.13-17.09,16.65-17.98,5.58-.46,10.7,1.38,14.09,5.09,3.42,3.74,4.92,9.11,4.33,15.5-1.09,11.9-9.66,16.13-16.68,16.13M192.64,121.29c-.31,0-.61.02-.92.05-8.24.75-11.33,5.66-12.47,9.66-1.66,5.78-.77,11.35,2.5,15.69,2.82,3.74,7.09,5.97,11.43,5.97,3.83,0,7.4-1.7,10.3-4.91,4.19-4.62,5.11-10.63,2.51-16.48-2.6-5.88-8.09-9.98-13.35-9.98M193.18,155.75h0c-5.3,0-10.5-2.7-13.89-7.2-3.81-5.06-4.9-11.77-2.99-18.41,1.15-4.03,4.66-10.94,15.15-11.88,6.81-.62,14.1,4.37,17.37,11.76,3.06,6.91,1.93,14.32-3.05,19.81-3.51,3.88-7.86,5.93-12.59,5.93M209.78,164.65c.41.57.82,1.12,1.23,1.68,2.04,2.73,4.13,5.54,5.33,9.37,2.45-2.01,3.94-5.24,5.5-8.63.43-.93.87-1.9,1.34-2.83-2.87-1.03-4.01-3.83-4.97-6.16-.51-1.25-.95-2.26-1.47-3.02-.69,4.21-3.28,6.41-5.6,8.39-.46.4-.92.79-1.37,1.2M214.25,180.47l-.4-1.99c-.86-4.31-3.02-7.22-5.32-10.3-.69-.93-1.38-1.86-2.05-2.83l-.7-1.03.85-.9c.78-.83,1.64-1.57,2.51-2.31,2.61-2.23,4.87-4.15,4.69-8.91l-.08-2.18,2.08.65c3.09.96,4.23,3.77,5.24,6.25,1.19,2.93,2,4.59,4.48,4.64l2.6.04-1.29,2.26c-.8,1.41-1.53,2.99-2.23,4.51-2.02,4.39-4.11,8.93-8.58,11.18l-1.82.92ZM190.23,108.86c-8.87,0-16.98,4.64-21.16,12.1-4.07,7.27-3.65,15.93,1.15,23.76l.49.79-.46.79c-14.03,24.1-17,55.59-7.76,82.19,6.9,19.85,19.48,34.24,35.45,40.53,4.3,1.7,11.24,2.7,18.55,2.7,5.9,0,11.24-.66,14.64-1.82,16.96-5.77,30.35-19.93,37.7-39.87,10.02-27.19,7.05-59.55-7.75-84.44l-.4-.67.31-.72c3.99-9.43,3.64-18.8-.96-25.74-5.29-8-15.51-11.47-26.11-8.75-3.09.79-5.78,3.17-8.37,5.48-3.04,2.7-6.18,5.5-9.98,5.5-3.51-.06-6.1-2.48-8.84-5.05-2.15-2.01-4.37-4.09-7.02-5.06-3.12-1.16-6.3-1.74-9.46-1.74M216.49,274.82c-7.79,0-14.96-1.06-19.68-2.91-16.82-6.63-30.04-21.68-37.23-42.4-9.43-27.14-6.52-59.22,7.55-83.97-4.95-8.6-5.24-18.06-.74-26.09,4.73-8.44,13.87-13.68,23.86-13.68,3.52,0,7.06.65,10.53,1.92,3.24,1.18,5.81,3.58,8.07,5.71,2.4,2.24,4.47,4.17,6.65,4.21h0c2.71,0,5.29-2.29,8.01-4.72,2.74-2.43,5.84-5.19,9.66-6.17,2.68-.69,5.36-1.03,7.98-1.03,8.99,0,16.81,4.03,21.48,11.08,5.06,7.63,5.61,17.77,1.52,27.93,14.93,25.58,17.84,58.61,7.6,86.42-7.67,20.82-21.74,35.64-39.6,41.73-3.71,1.25-9.41,1.98-15.64,1.98" fill="#fff"/>
  </g>
  <path d="M316.59,2.77q13.76,34.66-5.72,66.47,34.66-13.76,66.47,5.71-13.76-34.66,5.71-66.47-34.66,13.76-66.47-5.71h0ZM100.33,20.95q-12.36,22.03-37.4,25.35,22.03,12.36,25.35,37.4,12.36-22.03,37.4-25.35-22.03-12.36-25.35-37.4ZM380.59,138.26q-.05,25.26-20.28,40.37,25.26.05,40.37,20.28.05-25.26,20.28-40.37-25.26-.05-40.37-20.28ZM187.89,247.36c-1.25.02-2.47.07-3.66.13-19.46,1.03-43.83,8.12-81.07,21.76l-41.58,170.67c82.16-20,139.2-21.13,179-4.45v-174.85c-18.92-8.5-33.28-12.93-48.89-13.25-1.27-.02-2.53-.02-3.8,0h0ZM316.32,258.38c-3.05-.03-6.08.01-8.91.09-13.41.4-28.93,2.14-47.99,4.36v170.87c45.61-7.55,111.85-4.05,179.26,7.3l-41.64-170.93c-37.59-8.07-59.24-11.49-80.72-11.69h0ZM318.71,274.73c19.77.2,38.58,2.67,56.22,4.84l4.64,15.94c-24.89-3.62-69.06-4.73-96.8-.95l-.67-17.18c12.52-2.08,24.73-2.78,36.6-2.66ZM56.5,279.22l-11.11,44.38h25.22l10.81-44.38h-24.92ZM418.58,279.22l41.6,170.77,2.34,9.62,23.65-.15-42.77-180.25h-24.83ZM336.03,335c17.79.03,35.25.76,51.45,2.14l3.69,16.57c-34.17-2.97-75.98-2.79-107.82,0l-.74-16.57c17.52-1.48,35.63-2.17,53.42-2.14h0ZM41.04,340.96l-7.25,28.94h25.54l7.05-28.94h-25.34ZM328.31,367.24c4.87.02,9.93.08,15.41.2l2.67,16.88c-20.91-.45-49.32.54-62.53,1.01l-.73-17.35c17.59-.48,30.56-.8,45.18-.74h0ZM371.73,367.67c8.66.04,17.48.32,25.25.07l2.7,17.11c-9.06-.3-26.03-.8-33.57-.48l-2.94-16.62c2.85-.07,5.7-.09,8.55-.07h0ZM29.44,387.26l-18.83,75.17,26.21-.16,18.27-75.01h-25.65ZM346.81,398.69c20.53,0,40.47.75,59.09,2.48l3.14,20.05c-35.91-4.09-89.77-7.42-124.68-3.13l-.15-17.29c20.96-1.33,42.07-2.11,62.6-2.12h0ZM172.4,441.18c-31.52.09-71.1,6.03-120.81,19.06l-7.56,1.98,196.55-1.23v-6.12c-17-8.88-39.17-13.77-68.18-13.69h0ZM313.1,447.14c-20.55.06-38.85,1.39-53.68,4.03v9.71l185.91-1.16c-46.4-8.33-93.31-12.7-132.23-12.58h0ZM9.23,479.87v17.36h481.54v-17.36H9.23Z" fill="#f1f2f2"/>
</svg>