<svg width="8" height="6" viewBox="0 0 8 6" fill="none" xmlns="http://www.w3.org/2000/svg">
<path d="M0.538289 0.730957H7.46171C7.94067 0.730957 8.18015 1.30948 7.84111 1.64852L4.38075 5.11157C4.17087 5.32146 3.82913 5.32146 3.61925 5.11157L0.158886 1.64852C-0.180154 1.30948 0.0593269 0.730957 0.538289 0.730957Z" fill="#F1F1F1"/>
</svg>
