{
  "work_prop": {
    "_comment": "These are all the headers based on work uri's",
    "base": "?work",
    "cols": {
      "editionNumber_0": {
        "id": "wdt:P393",
        "labeled": "False",
        "combine_cols": "False"
      },
      "literalAuthor": {
        "id": "wdt:P2093",
        "labeled": "False",
        "combine_cols": "False"
      },
      "publicationDate_0": {
        "id": "wdt:P577",
        "labeled": "False",
        "combine_cols": "False"
      },
      "title_0": {
        "id": "wdt:P1476",
        "labeled": "False",
        "combine_cols": "False"
      },
      "instanceOf_0": {
        "id": "wdt:P31",
        "labeled": "True",
        "combine_cols": "True"
      },
      "author_0": {
        "id": "wdt:P50",
        "labeled": "True",
        "combine_cols": "False"
      },
      "creator_0": {
        "id": "wdt:P170",
        "labeled": "True",
        "label": "creatorLabel",
        "combine_cols": "False"
      },
      "countryOfOrigin_0": {
        "id": "wdt:P495",
        "labeled": "True",
        "combine_cols": "True"
      },
      "formatOfCreativeWork_0": {
        "id": "wdt:P7937",
        "labeled": "True",
        "combine_cols": "False"
      },
      "genre_0": {
        "id": "wdt:P136",
        "labeled": "True",
        "combine_cols": "True"
      },
      "languageOfWorkOrName_0": {
        "id": "wdt:P407",
        "labeled": "True",
        "combine_cols": "True"
      },
      "publicationPlace_0": {
        "id": "wdt:Q1361759",
        "labeled": "True",
        "combine_cols": "True"
      },
      "publisher_0": {
        "id": "wdt:P123",
        "labeled": "True",
        "combine_cols": "True"
      }
    }
  },

  "ids": {
    "_comment": "These are all the id based properties of work based URI's",
    "base": "?work",
    "cols": {
      "isbn10_0": {
        "id": "wdt:P957",
        "labeled": "False",
        "combine_cols": "True"
      },
      "isbn13_0": {
        "id": "wdt:P212",
        "labeled": "False",
        "combine_cols": "True"
      },
      "issn_0": {
        "id": "wdt:Q131276",
        "labeled": "False",
        "combine_cols": "True"
      },
      "oclcWorkId_0": {
        "id": "wdt:P5331",
        "labeled": "False",
        "combine_cols": "True"
      },
      "oclcControl_0": {
        "id": "wdt:P243",
        "labeled": "False",
        "combine_cols": "True"
      },
      "viafId_0": {
        "id": "wdt:P214",
        "labeled": "False",
        "combine_cols": "True"
      }
    }
  },

  "author_prop": {
    "_comment": "All the properties for author based URI's",
    "base": "?author",
    "cols": {
      "dateOfBirth": {
        "id": "wdt:P569",
        "labeled": "False",
        "combine_cols": "False"
      },
      "dateOfDeath": {
        "id": "wdt:P570",
        "labeled": "False",
        "combine_cols": "False"
      },
      "nameInNativeLanguage_0": {
        "id": "wdt:P1559",
        "labeled": "False",
        "combine_cols": "False"
      },
      "familyName_0": {
        "id": "wdt:P734",
        "labeled": "True",
        "combine_cols": "False"
      },
      "givenName_0": {
        "id": "wdt:P735",
        "labeled": "True",
        "combine_cols": "False"
      },
      "sexOrGender_0": {
        "id": "wdt:P21",
        "labeled": "True",
        "combine_cols": "False"
      },
      "viafID_0": {
        "id": "wdt:P214",
        "labeled": "False",
        "combine_cols": "False"
      },
      "isni_0": {
        "id": "wdt:P213",
        "labeled": "False",
        "combine_cols": "False"
      }
    }
  }
}
