{
    "__comment1__": "Add any blacklisted content here in lowercase",
    "authors": ["bible", "bible.", "bibel", "bibel.","biblia", "biblia.", "united states.", "united states"],
    "__comment2__": "Add any blacklisted content here as exact match",
    "works": ["Works.", "[without title]"]
}
