{
    "entities": [
        {
            "name": "Charlotte Small",
            "diffbotUri": "https://diffbot.com/entity/EJMcLh-GrMG6UxYCPkMmK3A",
            "confidence": 0.996469,
            "salience": 0.9243562,
            "isCustom": false,
            "allUris": [
                "http://www.wikidata.org/entity/Q5086135"
            ],
            "allTypes": [
                {
                    "name": "person",
                    "diffbotUri": "https://diffbot.com/entity/E4aFoJie0MN6dcs_yDRFwXQ",
                    "dbpediaUri": "http://dbpedia.org/ontology/Person"
                }
            ],
            "mentions": [
                {
                    "text": "Charlotte Small Thompson",
                    "beginOffset": 0,
                    "endOffset": 24,
                    "confidence": 0.996469
                }
            ]
        },
        {
            "name": "David Thompson",
            "diffbotUri": "https://diffbot.com/entity/EENf2xtgzODGwQfkcfKwx4A",
            "confidence": 0.9998524,
            "salience": 0.7292569,
            "isCustom": false,
            "allUris": [
                "http://www.wikidata.org/entity/Q763043"
            ],
            "allTypes": [
                {
                    "name": "person",
                    "diffbotUri": "https://diffbot.com/entity/E4aFoJie0MN6dcs_yDRFwXQ",
                    "dbpediaUri": "http://dbpedia.org/ontology/Person"
                }
            ],
            "mentions": [
                {
                    "text": "David Thompson",
                    "beginOffset": 150,
                    "endOffset": 164,
                    "confidence": 0.99969316
                },
                {
                    "text": "David",
                    "beginOffset": 202,
                    "endOffset": 207,
                    "confidence": 0.9988305
                },
                {
                    "text": "he",
                    "beginOffset": 270,
                    "endOffset": 272,
                    "isPronoun": true,
                    "confidence": 0.9997017
                },
                {
                    "text": "him",
                    "beginOffset": 512,
                    "endOffset": 515,
                    "isPronoun": true,
                    "confidence": 0.9997477
                },
                {
                    "text": "David",
                    "beginOffset": 543,
                    "endOffset": 548,
                    "confidence": 0.9985769
                },
                {
                    "text": "he",
                    "beginOffset": 562,
                    "endOffset": 564,
                    "isPronoun": true,
                    "confidence": 0.9996124
                },
                {
                    "text": "his",
                    "beginOffset": 589,
                    "endOffset": 592,
                    "isPronoun": true,
                    "confidence": 0.9998524
                },
                {
                    "text": "David",
                    "beginOffset": 804,
                    "endOffset": 809,
                    "confidence": 0.9992323
                },
                {
                    "text": "David",
                    "beginOffset": 920,
                    "endOffset": 925,
                    "confidence": 0.99791735
                },
                {
                    "text": "He",
                    "beginOffset": 1141,
                    "endOffset": 1143,
                    "isPronoun": true,
                    "confidence": 0.99890816
                },
                {
                    "text": "David",
                    "beginOffset": 1214,
                    "endOffset": 1219,
                    "confidence": 0.99868923
                },
                {
                    "text": "he",
                    "beginOffset": 1234,
                    "endOffset": 1236,
                    "isPronoun": true,
                    "confidence": 0.99966574
                }
            ]
        },
        {
            "name": "leather",
            "diffbotUri": "https://diffbot.com/entity/EBR9ATr5wMwagZ1f9P2ayOw",
            "confidence": 0.90087557,
            "salience": 0.5137856,
            "isCustom": false,
            "allUris": [
                "http://www.wikidata.org/entity/Q286"
            ],
            "allTypes": [
                {
                    "name": "skill",
                    "diffbotUri": "https://diffbot.com/entity/EvfbHngnSNVOh7ZBM5XTywQ"
                },
                {
                    "name": "product",
                    "diffbotUri": "https://diffbot.com/entity/EgSPUye7QPcyQoPylO8biMQ"
                }
            ],
            "mentions": [
                {
                    "text": "leather",
                    "beginOffset": 82,
                    "endOffset": 89,
                    "confidence": 0.90087557
                }
            ]
        },
        {
            "name": "birch bark",
            "diffbotUri": "https://diffbot.com/entity/EEaC-om_-PfSCp0WM16ljSQ",
            "confidence": 0.87890476,
            "salience": 0.50567114,
            "isCustom": false,
            "allUris": [
                "http://www.wikidata.org/entity/Q253671"
            ],
            "allTypes": [
                {
                    "name": "skill",
                    "diffbotUri": "https://diffbot.com/entity/EvfbHngnSNVOh7ZBM5XTywQ"
                },
                {
                    "name": "product",
                    "diffbotUri": "https://diffbot.com/entity/EgSPUye7QPcyQoPylO8biMQ"
                },
                {
                    "name": "tool",
                    "diffbotUri": "https://diffbot.com/entity/EKvoYuTx4P9WT35YUouc0ug"
                },
                {
                    "name": "field of work",
                    "diffbotUri": "https://diffbot.com/entity/EjGOLMsQZOGSg549SwYfFyQ"
                },
                {
                    "name": "industry",
                    "diffbotUri": "https://diffbot.com/entity/EQbug06rNN8i5GW_tCDs0aA"
                },
                {
                    "name": "technology",
                    "diffbotUri": "https://diffbot.com/entity/E-5jnlQEGOt2x8rdkkht1NQ"
                }
            ],
            "mentions": [
                {
                    "text": "birch bark",
                    "beginOffset": 452,
                    "endOffset": 462,
                    "confidence": 0.87890476
                }
            ]
        },
        {
            "name": "skill",
            "diffbotUri": "https://diffbot.com/entity/EvfbHngnSNVOh7ZBM5XTywQ",
            "confidence": 0.58151454,
            "salience": 0.34264222,
            "isCustom": false,
            "allUris": [
                "http://www.wikidata.org/entity/Q205961"
            ],
            "allTypes": [],
            "mentions": [
                {
                    "text": "skills",
                    "beginOffset": 37,
                    "endOffset": 43,
                    "confidence": 0.58151454
                }
            ]
        },
        {
            "name": "trap",
            "diffbotUri": "https://diffbot.com/entity/EEkBu1Ac0N0mUf8AHWcpSRA",
            "confidence": 0.7274333,
            "salience": 0.28461146,
            "isCustom": false,
            "allUris": [
                "http://www.wikidata.org/entity/Q34168"
            ],
            "allTypes": [
                {
                    "name": "job title",
                    "diffbotUri": "https://diffbot.com/entity/E_E130Nm6M6OXvI6hVras_g"
                },
                {
                    "name": "skill",
                    "diffbotUri": "https://diffbot.com/entity/EvfbHngnSNVOh7ZBM5XTywQ"
                },
                {
                    "name": "award",
                    "diffbotUri": "https://diffbot.com/entity/EgXqbw14CORSyFpZeczosiQ",
                    "dbpediaUri": "http://dbpedia.org/ontology/Award"
                },
                {
                    "name": "occupation",
                    "diffbotUri": "https://diffbot.com/entity/ErZNo5eLfM4mNIiqiMORbhA",
                    "dbpediaUri": "http://dbpedia.org/ontology/Profession"
                }
            ],
            "mentions": [
                {
                    "text": "trapping",
                    "beginOffset": 47,
                    "endOffset": 55,
                    "confidence": 0.7274333
                }
            ]
        },
        {
            "name": "harvest",
            "diffbotUri": "https://diffbot.com/entity/E1sF14s5XNqmFSmuDX-YxoQ",
            "confidence": 0.91999966,
            "salience": 0.26390243,
            "isCustom": false,
            "allUris": [
                "http://www.wikidata.org/entity/Q213753"
            ],
            "allTypes": [],
            "mentions": [
                {
                    "text": "harvest",
                    "beginOffset": 708,
                    "endOffset": 715,
                    "confidence": 0.91999966
                }
            ]
        },
        {
            "name": "Martes",
            "diffbotUri": "https://diffbot.com/entity/ExYLc7I1fMSilGqfWEU5scQ",
            "confidence": 0.81642526,
            "salience": 0.2583826,
            "isCustom": false,
            "allUris": [
                "http://www.wikidata.org/entity/Q26533"
            ],
            "allTypes": [],
            "mentions": [
                {
                    "text": "marten",
                    "beginOffset": 572,
                    "endOffset": 578,
                    "confidence": 0.81642526
                },
                {
                    "text": "marten",
                    "beginOffset": 654,
                    "endOffset": 660,
                    "confidence": 0.81642526
                }
            ]
        },
        {
            "name": "rabbit",
            "diffbotUri": "https://diffbot.com/entity/EYvZkWSErNhmwN5wRwZYhqw",
            "confidence": 0.9052856,
            "salience": 0.22018525,
            "isCustom": false,
            "allUris": [
                "http://www.wikidata.org/entity/Q9394"
            ],
            "allTypes": [],
            "mentions": [
                {
                    "text": "rabbits",
                    "beginOffset": 297,
                    "endOffset": 304,
                    "confidence": 0.9052856
                },
                {
                    "text": "rabbit",
                    "beginOffset": 332,
                    "endOffset": 338,
                    "confidence": 0.9052856
                }
            ]
        },
        {
            "name": "clothing",
            "diffbotUri": "https://diffbot.com/entity/EHYiQnn-mMQGeLS2xqwqprA",
            "confidence": 0.79660773,
            "salience": 0.1628474,
            "isCustom": false,
            "allUris": [
                "http://www.wikidata.org/entity/Q11460"
            ],
            "allTypes": [
                {
                    "name": "skill",
                    "diffbotUri": "https://diffbot.com/entity/EvfbHngnSNVOh7ZBM5XTywQ"
                },
                {
                    "name": "product",
                    "diffbotUri": "https://diffbot.com/entity/EgSPUye7QPcyQoPylO8biMQ"
                }
            ],
            "mentions": [
                {
                    "text": "clothing",
                    "beginOffset": 90,
                    "endOffset": 98,
                    "confidence": 0.79660773
                }
            ]
        },
        {
            "name": "container",
            "diffbotUri": "https://diffbot.com/entity/EfXb6SpymMvy3dkdiN4ArtA",
            "confidence": 0.6871464,
            "salience": 0.11588267,
            "isCustom": false,
            "allUris": [
                "http://www.wikidata.org/entity/Q987767"
            ],
            "allTypes": [
                {
                    "name": "skill",
                    "diffbotUri": "https://diffbot.com/entity/EvfbHngnSNVOh7ZBM5XTywQ"
                },
                {
                    "name": "product",
                    "diffbotUri": "https://diffbot.com/entity/EgSPUye7QPcyQoPylO8biMQ"
                },
                {
                    "name": "tool",
                    "diffbotUri": "https://diffbot.com/entity/EKvoYuTx4P9WT35YUouc0ug"
                }
            ],
            "mentions": [
                {
                    "text": "containers",
                    "beginOffset": 463,
                    "endOffset": 473,
                    "confidence": 0.6871464
                }
            ]
        },
        {
            "name": "Manito",
            "diffbotUri": "https://diffbot.com/entity/Erf5N8ZToNXWW-V6rYHk3Yw",
            "confidence": 0.7124001,
            "salience": 0.10458348,
            "isCustom": false,
            "allUris": [
                "http://www.wikidata.org/entity/Q2180129"
            ],
            "allTypes": [
                {
                    "name": "location",
                    "diffbotUri": "https://diffbot.com/entity/EiCyWUm4lNziqgLHx47iAIQ",
                    "dbpediaUri": "http://dbpedia.org/ontology/Place"
                },
                {
                    "name": "administrative area",
                    "diffbotUri": "https://diffbot.com/entity/EcTIu1tWKPouIa6qZtSpc4A",
                    "dbpediaUri": "http://dbpedia.org/ontology/PopulatedPlace"
                }
            ],
            "mentions": [
                {
                    "text": "Manito",
                    "beginOffset": 767,
                    "endOffset": 773,
                    "confidence": 0.7124001
                }
            ],
            "location": {
                "latitude": 40.4225,
                "longitude": -89.78,
                "precision": 1.4142135
            }
        },
        {
            "name": "ribbon",
            "diffbotUri": "https://diffbot.com/entity/Ew8Cc7afiO8i6Me3gbt02ww",
            "confidence": 0.7175822,
            "salience": 0.10287893,
            "isCustom": false,
            "allUris": [
                "http://www.wikidata.org/entity/Q6918773"
            ],
            "allTypes": [
                {
                    "name": "skill",
                    "diffbotUri": "https://diffbot.com/entity/EvfbHngnSNVOh7ZBM5XTywQ"
                },
                {
                    "name": "product",
                    "diffbotUri": "https://diffbot.com/entity/EgSPUye7QPcyQoPylO8biMQ"
                }
            ],
            "mentions": [
                {
                    "text": "ribbons",
                    "beginOffset": 530,
                    "endOffset": 537,
                    "confidence": 0.7175822
                }
            ]
        },
        {
            "name": "canoe",
            "diffbotUri": "https://diffbot.com/entity/EdCIgnmZHNIWOjr89tBQhnA",
            "confidence": 0.7383164,
            "salience": 0.10090094,
            "isCustom": false,
            "allUris": [
                "http://www.wikidata.org/entity/Q171529"
            ],
            "allTypes": [
                {
                    "name": "skill",
                    "diffbotUri": "https://diffbot.com/entity/EvfbHngnSNVOh7ZBM5XTywQ"
                },
                {
                    "name": "product",
                    "diffbotUri": "https://diffbot.com/entity/EgSPUye7QPcyQoPylO8biMQ"
                },
                {
                    "name": "tool",
                    "diffbotUri": "https://diffbot.com/entity/EKvoYuTx4P9WT35YUouc0ug"
                },
                {
                    "name": "vehicle",
                    "diffbotUri": "https://diffbot.com/entity/E4vBDPVu3OTq90vd1GhX5mw",
                    "dbpediaUri": "http://dbpedia.org/ontology/MeanOfTransportation"
                }
            ],
            "mentions": [
                {
                    "text": "canoes",
                    "beginOffset": 478,
                    "endOffset": 484,
                    "confidence": 0.7383164
                }
            ]
        },
        {
            "name": "Pelts",
            "diffbotUri": "https://diffbot.com/entity/E2DIhQyRANDe8XwJLqva7oA",
            "confidence": 0.5541011,
            "salience": 0.08927506,
            "isCustom": false,
            "allUris": [
                "http://www.wikidata.org/entity/Q16744176"
            ],
            "allTypes": [
                {
                    "name": "skill",
                    "diffbotUri": "https://diffbot.com/entity/EvfbHngnSNVOh7ZBM5XTywQ"
                },
                {
                    "name": "product",
                    "diffbotUri": "https://diffbot.com/entity/EgSPUye7QPcyQoPylO8biMQ"
                },
                {
                    "name": "creative work",
                    "diffbotUri": "https://diffbot.com/entity/EnuIck9oSO_2b9wNK6CD3Vw",
                    "dbpediaUri": "http://dbpedia.org/ontology/Work"
                },
                {
                    "name": "audiovisual work",
                    "diffbotUri": "https://diffbot.com/entity/EXLWLJXi5PeqBkmK1EIblvA"
                }
            ],
            "mentions": [
                {
                    "text": "pelts",
                    "beginOffset": 68,
                    "endOffset": 73,
                    "confidence": 0.5541011
                }
            ]
        },
        {
            "name": "pragmatism",
            "diffbotUri": "https://diffbot.com/entity/ECdzvaquFMqOEyn8bC8ugJw",
            "confidence": 0.550468,
            "salience": 0.08182814,
            "isCustom": false,
            "allUris": [
                "http://www.wikidata.org/entity/Q126692"
            ],
            "allTypes": [
                {
                    "name": "skill",
                    "diffbotUri": "https://diffbot.com/entity/EvfbHngnSNVOh7ZBM5XTywQ"
                },
                {
                    "name": "field of work",
                    "diffbotUri": "https://diffbot.com/entity/EjGOLMsQZOGSg549SwYfFyQ"
                }
            ],
            "mentions": [
                {
                    "text": "practical",
                    "beginOffset": 27,
                    "endOffset": 36,
                    "confidence": 0.550468
                }
            ]
        },
        {
            "name": "skin",
            "diffbotUri": "https://diffbot.com/entity/EImI4HAstOFe2q0NWw1zTIQ",
            "confidence": 0.85778606,
            "salience": 0.07709154,
            "isCustom": false,
            "allUris": [
                "http://www.wikidata.org/entity/Q1074"
            ],
            "allTypes": [
                {
                    "name": "skill",
                    "diffbotUri": "https://diffbot.com/entity/EvfbHngnSNVOh7ZBM5XTywQ"
                },
                {
                    "name": "product",
                    "diffbotUri": "https://diffbot.com/entity/EgSPUye7QPcyQoPylO8biMQ"
                }
            ],
            "mentions": [
                {
                    "text": "skin",
                    "beginOffset": 339,
                    "endOffset": 343,
                    "confidence": 0.85778606
                }
            ]
        },
        {
            "name": "survival skill",
            "diffbotUri": "https://diffbot.com/entity/ErGY3VYmHOviyqMK6pJIwhw",
            "confidence": 0.6076475,
            "salience": 0.07451945,
            "isCustom": false,
            "allUris": [
                "http://www.wikidata.org/entity/Q891382"
            ],
            "allTypes": [
                {
                    "name": "skill",
                    "diffbotUri": "https://diffbot.com/entity/EvfbHngnSNVOh7ZBM5XTywQ"
                }
            ],
            "mentions": [
                {
                    "text": "survival",
                    "beginOffset": 192,
                    "endOffset": 200,
                    "confidence": 0.6076475
                }
            ]
        },
        {
            "name": "knowledge",
            "diffbotUri": "https://diffbot.com/entity/ENtGHLpXaNEG4lGMMh9nvGA",
            "confidence": 0.60351086,
            "salience": 0.06296088,
            "isCustom": false,
            "allUris": [
                "http://www.wikidata.org/entity/Q9081"
            ],
            "allTypes": [],
            "mentions": [
                {
                    "text": "knowledge",
                    "beginOffset": 866,
                    "endOffset": 875,
                    "confidence": 0.60351086
                }
            ]
        },
        {
            "name": "family",
            "diffbotUri": "https://diffbot.com/entity/EHkQcPi5PPOWL50WRi8o0Dw",
            "confidence": 0.82308644,
            "salience": 0.060320824,
            "isCustom": false,
            "allUris": [
                "http://www.wikidata.org/entity/Q8436"
            ],
            "allTypes": [],
            "mentions": [
                {
                    "text": "family",
                    "beginOffset": 183,
                    "endOffset": 189,
                    "confidence": 0.82308644
                }
            ]
        },
        {
            "name": "bead",
            "diffbotUri": "https://diffbot.com/entity/Eg3QLs5hDNy-hwgofZ0KdcQ",
            "confidence": 0.78825855,
            "salience": 0.059744295,
            "isCustom": false,
            "allUris": [
                "http://www.wikidata.org/entity/Q1053956"
            ],
            "allTypes": [
                {
                    "name": "skill",
                    "diffbotUri": "https://diffbot.com/entity/EvfbHngnSNVOh7ZBM5XTywQ"
                },
                {
                    "name": "product",
                    "diffbotUri": "https://diffbot.com/entity/EgSPUye7QPcyQoPylO8biMQ"
                }
            ],
            "mentions": [
                {
                    "text": "beads",
                    "beginOffset": 520,
                    "endOffset": 525,
                    "confidence": 0.78825855
                }
            ]
        },
        {
            "name": "woman",
            "diffbotUri": "https://diffbot.com/entity/EarKeU369M_KE6n-Adetk5g",
            "confidence": 0.8782818,
            "salience": 0.04958265,
            "isCustom": false,
            "allUris": [
                "http://www.wikidata.org/entity/Q467"
            ],
            "allTypes": [],
            "mentions": [
                {
                    "text": "women",
                    "beginOffset": 376,
                    "endOffset": 381,
                    "confidence": 0.8782818
                },
                {
                    "text": "women",
                    "beginOffset": 500,
                    "endOffset": 505,
                    "confidence": 0.8782818
                },
                {
                    "text": "women",
                    "beginOffset": 630,
                    "endOffset": 635,
                    "confidence": 0.8782818
                }
            ]
        },
        {
            "name": "hide",
            "diffbotUri": "https://diffbot.com/entity/EbW3BpqPENc-sYaoSKx1IPw",
            "confidence": 0.5865925,
            "salience": 0.04805184,
            "isCustom": false,
            "allUris": [
                "http://www.wikidata.org/entity/Q3291230"
            ],
            "allTypes": [
                {
                    "name": "skill",
                    "diffbotUri": "https://diffbot.com/entity/EvfbHngnSNVOh7ZBM5XTywQ"
                },
                {
                    "name": "product",
                    "diffbotUri": "https://diffbot.com/entity/EgSPUye7QPcyQoPylO8biMQ"
                }
            ],
            "mentions": [
                {
                    "text": "skins",
                    "beginOffset": 579,
                    "endOffset": 584,
                    "confidence": 0.5865925
                }
            ]
        },
        {
            "name": "trade",
            "diffbotUri": "https://diffbot.com/entity/EjyPchXB7NFmrdvafC0O9ZQ",
            "confidence": 0.7547206,
            "salience": 0.047779772,
            "isCustom": false,
            "allUris": [
                "http://www.wikidata.org/entity/Q601401"
            ],
            "allTypes": [],
            "mentions": [
                {
                    "text": "trading",
                    "beginOffset": 593,
                    "endOffset": 600,
                    "confidence": 0.7547206
                }
            ]
        },
        {
            "name": "fish trap",
            "diffbotUri": "https://diffbot.com/entity/EUqrurmiXNg26evZ_VGmEPw",
            "confidence": 0.5865163,
            "salience": 0.043896876,
            "isCustom": false,
            "allUris": [
                "http://www.wikidata.org/entity/Q952443"
            ],
            "allTypes": [
                {
                    "name": "skill",
                    "diffbotUri": "https://diffbot.com/entity/EvfbHngnSNVOh7ZBM5XTywQ"
                },
                {
                    "name": "product",
                    "diffbotUri": "https://diffbot.com/entity/EgSPUye7QPcyQoPylO8biMQ"
                },
                {
                    "name": "tool",
                    "diffbotUri": "https://diffbot.com/entity/EKvoYuTx4P9WT35YUouc0ug"
                }
            ],
            "mentions": [
                {
                    "text": "traps",
                    "beginOffset": 661,
                    "endOffset": 666,
                    "confidence": 0.5865163
                }
            ]
        },
        {
            "name": "food",
            "diffbotUri": "https://diffbot.com/entity/Ev7QpgC1lMlync_vzVa2flg",
            "confidence": 0.8434055,
            "salience": 0.043592844,
            "isCustom": false,
            "allUris": [
                "http://www.wikidata.org/entity/Q2095"
            ],
            "allTypes": [
                {
                    "name": "skill",
                    "diffbotUri": "https://diffbot.com/entity/EvfbHngnSNVOh7ZBM5XTywQ"
                },
                {
                    "name": "product",
                    "diffbotUri": "https://diffbot.com/entity/EgSPUye7QPcyQoPylO8biMQ"
                }
            ],
            "mentions": [
                {
                    "text": "foods",
                    "beginOffset": 115,
                    "endOffset": 120,
                    "confidence": 0.8434055
                },
                {
                    "text": "food",
                    "beginOffset": 314,
                    "endOffset": 318,
                    "confidence": 0.8434055
                }
            ]
        },
        {
            "name": "Europe",
            "diffbotUri": "https://diffbot.com/entity/EwQGDALmEN4qSFSO47GqqGQ",
            "confidence": 0.867264,
            "salience": 0.035124492,
            "isCustom": false,
            "allUris": [
                "http://www.wikidata.org/entity/Q46"
            ],
            "allTypes": [
                {
                    "name": "location",
                    "diffbotUri": "https://diffbot.com/entity/EiCyWUm4lNziqgLHx47iAIQ",
                    "dbpediaUri": "http://dbpedia.org/ontology/Place"
                }
            ],
            "mentions": [
                {
                    "text": "European",
                    "beginOffset": 1001,
                    "endOffset": 1009,
                    "confidence": 0.867264
                }
            ],
            "location": {
                "latitude": 48.69096,
                "longitude": 9.14062,
                "precision": 3191.5513
            }
        },
        {
            "name": "linguistics",
            "diffbotUri": "https://diffbot.com/entity/E1-y0Nm3OMbWLOSEVPR17IA",
            "confidence": 0.5836271,
            "salience": 0.03418917,
            "isCustom": false,
            "allUris": [
                "http://www.wikidata.org/entity/Q8162"
            ],
            "allTypes": [
                {
                    "name": "skill",
                    "diffbotUri": "https://diffbot.com/entity/EvfbHngnSNVOh7ZBM5XTywQ"
                },
                {
                    "name": "academic major",
                    "diffbotUri": "https://diffbot.com/entity/EOrH5adeiOXmszdCGT-9vZg"
                },
                {
                    "name": "field of work",
                    "diffbotUri": "https://diffbot.com/entity/EjGOLMsQZOGSg549SwYfFyQ"
                }
            ],
            "mentions": [
                {
                    "text": "linguistic",
                    "beginOffset": 842,
                    "endOffset": 852,
                    "confidence": 0.5836271
                }
            ]
        },
        {
            "name": "Cree",
            "diffbotUri": "https://diffbot.com/entity/EZvGxGN5sOlqTQZNBEduRCw",
            "confidence": 0.9049328,
            "salience": 0.033970825,
            "isCustom": false,
            "allUris": [
                "http://www.wikidata.org/entity/Q117191"
            ],
            "allTypes": [
                {
                    "name": "ethnic group",
                    "diffbotUri": "https://diffbot.com/entity/EypvmWDFPN_W_JvMrptC4Fw",
                    "dbpediaUri": "http://dbpedia.org/ontology/EthnicGroup"
                }
            ],
            "mentions": [
                {
                    "text": "Cree",
                    "beginOffset": 957,
                    "endOffset": 961,
                    "confidence": 0.9049328
                }
            ]
        },
        {
            "name": "French Canadians",
            "diffbotUri": "https://diffbot.com/entity/E-4BvE3KQOfO8s-XutlwiXQ",
            "confidence": 0.83823293,
            "salience": 0.032708593,
            "isCustom": false,
            "allUris": [
                "http://www.wikidata.org/entity/Q857880"
            ],
            "allTypes": [
                {
                    "name": "ethnic group",
                    "diffbotUri": "https://diffbot.com/entity/EypvmWDFPN_W_JvMrptC4Fw",
                    "dbpediaUri": "http://dbpedia.org/ontology/EthnicGroup"
                }
            ],
            "mentions": [
                {
                    "text": "French Canadian",
                    "beginOffset": 1110,
                    "endOffset": 1125,
                    "confidence": 0.83823293
                }
            ]
        },
        {
            "name": "evening",
            "diffbotUri": "https://diffbot.com/entity/ERDnABD_8O7uSZEYZgRF_og",
            "confidence": 0.6652883,
            "salience": 0.025012344,
            "isCustom": false,
            "allUris": [
                "http://www.wikidata.org/entity/Q7725"
            ],
            "allTypes": [],
            "mentions": [
                {
                    "text": "evening",
                    "beginOffset": 673,
                    "endOffset": 680,
                    "confidence": 0.6652883
                }
            ]
        },
        {
            "name": "culture",
            "diffbotUri": "https://diffbot.com/entity/E1mMkUCibORenWSDhtR9C2A",
            "confidence": 0.64538556,
            "salience": 0.020424241,
            "isCustom": false,
            "allUris": [
                "http://www.wikidata.org/entity/Q11042"
            ],
            "allTypes": [],
            "mentions": [
                {
                    "text": "cultural",
                    "beginOffset": 857,
                    "endOffset": 865,
                    "confidence": 0.64538556
                }
            ]
        },
        {
            "name": "sodium",
            "diffbotUri": "https://diffbot.com/entity/EKinukS1zOrKwMhMt1Zw4Ug",
            "confidence": 0.5868777,
            "salience": 0.020268764,
            "isCustom": false,
            "allUris": [
                "http://www.wikidata.org/entity/Q658"
            ],
            "allTypes": [
                {
                    "name": "skill",
                    "diffbotUri": "https://diffbot.com/entity/EvfbHngnSNVOh7ZBM5XTywQ"
                },
                {
                    "name": "product",
                    "diffbotUri": "https://diffbot.com/entity/EgSPUye7QPcyQoPylO8biMQ"
                }
            ],
            "mentions": [
                {
                    "text": "Na",
                    "beginOffset": 1271,
                    "endOffset": 1273,
                    "confidence": 0.5868777
                }
            ]
        },
        {
            "name": "root",
            "diffbotUri": "https://diffbot.com/entity/Ehqs4CftyN9SY8kiJkEakpw",
            "confidence": 0.5768715,
            "salience": 0.011269345,
            "isCustom": false,
            "allUris": [
                "http://www.wikidata.org/entity/Q111029"
            ],
            "allTypes": [],
            "mentions": [
                {
                    "text": "roots",
                    "beginOffset": 412,
                    "endOffset": 417,
                    "confidence": 0.5768715
                }
            ]
        },
        {
            "name": "ceremony",
            "diffbotUri": "https://diffbot.com/entity/E6wp5NvhcOke6T4pzfrhT6Q",
            "confidence": 0.7066495,
            "salience": 0.008969043,
            "isCustom": false,
            "allUris": [
                "http://www.wikidata.org/entity/Q2627975"
            ],
            "allTypes": [
                {
                    "name": "event",
                    "diffbotUri": "https://diffbot.com/entity/ERNUaoRZ5MSSJKx-s-xTYOA",
                    "dbpediaUri": "http://dbpedia.org/ontology/Event"
                }
            ],
            "mentions": [
                {
                    "text": "ceremonies",
                    "beginOffset": 962,
                    "endOffset": 972,
                    "confidence": 0.7066495
                }
            ]
        },
        {
            "name": "customs agency",
            "diffbotUri": "https://diffbot.com/entity/EbLohUck2NT60zokjb-elBw",
            "confidence": 0.64090633,
            "salience": 0.008318786,
            "isCustom": false,
            "allUris": [
                "http://www.wikidata.org/entity/Q182290"
            ],
            "allTypes": [],
            "mentions": [
                {
                    "text": "customs",
                    "beginOffset": 977,
                    "endOffset": 984,
                    "confidence": 0.64090633
                }
            ]
        },
        {
            "name": "blood",
            "diffbotUri": "https://diffbot.com/entity/EH5fs7eZYOVWfCtB7IEzIKg",
            "confidence": 0.6278605,
            "salience": 0.007738262,
            "isCustom": false,
            "allUris": [
                "http://www.wikidata.org/entity/Q7873"
            ],
            "allTypes": [
                {
                    "name": "skill",
                    "diffbotUri": "https://diffbot.com/entity/EvfbHngnSNVOh7ZBM5XTywQ"
                },
                {
                    "name": "product",
                    "diffbotUri": "https://diffbot.com/entity/EgSPUye7QPcyQoPylO8biMQ"
                },
                {
                    "name": "chemical substance",
                    "diffbotUri": "https://diffbot.com/entity/EWoN2n2ONOdagFVW6xhD0aA",
                    "dbpediaUri": "http://dbpedia.org/ontology/ChemicalSubstance"
                }
            ],
            "mentions": [
                {
                    "text": "blood",
                    "beginOffset": 1399,
                    "endOffset": 1404,
                    "confidence": 0.6278605
                }
            ]
        },
        {
            "name": "language",
            "diffbotUri": "https://diffbot.com/entity/EZLUv8RZWNw62dTgKTTa7JQ",
            "confidence": 0.62941647,
            "salience": 0.006134125,
            "isCustom": false,
            "allUris": [
                "http://www.wikidata.org/entity/Q315"
            ],
            "allTypes": [],
            "mentions": [
                {
                    "text": "language",
                    "beginOffset": 1154,
                    "endOffset": 1162,
                    "confidence": 0.62941647
                },
                {
                    "text": "language",
                    "beginOffset": 1437,
                    "endOffset": 1445,
                    "confidence": 0.62941647
                }
            ]
        },
        {
            "name": "English",
            "diffbotUri": "https://diffbot.com/entity/EfkXmX7NUMlCky37jTQU11w",
            "confidence": 0.6001634,
            "salience": 0.0056981593,
            "isCustom": false,
            "allUris": [
                "http://www.wikidata.org/entity/Q1860"
            ],
            "allTypes": [
                {
                    "name": "skill",
                    "diffbotUri": "https://diffbot.com/entity/EvfbHngnSNVOh7ZBM5XTywQ"
                },
                {
                    "name": "product",
                    "diffbotUri": "https://diffbot.com/entity/EgSPUye7QPcyQoPylO8biMQ"
                },
                {
                    "name": "human language",
                    "diffbotUri": "https://diffbot.com/entity/Es1wbGCl4NWSPTGYmIEhJLw",
                    "dbpediaUri": "http://dbpedia.org/ontology/Language"
                }
            ],
            "mentions": [
                {
                    "text": "english language",
                    "beginOffset": 1472,
                    "endOffset": 1488,
                    "confidence": 0.6001634
                }
            ]
        },
        {
            "name": "work",
            "diffbotUri": "https://diffbot.com/entity/ESlTO-lHDN_G7mjAI9Z9XZw",
            "confidence": 0.6521455,
            "salience": 0.0043912777,
            "isCustom": false,
            "allUris": [
                "http://www.wikidata.org/entity/Q42213"
            ],
            "allTypes": [],
            "mentions": [
                {
                    "text": "work",
                    "beginOffset": 167,
                    "endOffset": 171,
                    "confidence": 0.6521455
                }
            ]
        },
        {
            "name": "merchant",
            "diffbotUri": "https://diffbot.com/entity/EbM9N4lSTPDGPC3HxJrXtwg",
            "confidence": 0.5852326,
            "salience": 0.004118791,
            "isCustom": false,
            "allUris": [
                "http://www.wikidata.org/entity/Q215536"
            ],
            "allTypes": [
                {
                    "name": "job title",
                    "diffbotUri": "https://diffbot.com/entity/E_E130Nm6M6OXvI6hVras_g"
                },
                {
                    "name": "award",
                    "diffbotUri": "https://diffbot.com/entity/EgXqbw14CORSyFpZeczosiQ",
                    "dbpediaUri": "http://dbpedia.org/ontology/Award"
                },
                {
                    "name": "occupation",
                    "diffbotUri": "https://diffbot.com/entity/ErZNo5eLfM4mNIiqiMORbhA",
                    "dbpediaUri": "http://dbpedia.org/ontology/Profession"
                }
            ],
            "mentions": [
                {
                    "text": "traders",
                    "beginOffset": 1010,
                    "endOffset": 1017,
                    "confidence": 0.5852326
                }
            ]
        },
        {
            "name": "wife",
            "diffbotUri": "https://diffbot.com/entity/Eyue-6UDzPNWywh1x90pqbA",
            "confidence": 0.68383497,
            "salience": 0.0026218672,
            "isCustom": false,
            "allUris": [
                "http://www.wikidata.org/entity/Q188830"
            ],
            "allTypes": [],
            "mentions": [
                {
                    "text": "Wife",
                    "beginOffset": 1384,
                    "endOffset": 1388,
                    "confidence": 0.68383497
                }
            ]
        },
        {
            "name": "people",
            "diffbotUri": "https://diffbot.com/entity/EBUIavfDvPtivJhJosN9a9A",
            "confidence": 0.69709647,
            "salience": 0.00065269193,
            "isCustom": false,
            "allUris": [
                "http://www.wikidata.org/entity/Q2472587"
            ],
            "allTypes": [],
            "mentions": [
                {
                    "text": "people",
                    "beginOffset": 1048,
                    "endOffset": 1054,
                    "confidence": 0.69709647
                },
                {
                    "text": "people",
                    "beginOffset": 1414,
                    "endOffset": 1420,
                    "confidence": 0.69709647
                }
            ]
        },
        {
            "name": "Charlotte",
            "confidence": 0.9996164,
            "salience": 0.36664796,
            "isCustom": false,
            "allUris": [],
            "allTypes": [
                {
                    "name": "person",
                    "diffbotUri": "https://diffbot.com/entity/E4aFoJie0MN6dcs_yDRFwXQ",
                    "dbpediaUri": "http://dbpedia.org/ontology/Person"
                }
            ],
            "mentions": [
                {
                    "text": "Charlotte",
                    "beginOffset": 830,
                    "endOffset": 839,
                    "confidence": 0.9918996
                },
                {
                    "text": "She",
                    "beginOffset": 893,
                    "endOffset": 896,
                    "isPronoun": true,
                    "confidence": 0.9984144
                },
                {
                    "text": "her",
                    "beginOffset": 901,
                    "endOffset": 904,
                    "isPronoun": true,
                    "confidence": 0.9995733
                },
                {
                    "text": "He",
                    "beginOffset": 1028,
                    "endOffset": 1030,
                    "isPronoun": true,
                    "confidence": 0.99919087
                },
                {
                    "text": "her",
                    "beginOffset": 1044,
                    "endOffset": 1047,
                    "isPronoun": true,
                    "confidence": 0.9996164
                }
            ]
        },
        {
            "name": "1",
            "confidence": 0.93753695,
            "salience": 0.0,
            "isCustom": false,
            "allUris": [],
            "allTypes": [
                {
                    "name": "number",
                    "diffbotUri": "https://diffbot.com/entity/E7TnJgFyiMYqQUg3cvm8I3g"
                }
            ],
            "mentions": [
                {
                    "text": "One",
                    "beginOffset": 486,
                    "endOffset": 489,
                    "confidence": 0.93753695
                }
            ]
        },
        {
            "name": "Krees",
            "confidence": 0.82249284,
            "salience": 0.0,
            "isCustom": false,
            "allUris": [],
            "allTypes": [
                {
                    "name": "person",
                    "diffbotUri": "https://diffbot.com/entity/E4aFoJie0MN6dcs_yDRFwXQ",
                    "dbpediaUri": "http://dbpedia.org/ontology/Person"
                }
            ],
            "mentions": [
                {
                    "text": "Krees",
                    "beginOffset": 1092,
                    "endOffset": 1097,
                    "confidence": 0.82249284
                }
            ]
        },
        {
            "name": "1847",
            "confidence": 0.7232269,
            "salience": 0.0,
            "isCustom": false,
            "allUris": [],
            "allTypes": [
                {
                    "name": "date",
                    "diffbotUri": "https://diffbot.com/entity/EGTSOJhZ0NnqIjbjgQ8pyLg"
                }
            ],
            "mentions": [
                {
                    "text": "1847",
                    "beginOffset": 1208,
                    "endOffset": 1212,
                    "confidence": 0.7232269
                }
            ]
        }
    ],
    "facts": [
        {
            "humanReadable": "[David Thompson] gender [male]",
            "entity": {
                "name": "David Thompson",
                "diffbotUri": "https://diffbot.com/entity/EENf2xtgzODGwQfkcfKwx4A",
                "confidence": 0.9998524,
                "allUris": [
                    "http://www.wikidata.org/entity/Q763043"
                ],
                "allTypes": [
                    {
                        "name": "person",
                        "diffbotUri": "https://diffbot.com/entity/E4aFoJie0MN6dcs_yDRFwXQ",
                        "dbpediaUri": "http://dbpedia.org/ontology/Person"
                    }
                ],
                "isCustom": false,
                "entityIndex": 1
            },
            "property": {
                "name": "gender",
                "diffbotUri": "https://docs.diffbot.com/ontology#Person.gender"
            },
            "value": {
                "name": "male",
                "confidence": 0.0,
                "allUris": [],
                "allTypes": [],
                "isCustom": false
            },
            "confidence": 0.85714287,
            "evidence": [
                {
                    "entityMentions": [
                        {
                            "text": "he",
                            "beginOffset": 270,
                            "endOffset": 272,
                            "isPronoun": true,
                            "confidence": 0.9997017
                        }
                    ]
                },
                {
                    "entityMentions": [
                        {
                            "text": "him",
                            "beginOffset": 512,
                            "endOffset": 515,
                            "isPronoun": true,
                            "confidence": 0.9997477
                        }
                    ]
                },
                {
                    "entityMentions": [
                        {
                            "text": "he",
                            "beginOffset": 562,
                            "endOffset": 564,
                            "isPronoun": true,
                            "confidence": 0.9996124
                        }
                    ]
                },
                {
                    "entityMentions": [
                        {
                            "text": "his",
                            "beginOffset": 589,
                            "endOffset": 592,
                            "isPronoun": true,
                            "confidence": 0.9998524
                        }
                    ]
                },
                {
                    "entityMentions": [
                        {
                            "text": "He",
                            "beginOffset": 1141,
                            "endOffset": 1143,
                            "isPronoun": true,
                            "confidence": 0.99890816
                        }
                    ]
                },
                {
                    "entityMentions": [
                        {
                            "text": "he",
                            "beginOffset": 1234,
                            "endOffset": 1236,
                            "isPronoun": true,
                            "confidence": 0.99966574
                        }
                    ]
                }
            ]
        }
    ]
}