<http://temp.lincsproject.ca/anthologie/book/14>	<https://anthologiagraeca.org/api/books/14/>
<http://temp.lincsproject.ca/anthologie/book/7>	<https://anthologiagraeca.org/api/books/7/>
<http://temp.lincsproject.ca/anthologie/book/11>	<https://anthologiagraeca.org/api/books/11/>
<http://temp.lincsproject.ca/anthologie/book/17>	<https://anthologiagraeca.org/api/books/17/>
<http://temp.lincsproject.ca/anthologie/book/6>	<https://anthologiagraeca.org/api/books/6/>
<http://temp.lincsproject.ca/anthologie/book/5>	<https://anthologiagraeca.org/api/books/5/>
<http://temp.lincsproject.ca/anthologie/book/16>	<https://anthologiagraeca.org/api/books/16/>
<http://temp.lincsproject.ca/anthologie/book/10>	<https://anthologiagraeca.org/api/books/10/>
<http://temp.lincsproject.ca/anthologie/book/2>	<https://anthologiagraeca.org/api/books/2/>
<http://temp.lincsproject.ca/anthologie/book/18>	<https://anthologiagraeca.org/api/books/18/>
<http://temp.lincsproject.ca/anthologie/book/4>	<https://anthologiagraeca.org/api/books/4/>
<http://temp.lincsproject.ca/anthologie/book/8>	<https://anthologiagraeca.org/api/books/8/>
<http://temp.lincsproject.ca/anthologie/book/9>	<https://anthologiagraeca.org/api/books/9/>
<http://temp.lincsproject.ca/anthologie/book/3>	<https://anthologiagraeca.org/api/books/3/>
<http://temp.lincsproject.ca/anthologie/book/1>	<https://anthologiagraeca.org/api/books/1/>
<http://temp.lincsproject.ca/anthologie/book/15>	<https://anthologiagraeca.org/api/books/15/>
