"Verlayne, Charles"	Charles Verlayne
"Blanche, Jacques L."	Jacques L. Blanche
"Shreiner, Olive"	Olive Shreiner
"Douglas, Lord Alfred"	Lord Alfred Douglas
"Thomson, Margaret"	Margaret Thomson
"Broughton, Philip"	Philip Broughton
"Dobson, Henry Austin"	Henry Austin Dobson
"Horne, Herbert"	Herbert Horne
"Woman, A"	A Woman
"Van Gogh, Vincent"	Vincent Van Gogh
"Dixon, Ella Nora Hepworth"	Ella Nora Hepworth Dixon
"Yellow Dwarf, The"	The Yellow Dwarf
"MacDonald, W."	W. MacDonald
"Chesterton, G.K."	G.K. Chesterton
"Walton, E. A."	E. A. Walton
"Yeats, Jack Butler"	Jack Butler Yeats
"Gascoigne, Geo"	Geo Gascoigne
"Foschter, Albert"	Albert Foschter
"Authors of 'The Evolution of Sex,' The"	The Authors of 'The Evolution of Sex'