original URI,xml_id,original label,temp lincs URI
<https://personography.1890s.ca/persons/2725>,#CS,C.S.,<http://temp.lincsprojects.ca/y90s_person#CS>
<https://personography.1890s.ca/persons/3148>,#VVB,V. V. B.,<http://temp.lincsprojects.ca/y90s_person#VVB>
<https://personography.1890s.ca/persons/2706>,#CHV,"Verlayne, Charles",<http://temp.lincsprojects.ca/y90s_person#CHV>
<https://personography.1890s.ca/persons/2695>,#CEM,"Mathews, Charles Elkin",<http://temp.lincsprojects.ca/y90s_person#CEM>
<https://personography.1890s.ca/persons/2730>,#CTH,"Thierry, Cecil de",<http://temp.lincsprojects.ca/y90s_person#CTH>
<https://personography.1890s.ca/persons/3147>,#VV,V.,<http://temp.lincsprojects.ca/y90s_person#VV>
<https://personography.1890s.ca/persons/3176>,#WM,W. M.,<http://temp.lincsprojects.ca/y90s_person#WM>
<https://personography.1890s.ca/persons/3145>,#VOCS,V. O. C. S.,<http://temp.lincsprojects.ca/y90s_person#VOCS>
<https://personography.1890s.ca/persons/3181>,#WMC1,"MacDonald, W.",<http://temp.lincsprojects.ca/y90s_person#WMC1>
<https://personography.1890s.ca/persons/3121>,#TAOT,"Authors of 'The Evolution of Sex,' The",<http://temp.lincsprojects.ca/y90s_person#TAOT>
<https://personography.1890s.ca/persons/2845>,#GGAS,"Gascoigne, Geo",<http://temp.lincsprojects.ca/y90s_person#GGAS>
<https://personography.1890s.ca/persons/2676>,#AWO,"Woman, A",<http://temp.lincsprojects.ca/y90s_person#AWO>
<https://personography.1890s.ca/persons/3052>,#PBR,"Broughton, Philip",<http://temp.lincsprojects.ca/y90s_person#PBR>
<https://personography.1890s.ca/persons/3139>,#TYD,"Yellow Dwarf, The",<http://temp.lincsprojects.ca/y90s_person#TYD>
<https://personography.1890s.ca/persons/2908>,#JAB1,"Blanche, Jacques L.",<http://temp.lincsprojects.ca/y90s_person#JAB1>
<https://personography.1890s.ca/persons/3046>,#OO,O.,<http://temp.lincsprojects.ca/y90s_person#OO>
<https://personography.1890s.ca/persons/2627>,#AFO,"Foschter, Albert",<http://temp.lincsprojects.ca/y90s_person#AFO>