https://personography.1890s.ca/persons/le-gallienne-richard/	http://viaf.org/viaf/27148613
https://personography.1890s.ca/persons/scull-w-delaplaine/	http://viaf.org/viaf/96193501
https://personography.1890s.ca/persons/dalmon-c-w/	http://viaf.org/viaf/19587068
https://personography.1890s.ca/persons/junqueiro-abilio-manuel-guerra/	http://viaf.org/viaf/22150838
https://personography.1890s.ca/persons/landor-walter-savage/	http://viaf.org/viaf/46796707
https://personography.1890s.ca/persons/benson-robert-hugh/	http://viaf.org/viaf/67710679
https://personography.1890s.ca/persons/van-gogh-vincent/	http://viaf.org/viaf/9854560
https://personography.1890s.ca/persons/roberts-morley/	http://viaf.org/viaf/14956527
https://personography.1890s.ca/persons/purcell-edward/	http://viaf.org/viaf/59091022
https://personography.1890s.ca/persons/ellis-havelock/	http://viaf.org/viaf/41861098
https://personography.1890s.ca/persons/bennett-joseph-hannaford/	http://viaf.org/viaf/313247027
https://personography.1890s.ca/persons/lambert-g-w/	http://viaf.org/viaf/124704999
https://personography.1890s.ca/persons/brown-ford-madox/	http://viaf.org/viaf/69202953
https://personography.1890s.ca/persons/marshall-christabel/	http://viaf.org/viaf/49215571
https://personography.1890s.ca/persons/robinson-frederick/	http://viaf.org/viaf/18712191
https://personography.1890s.ca/persons/clerke-ellen-m/	http://viaf.org/viaf/40994347
https://personography.1890s.ca/persons/laubach-hugo/	http://viaf.org/viaf/283181724
https://personography.1890s.ca/persons/day-fred-holland/	http://viaf.org/viaf/63998216
https://personography.1890s.ca/persons/newdigate-bernard/	http://viaf.org/viaf/22523511
https://personography.1890s.ca/persons/hunt-alfred-william/	http://viaf.org/viaf/17236711
https://personography.1890s.ca/persons/willeby-charles/	http://viaf.org/viaf/115506453
https://personography.1890s.ca/persons/lavery-john/	http://viaf.org/viaf/12401964
https://personography.1890s.ca/persons/mansfield-katherine/	http://viaf.org/viaf/41843502
https://personography.1890s.ca/persons/steer-p-wilson/	http://viaf.org/viaf/40174630
https://personography.1890s.ca/persons/pissarro-esther-levi/	http://viaf.org/viaf/9451732
https://personography.1890s.ca/persons/williams-ralph-vaughan/	http://viaf.org/viaf/89801735
https://personography.1890s.ca/persons/lees-edith/	http://viaf.org/viaf/55722181
https://personography.1890s.ca/persons/thornton-alfred-henry-robinson/	http://viaf.org/viaf/95708345
https://personography.1890s.ca/persons/orpen-william/	http://viaf.org/viaf/13403558
https://personography.1890s.ca/persons/france-anatole/	http://viaf.org/viaf/4925052
https://personography.1890s.ca/persons/villiers-de-lisle-adam-auguste/	http://viaf.org/viaf/88998504
https://personography.1890s.ca/persons/holden-violet/	http://viaf.org/viaf/91189606
https://personography.1890s.ca/persons/lee-sydney/	http://viaf.org/viaf/95791906
https://personography.1890s.ca/persons/hacon-william-llewellyn/	http://viaf.org/viaf/274962130
https://personography.1890s.ca/persons/campion-thomas/	http://viaf.org/viaf/41886212
https://personography.1890s.ca/persons/linnell-john/	http://viaf.org/viaf/66740555
https://personography.1890s.ca/persons/rackham-arthur/	http://viaf.org/viaf/59098690
https://personography.1890s.ca/persons/carman-bliss/	http://viaf.org/viaf/29655268
https://personography.1890s.ca/persons/roberts-thomas-william/	http://viaf.org/viaf/40202284
https://personography.1890s.ca/persons/king-k-douglas/	http://viaf.org/viaf/220506530
https://personography.1890s.ca/persons/vanlerberghe-charles/	http://viaf.org/viaf/64018563
https://personography.1890s.ca/persons/blackwell-basil-h/	http://viaf.org/viaf/225145857926923020556
https://personography.1890s.ca/persons/tennyson-alfred/	http://viaf.org/viaf/61540536
https://personography.1890s.ca/persons/moore-george-augustus/	http://viaf.org/viaf/22160365
https://personography.1890s.ca/persons/quental-anthero-tarquinio-de/	http://viaf.org/viaf/100254861
https://personography.1890s.ca/persons/tadema-laurence-alma/	http://viaf.org/viaf/57400673
https://personography.1890s.ca/persons/syrett-netta/	http://viaf.org/viaf/93322398
https://personography.1890s.ca/persons/la-thangue-henry/	http://viaf.org/viaf/25469415
https://personography.1890s.ca/persons/bridges-victor/	http://viaf.org/viaf/84720639
https://personography.1890s.ca/persons/tadema-lawrence-alma/	http://viaf.org/viaf/68986036
https://personography.1890s.ca/persons/thomas-edward/	http://viaf.org/viaf/19686045
https://personography.1890s.ca/persons/gere-c-m/	http://viaf.org/viaf/76235681
https://personography.1890s.ca/persons/richardson-dorothy-miller/	http://viaf.org/viaf/64011051
https://personography.1890s.ca/persons/dobson-henry-austin/	http://viaf.org/viaf/19836932
https://personography.1890s.ca/persons/hovey-richard/	http://viaf.org/viaf/32792713
https://personography.1890s.ca/persons/ward-mary-augusta/	http://viaf.org/viaf/27084321
https://personography.1890s.ca/persons/de-chavannes-p-puvis/	http://viaf.org/viaf/51724541
https://personography.1890s.ca/persons/bridges-robert/	http://viaf.org/viaf/73868561
https://personography.1890s.ca/persons/leighton-frederic/	http://viaf.org/viaf/18031604
https://personography.1890s.ca/persons/power-arthur/	http://viaf.org/viaf/22796772
https://personography.1890s.ca/persons/hardy-thomas/	http://viaf.org/viaf/54148778
https://personography.1890s.ca/persons/meynell-francis/	http://viaf.org/viaf/34623453
https://personography.1890s.ca/persons/johnson-lionel-pigot/	http://viaf.org/viaf/22942767
https://personography.1890s.ca/persons/cotman-f-g/	http://viaf.org/viaf/95767355
https://personography.1890s.ca/persons/pollard-alfred-w/	http://viaf.org/viaf/4951293
https://personography.1890s.ca/persons/tanner-a/	http://viaf.org/viaf/96352984
https://personography.1890s.ca/persons/kessler-harry/	http://viaf.org/viaf/71486164
https://personography.1890s.ca/persons/macbeth-norman/	http://viaf.org/viaf/95787770
https://personography.1890s.ca/persons/gale-norman-rowland/	http://viaf.org/viaf/20894219
https://personography.1890s.ca/persons/hyde-douglas/	http://viaf.org/viaf/12310055
https://personography.1890s.ca/persons/chambers-robert/	http://viaf.org/viaf/14767483
https://personography.1890s.ca/persons/mattos-katharine-de/	http://viaf.org/viaf/88892922
https://personography.1890s.ca/persons/setoun-gabriel/	http://viaf.org/viaf/47136932
https://personography.1890s.ca/persons/branford-victor-v/	http://viaf.org/viaf/76676450
https://personography.1890s.ca/persons/benson-stella/	http://viaf.org/viaf/90724564
https://personography.1890s.ca/persons/hanhart-michael/	http://viaf.org/viaf/15965854
https://personography.1890s.ca/persons/bell-r-anning/	http://viaf.org/viaf/11235357
https://personography.1890s.ca/persons/norton-charles/	http://viaf.org/viaf/17246640
https://personography.1890s.ca/persons/webb-sidney/	http://viaf.org/viaf/100205056
https://personography.1890s.ca/persons/benson-margaret/	http://viaf.org/viaf/89019809
https://personography.1890s.ca/persons/hanhart-nicholas/	http://viaf.org/viaf/15965854
https://personography.1890s.ca/persons/housman-alfred/	http://viaf.org/viaf/49249069
https://personography.1890s.ca/persons/blatherwick-lily/	http://viaf.org/viaf/96483564
https://personography.1890s.ca/persons/newton-robinson-charles-edmund/	http://viaf.org/viaf/7927147270665435700004
https://personography.1890s.ca/persons/morris-william/	http://viaf.org/viaf/22146194
https://personography.1890s.ca/persons/coke-desmond-f-t/	http://viaf.org/viaf/7293793
https://personography.1890s.ca/persons/sandeman-christopher/	http://viaf.org/viaf/28778773
https://personography.1890s.ca/persons/edwards-osman/	http://viaf.org/viaf/35824817
https://personography.1890s.ca/persons/christie-nimmo/	http://viaf.org/viaf/315662333
https://personography.1890s.ca/persons/shreiner-olive/	http://viaf.org/viaf/29554433
https://personography.1890s.ca/persons/nairn-james/	http://viaf.org/viaf/40600779
https://personography.1890s.ca/persons/lessore-therese/	http://viaf.org/viaf/95738290
https://personography.1890s.ca/persons/sitwell-edith/	http://viaf.org/viaf/29549983
https://personography.1890s.ca/persons/pettie-john/	http://viaf.org/viaf/53681271
https://personography.1890s.ca/persons/marriott-charles/	http://viaf.org/viaf/23236518
https://personography.1890s.ca/persons/rhys-grace/	http://viaf.org/viaf/18260003
https://personography.1890s.ca/persons/gautier-judith/	http://viaf.org/viaf/54148064
https://personography.1890s.ca/persons/white-j-w-gleeson/	http://viaf.org/viaf/72676219
https://personography.1890s.ca/persons/plarr-victor/	http://viaf.org/viaf/36782198
https://personography.1890s.ca/persons/beaux-cecilia/	http://viaf.org/viaf/10135545
https://personography.1890s.ca/persons/waugh-f-t/	http://viaf.org/viaf/10727443
https://personography.1890s.ca/persons/de-mattos-a-teixeira/	http://viaf.org/viaf/55502069
https://personography.1890s.ca/persons/rothenstein-will/	http://viaf.org/viaf/34674307
https://personography.1890s.ca/persons/tonks-henry/	http://viaf.org/viaf/902251
https://personography.1890s.ca/persons/philpot-glyn-w/	http://viaf.org/viaf/39649440
https://personography.1890s.ca/persons/gaugin-paul/	http://viaf.org/viaf/27064953
https://personography.1890s.ca/persons/sturgis-julian/	http://viaf.org/viaf/25977565
https://personography.1890s.ca/persons/curzon-george-nathaniel/	http://viaf.org/viaf/27094651
https://personography.1890s.ca/persons/mayne-ethel-colburn/	http://viaf.org/viaf/30567229
https://personography.1890s.ca/persons/new-edmund-hort/	http://viaf.org/viaf/15654483
https://personography.1890s.ca/persons/levetus-celia-a/	http://viaf.org/viaf/95766189
https://personography.1890s.ca/persons/binyon-cecily-powell/	http://viaf.org/viaf/257500832
https://personography.1890s.ca/persons/milman-lena/	http://viaf.org/viaf/1629491
https://personography.1890s.ca/persons/bradley-katharine-harris/	http://viaf.org/viaf/66782560
https://personography.1890s.ca/persons/armour-margaret/	http://viaf.org/viaf/69944781
https://personography.1890s.ca/persons/norregard-julie/	http://viaf.org/viaf/26376093
https://personography.1890s.ca/persons/cadenhead-james/	http://viaf.org/viaf/56884111
https://personography.1890s.ca/persons/abbott-angus-evan/	http://viaf.org/viaf/62872887
https://personography.1890s.ca/persons/ramsden-hermione-charlotte/	http://viaf.org/viaf/287712786
https://personography.1890s.ca/persons/holden-evelyn/	http://viaf.org/viaf/207682681
https://personography.1890s.ca/persons/beardsley-aubrey/	http://viaf.org/viaf/88739636
https://personography.1890s.ca/persons/hamerton-philip-gilbert/	http://viaf.org/viaf/10985416
https://personography.1890s.ca/persons/maclagan-ernest/	http://viaf.org/viaf/54905611
https://personography.1890s.ca/persons/starr-ellen-gates/	http://viaf.org/viaf/166848460
https://personography.1890s.ca/persons/hamsun-knut/	http://viaf.org/viaf/59083692
https://personography.1890s.ca/persons/oury-louis/	http://viaf.org/viaf/36922724
https://personography.1890s.ca/persons/hapgood-norman/	http://viaf.org/viaf/67672911
https://personography.1890s.ca/persons/robinson-charles-f/	http://viaf.org/viaf/5738401
https://personography.1890s.ca/persons/lawrence-d-h/	http://viaf.org/viaf/95150359
https://personography.1890s.ca/persons/mulholland-rosa/	http://viaf.org/viaf/13729751
https://personography.1890s.ca/persons/macleay-john/	http://viaf.org/viaf/76277891
https://personography.1890s.ca/persons/belloc-hillaire/	http://viaf.org/viaf/59113521
https://personography.1890s.ca/persons/james-william/	http://viaf.org/viaf/56625773
https://personography.1890s.ca/persons/watson-rosamund-marriott/	http://viaf.org/viaf/7259226
https://personography.1890s.ca/persons/gawsworth-george/	http://viaf.org/viaf/71760079
https://personography.1890s.ca/persons/lamb-henry/	http://viaf.org/viaf/40320240
https://personography.1890s.ca/persons/eyre-todd-george/	http://viaf.org/viaf/38158382
https://personography.1890s.ca/persons/butcher-john-george/	http://viaf.org/viaf/311438099
https://personography.1890s.ca/persons/synge-j-m/	http://viaf.org/viaf/44305889
https://personography.1890s.ca/persons/robertson-john-mackinnon/	http://viaf.org/viaf/7479661
https://personography.1890s.ca/persons/leverson-ada/	http://viaf.org/viaf/19921345
https://personography.1890s.ca/persons/waugh-arthur/	http://viaf.org/viaf/89854554
https://personography.1890s.ca/persons/wells-h-g/	http://viaf.org/viaf/97006424
https://personography.1890s.ca/persons/yeats-w-b/	http://viaf.org/viaf/89854554
https://personography.1890s.ca/persons/lane-john/	http://viaf.org/viaf/95684288
https://personography.1890s.ca/persons/vallance-aymer/	http://viaf.org/viaf/34828402
https://personography.1890s.ca/persons/dodd-francis/	http://viaf.org/viaf/69203479
https://personography.1890s.ca/persons/levy-amy/	http://viaf.org/viaf/22246740
https://personography.1890s.ca/persons/bennett-enoch-arnold/	http://viaf.org/viaf/49240682
https://personography.1890s.ca/persons/clifford-edward/	http://viaf.org/viaf/78671985
https://personography.1890s.ca/persons/rust-margaret/	http://viaf.org/viaf/78371159
https://personography.1890s.ca/persons/furse-charles-wellington/	http://viaf.org/viaf/2743707
https://personography.1890s.ca/persons/monsell-j/	http://viaf.org/viaf/311427974
https://personography.1890s.ca/persons/orwell-george/	http://viaf.org/viaf/95155403
https://personography.1890s.ca/persons/wedmore-frederick/	http://viaf.org/viaf/6319143
https://personography.1890s.ca/persons/maccoll-d-s/	http://viaf.org/viaf/49591342
https://personography.1890s.ca/persons/dixon-william-hepworth/	http://viaf.org/viaf/37011079
https://personography.1890s.ca/persons/french-cecil/	http://viaf.org/viaf/8616226
https://personography.1890s.ca/persons/beckett-samuel/	http://viaf.org/viaf/7386737
https://personography.1890s.ca/persons/pissarro-orovida-camille/	http://viaf.org/viaf/95730543
https://personography.1890s.ca/persons/traill-h-d/	http://viaf.org/viaf/15140186
https://personography.1890s.ca/persons/walpole-hugh/	http://viaf.org/viaf/76523409
https://personography.1890s.ca/persons/thompson-francis/	http://viaf.org/viaf/44421776
https://personography.1890s.ca/persons/naumann-paul/	http://viaf.org/viaf/262964098
https://personography.1890s.ca/persons/ives-george/	http://viaf.org/viaf/44667862
https://personography.1890s.ca/persons/conder-charles-edward/	http://viaf.org/viaf/76588572
https://personography.1890s.ca/persons/newbery-f-h/	http://viaf.org/viaf/9791117
https://personography.1890s.ca/persons/nansen-peter/	http://viaf.org/viaf/27834098
https://personography.1890s.ca/persons/wilde-oscar/	http://viaf.org/viaf/34464414
https://personography.1890s.ca/persons/marriott-watson-rosamund/	http://viaf.org/viaf/13443582
https://personography.1890s.ca/persons/dunne-mary-chavelita/	http://viaf.org/viaf/35262867
https://personography.1890s.ca/persons/walker-emery/	http://viaf.org/viaf/316801958
https://personography.1890s.ca/persons/nettleship-ida/	http://viaf.org/viaf/1703478
https://personography.1890s.ca/persons/signac-paul/	http://viaf.org/viaf/46767282
https://personography.1890s.ca/persons/von-arnim-elizabeth/	http://viaf.org/viaf/46778576
https://personography.1890s.ca/persons/thomas-rose-haig/	http://viaf.org/viaf/93860812
https://personography.1890s.ca/persons/mason-george-heming/	http://viaf.org/viaf/53064923
https://personography.1890s.ca/persons/cameron-d-y/	http://viaf.org/viaf/79202867
https://personography.1890s.ca/persons/strettell-alma/	http://viaf.org/viaf/62956525
https://personography.1890s.ca/persons/kahn-florence/	http://viaf.org/viaf/75877864
https://personography.1890s.ca/persons/pimlott-e-philip/	http://viaf.org/viaf/232475963
https://personography.1890s.ca/persons/woolf-virginia/	http://viaf.org/viaf/39385478
https://personography.1890s.ca/persons/dow-thomas-millie/	http://viaf.org/viaf/95719732
https://personography.1890s.ca/persons/fergusson-john-duncan/	http://viaf.org/viaf/225424550
https://personography.1890s.ca/persons/howard-blanche-willis/	http://viaf.org/viaf/8154449
https://personography.1890s.ca/persons/stedman-e-c/	http://viaf.org/viaf/74024682
https://personography.1890s.ca/persons/hills-laura-coombs/	http://viaf.org/viaf/71294873
https://personography.1890s.ca/persons/arnold-matthew/	http://viaf.org/viaf/73868557
https://personography.1890s.ca/persons/butler-elizabeth-southernden/	http://viaf.org/viaf/213988041
https://personography.1890s.ca/persons/langley-walter/	http://viaf.org/viaf/95723874
https://personography.1890s.ca/persons/crockett-s-r/	http://viaf.org/viaf/50025249
https://personography.1890s.ca/persons/eden-william/	http://viaf.org/viaf/20479934
https://personography.1890s.ca/persons/creswick-paul/	http://viaf.org/viaf/41906115
https://personography.1890s.ca/persons/osullivan-seumas/	http://viaf.org/viaf/34500799
https://personography.1890s.ca/persons/raverat-gwen/	http://viaf.org/viaf/69166925
https://personography.1890s.ca/persons/eustace-jennie-a/	http://viaf.org/viaf/232045360
https://personography.1890s.ca/persons/allen-grant/	http://viaf.org/viaf/48393117
https://personography.1890s.ca/persons/nietzsche-friedrich/	http://viaf.org/viaf/89798474
https://personography.1890s.ca/persons/west-rebecca/	http://viaf.org/viaf/108321467
https://personography.1890s.ca/persons/mathews-charles-elkin/	http://viaf.org/viaf/57413861
https://personography.1890s.ca/persons/dawson-alfred/	http://viaf.org/viaf/13839978
https://personography.1890s.ca/persons/frederic-harold/	http://viaf.org/viaf/22251233
https://personography.1890s.ca/persons/balmer-clinton/	http://viaf.org/viaf/9550472
https://personography.1890s.ca/persons/reclus-elisee/	http://viaf.org/viaf/71396743
https://personography.1890s.ca/persons/giraud-albert/	http://viaf.org/viaf/56772661
https://personography.1890s.ca/persons/jackson-helen-hunt/	http://viaf.org/viaf/32039190
https://personography.1890s.ca/persons/boutall-walter/	http://viaf.org/viaf/316801958
https://personography.1890s.ca/persons/baxter-nellie/	http://viaf.org/viaf/95810079
https://personography.1890s.ca/persons/paterson-william-romaine/	http://viaf.org/viaf/40774730
https://personography.1890s.ca/persons/garstin-althea-dochie/	http://viaf.org/viaf/75182558
https://personography.1890s.ca/persons/white-terence-de-vere/	http://viaf.org/viaf/32014566
https://personography.1890s.ca/persons/verlaine-paul/	http://viaf.org/viaf/4937684
https://personography.1890s.ca/persons/bayes-gilbert/	http://viaf.org/viaf/22992458
https://personography.1890s.ca/persons/monk-w/	http://viaf.org/viaf/95720318
https://personography.1890s.ca/persons/toft-charles/	http://viaf.org/viaf/309814120
https://personography.1890s.ca/persons/melville-arthur/	http://viaf.org/viaf/16715773
https://personography.1890s.ca/persons/watts-george-frederick/	http://viaf.org/viaf/10095477
https://personography.1890s.ca/persons/sarolea-charles/	http://viaf.org/viaf/10202024
https://personography.1890s.ca/persons/wilson-patten/	http://viaf.org/viaf/96099805
https://personography.1890s.ca/persons/dunne-john-joseph/	http://viaf.org/viaf/22094832
https://personography.1890s.ca/persons/geddes-patrick/	http://viaf.org/viaf/73868906
https://personography.1890s.ca/persons/sinclair-alexander-garden/	http://viaf.org/viaf/76190701
https://personography.1890s.ca/persons/wratislaw-theodore/	http://viaf.org/viaf/91022437
https://personography.1890s.ca/persons/janvier-catharine-a/	http://viaf.org/viaf/11222977
https://personography.1890s.ca/persons/strang-william/	http://viaf.org/viaf/62322662
https://personography.1890s.ca/persons/conrad-joseph/	http://viaf.org/viaf/73862853
https://personography.1890s.ca/persons/cameron-katharine/	http://viaf.org/viaf/12187246
https://personography.1890s.ca/persons/hammond-gertrude-d/	http://viaf.org/viaf/96456212
https://personography.1890s.ca/persons/shaw-martin/	http://viaf.org/viaf/41925418
https://personography.1890s.ca/persons/holden-edith/	http://viaf.org/viaf/27066001
https://personography.1890s.ca/persons/graves-philip-perceval/	http://viaf.org/viaf/117092099
https://personography.1890s.ca/persons/hamilton-james-whitelaw/	http://viaf.org/viaf/7255642
https://personography.1890s.ca/persons/meyer-zundel-suzanne/	http://viaf.org/viaf/56217655
https://personography.1890s.ca/persons/shannon-charles-h/	http://viaf.org/viaf/5203036
https://personography.1890s.ca/persons/jacomb-hood-george/	http://viaf.org/viaf/19953199
https://personography.1890s.ca/persons/proctor-thea/	http://viaf.org/viaf/72475845
https://personography.1890s.ca/persons/verhaeren-emile/	http://viaf.org/viaf/27072663
https://personography.1890s.ca/persons/headlam-steward/	http://viaf.org/viaf/18289692
https://personography.1890s.ca/persons/blake-william/	http://viaf.org/viaf/54144439
https://personography.1890s.ca/persons/orme-michael/	http://viaf.org/viaf/92800393
https://personography.1890s.ca/persons/way-thomas/	http://viaf.org/viaf/28848033
https://personography.1890s.ca/persons/sharp-william/	http://viaf.org/viaf/121685154
https://personography.1890s.ca/persons/adamson-sydney/	http://viaf.org/viaf/41781416
https://personography.1890s.ca/persons/stephens-riccardo/	http://viaf.org/viaf/41413075
https://personography.1890s.ca/persons/frost-robert/	http://viaf.org/viaf/32010055
https://personography.1890s.ca/persons/chesson-hugh/	http://viaf.org/viaf/61937937
https://personography.1890s.ca/persons/nevinson-margaret-wynne/	http://viaf.org/viaf/23146574975838152430
https://personography.1890s.ca/persons/burne-jones-edward/	http://viaf.org/viaf/59120251
https://personography.1890s.ca/persons/churchill-winston/	http://viaf.org/viaf/94507588
https://personography.1890s.ca/persons/dixon-ella-nora-hepworth/	http://viaf.org/viaf/14904505
https://personography.1890s.ca/persons/egerton-alix/	http://viaf.org/viaf/27451150
https://personography.1890s.ca/persons/reed-ethel/	http://viaf.org/viaf/305822821
https://personography.1890s.ca/persons/burton-richard/	http://viaf.org/viaf/29832058
https://personography.1890s.ca/persons/proust-marcel/	http://viaf.org/viaf/32001793
https://personography.1890s.ca/persons/gogarty-oliver/	http://viaf.org/viaf/32004745
https://personography.1890s.ca/persons/cuthbertson-w/	http://viaf.org/viaf/76191609
https://personography.1890s.ca/persons/barney-natalie/	http://viaf.org/viaf/76311714
https://personography.1890s.ca/persons/mackintosh-charles-rennie/	http://viaf.org/viaf/74645185
https://personography.1890s.ca/persons/baillie-john/	http://viaf.org/viaf/1450161152492235190000
https://personography.1890s.ca/persons/swan-joseph/	http://viaf.org/viaf/15100261
https://personography.1890s.ca/persons/drummond-john/	http://viaf.org/viaf/99297727
https://personography.1890s.ca/persons/dowie-menie-muriel/	http://viaf.org/viaf/13336710
https://personography.1890s.ca/persons/monsell-e/	http://viaf.org/viaf/96425475
https://personography.1890s.ca/persons/villon-francois/	http://viaf.org/viaf/7398349
https://personography.1890s.ca/persons/hueffer-ford-madox/	http://viaf.org/viaf/65936925
https://personography.1890s.ca/persons/brangwyn-frank/	http://viaf.org/viaf/54420453
https://personography.1890s.ca/persons/blind-mathilde/	http://viaf.org/viaf/5024984
https://personography.1890s.ca/persons/rinder-frank/	http://viaf.org/viaf/23202552
https://personography.1890s.ca/persons/hornel-e/	http://viaf.org/viaf/22985477
https://personography.1890s.ca/persons/macdonald-frances/	http://viaf.org/viaf/315943284
https://personography.1890s.ca/persons/radford-ernest/	http://viaf.org/viaf/191862721
https://personography.1890s.ca/persons/burrow-charles-kennett/	http://viaf.org/viaf/100797641
https://personography.1890s.ca/persons/maugham-syrie/	http://viaf.org/viaf/50497548
https://personography.1890s.ca/persons/pennell-joseph/	http://viaf.org/viaf/61660866
https://personography.1890s.ca/persons/blaikie-j-a/	http://viaf.org/viaf/28989430
https://personography.1890s.ca/persons/gyles-althea/	http://viaf.org/viaf/1994353
https://personography.1890s.ca/persons/paine-albert-bigelow/	http://viaf.org/viaf/24731419
https://personography.1890s.ca/persons/stevenson-robert-louis/	http://viaf.org/viaf/95207986
https://personography.1890s.ca/persons/cotterell-george/	http://viaf.org/viaf/36793499
https://personography.1890s.ca/persons/prestage-edgar/	http://viaf.org/viaf/49214806
https://personography.1890s.ca/persons/collingwood-w-g/	http://viaf.org/viaf/56749375
https://personography.1890s.ca/persons/craig-edward-gordon/	http://viaf.org/viaf/100201551
https://personography.1890s.ca/persons/hapgood-hutchins/	http://viaf.org/viaf/54318960
https://personography.1890s.ca/persons/stieglitz-alfred/	http://viaf.org/viaf/49231990
https://personography.1890s.ca/persons/braddon-m-e/	http://viaf.org/viaf/66826682
https://personography.1890s.ca/persons/crowley-aleister/	http://viaf.org/viaf/41838530
https://personography.1890s.ca/persons/ward-dorothy-p/	http://viaf.org/viaf/106931776
https://personography.1890s.ca/persons/pain-barry/	http://viaf.org/viaf/20543259
https://personography.1890s.ca/persons/siddal-elizabeth/	http://viaf.org/viaf/84255921
https://personography.1890s.ca/persons/maccoll-dugald-sutherland/	http://viaf.org/viaf/49591342
https://personography.1890s.ca/persons/moore-leslie/	http://viaf.org/viaf/45035730
https://personography.1890s.ca/persons/desjardins-paul/	http://viaf.org/viaf/5060337
https://personography.1890s.ca/persons/smith-sydney-ure/	http://viaf.org/viaf/72475845
https://personography.1890s.ca/persons/rudland-florence-m/	http://viaf.org/viaf/371146997241718890824
https://personography.1890s.ca/persons/cotman-john-sell/	http://viaf.org/viaf/34630247
https://personography.1890s.ca/persons/mcnair-j-herbert/	http://viaf.org/viaf/11000494
https://personography.1890s.ca/persons/rinder-edith-wingate/	http://viaf.org/viaf/43464191
https://personography.1890s.ca/persons/joyce-james/	http://viaf.org/viaf/44300643
https://personography.1890s.ca/persons/chesterton-g-k/	http://viaf.org/viaf/14767719
https://personography.1890s.ca/persons/naidu-sarojini/	http://viaf.org/viaf/20485679
https://personography.1890s.ca/persons/egerton-francis/	http://viaf.org/viaf/47143145
https://personography.1890s.ca/persons/irving-laurence/	http://viaf.org/viaf/62662175
https://personography.1890s.ca/persons/mulholland-clara/	http://viaf.org/viaf/19624857
https://personography.1890s.ca/persons/armitage-edward/	http://viaf.org/viaf/47034164
https://personography.1890s.ca/persons/symonds-john-addington/	http://viaf.org/viaf/39500310
https://personography.1890s.ca/persons/rossetti-dante-gabriel/	http://viaf.org/viaf/41848725
https://personography.1890s.ca/persons/street-g-s/	http://viaf.org/viaf/23686559
https://personography.1890s.ca/persons/morris-may/	http://viaf.org/viaf/46825663
https://personography.1890s.ca/persons/masefield-john/	http://viaf.org/viaf/68945598
https://personography.1890s.ca/persons/clerke-agnes-mary/	http://viaf.org/viaf/32751257
https://personography.1890s.ca/persons/watts-theodore/	http://viaf.org/viaf/101042729
https://personography.1890s.ca/persons/ashbee-c-r/	http://viaf.org/viaf/76389729
https://personography.1890s.ca/persons/hueffer-francis/	http://viaf.org/viaf/59893499
https://personography.1890s.ca/persons/benson-edward-white/	http://viaf.org/viaf/3252348
https://personography.1890s.ca/persons/may-phil/	http://viaf.org/viaf/7661227
https://personography.1890s.ca/persons/harrison-lawrence-alexander/	http://viaf.org/viaf/95831936
https://personography.1890s.ca/persons/symons-arthur/	http://viaf.org/viaf/61558452
https://personography.1890s.ca/persons/engelmann-godefroy/	http://viaf.org/viaf/56729836
https://personography.1890s.ca/persons/grahame-kenneth/	http://viaf.org/viaf/36919188
https://personography.1890s.ca/persons/price-nancy/	http://viaf.org/viaf/36003274
https://personography.1890s.ca/persons/saintsbury-george-edward-bateman/	http://viaf.org/viaf/120695179
https://personography.1890s.ca/persons/beerbohm-tree-herbert/	http://viaf.org/viaf/46751757
https://personography.1890s.ca/persons/koster-edward-bernard/	http://viaf.org/viaf/21912185
https://personography.1890s.ca/persons/vivien-renee/	http://viaf.org/viaf/122002241
https://personography.1890s.ca/persons/darcy-ella/	http://viaf.org/viaf/50614178
https://personography.1890s.ca/persons/thomson-j-arthur/	http://viaf.org/viaf/22150466
https://personography.1890s.ca/persons/smithers-leonard/	http://viaf.org/viaf/388149106014868490724
https://personography.1890s.ca/persons/storrs-ronald/	http://viaf.org/viaf/65453680
https://personography.1890s.ca/persons/guthrie-james/	http://viaf.org/viaf/39651418
https://personography.1890s.ca/persons/stanislavsky-konstantin/	http://viaf.org/viaf/61552610
https://personography.1890s.ca/persons/gosse-edmund-william-sir/	http://viaf.org/viaf/54239311
https://personography.1890s.ca/persons/macleod-fiona/	http://viaf.org/viaf/27144257
https://personography.1890s.ca/persons/tynan-katharine/	http://viaf.org/viaf/35249976
https://personography.1890s.ca/persons/hopper-nora/	http://viaf.org/viaf/49081605
https://personography.1890s.ca/persons/hudson-w-h/	http://viaf.org/viaf/7391698
https://personography.1890s.ca/persons/sinclair-may/	http://viaf.org/viaf/42634131
https://personography.1890s.ca/persons/costa-john-da/	http://viaf.org/viaf/48181948
https://personography.1890s.ca/persons/menken-adah-isaacs/	http://viaf.org/viaf/29770970
https://personography.1890s.ca/persons/svevo-italo/	http://viaf.org/viaf/49232071
https://personography.1890s.ca/persons/horton-william-thomas/	http://viaf.org/viaf/50104128
https://personography.1890s.ca/persons/pater-walter/	http://viaf.org/viaf/19689601
https://personography.1890s.ca/persons/nettleship-j-t/	http://viaf.org/viaf/71199695
https://personography.1890s.ca/persons/broughton-rhoda/	http://viaf.org/viaf/45106836
https://personography.1890s.ca/persons/housman-laurence/	http://viaf.org/viaf/49352981
https://personography.1890s.ca/persons/todhunter-john/	http://viaf.org/viaf/59464851
https://personography.1890s.ca/persons/meteyard-sydney/	http://viaf.org/viaf/95809187
https://personography.1890s.ca/persons/bradlaugh-charles/	http://viaf.org/viaf/12297875
https://personography.1890s.ca/persons/carmichael-alexander/	http://viaf.org/viaf/89818453
https://personography.1890s.ca/persons/shakespear-o/	http://viaf.org/viaf/62347159
https://personography.1890s.ca/persons/mumford-lewis/	http://viaf.org/viaf/12312890
https://personography.1890s.ca/persons/dowson-ernest/	http://viaf.org/viaf/29527929
https://personography.1890s.ca/persons/thomas-dylan/	http://viaf.org/viaf/73860698
https://personography.1890s.ca/persons/franklin-benjamin/	http://viaf.org/viaf/56609913
https://personography.1890s.ca/persons/botticelli-sandro/	http://viaf.org/viaf/19686406
https://personography.1890s.ca/persons/waugh-evelyn/	http://viaf.org/viaf/68937142
https://personography.1890s.ca/persons/greenwood-frederick/	http://viaf.org/viaf/48791206
https://personography.1890s.ca/persons/gaskin-mrs-a-j/	http://viaf.org/viaf/185064650
https://personography.1890s.ca/persons/hartrick-a-s/	http://viaf.org/viaf/37189998
https://personography.1890s.ca/persons/woodroffe-paul/	http://viaf.org/viaf/95809044
https://personography.1890s.ca/persons/radford-dollie/	http://viaf.org/viaf/50659878
https://personography.1890s.ca/persons/heredia-jose-maria-de/	http://viaf.org/viaf/95187284
https://personography.1890s.ca/persons/huxley-thomas/	http://viaf.org/viaf/66511085
https://personography.1890s.ca/persons/dodgson-campbell/	http://viaf.org/viaf/37054187
https://personography.1890s.ca/persons/gregory-augusta/	http://viaf.org/viaf/73885426
https://personography.1890s.ca/persons/clairmonte-egerton-tertius/	http://viaf.org/viaf/235154590089443080222
https://personography.1890s.ca/persons/holmes-oliver-wendell/	http://viaf.org/viaf/7405944
https://personography.1890s.ca/persons/rimbaud-arthur/	http://viaf.org/viaf/7396281
https://personography.1890s.ca/persons/webb-beatrice/	http://viaf.org/viaf/86607236
https://personography.1890s.ca/persons/trevelyan-r-c/	http://viaf.org/viaf/55066267
https://personography.1890s.ca/persons/cahan-abraham/	http://viaf.org/viaf/73968086
https://personography.1890s.ca/persons/maeterlinck-maurice/	http://viaf.org/viaf/2473791
https://personography.1890s.ca/persons/geddie-john/	http://viaf.org/viaf/34827260
https://personography.1890s.ca/persons/smith-pamela-colman/	http://viaf.org/viaf/44549388
https://personography.1890s.ca/persons/moulton-louise-chandler/	http://viaf.org/viaf/13715100
https://personography.1890s.ca/persons/neuman-b-paul/	http://viaf.org/viaf/11317721
https://personography.1890s.ca/persons/sackville-margaret/	http://viaf.org/viaf/17097064
https://personography.1890s.ca/persons/savage-reginald/	http://viaf.org/viaf/6982151112589037180004
https://personography.1890s.ca/persons/janvier-thomas-allibone/	http://viaf.org/viaf/61932982
https://personography.1890s.ca/persons/yeast-john-butler/	http://viaf.org/viaf/17394443
https://personography.1890s.ca/persons/boughton-george-henry/	http://viaf.org/viaf/227730597
https://personography.1890s.ca/persons/nesbit-e/	http://viaf.org/viaf/7394811
https://personography.1890s.ca/persons/smith-arthur-cosslett/	http://viaf.org/viaf/7747872
https://personography.1890s.ca/persons/gray-john/	http://viaf.org/viaf/39421155
https://personography.1890s.ca/persons/booth-gore-markievicz-constance/	http://viaf.org/viaf/57406963
https://personography.1890s.ca/persons/duncan-john/	http://viaf.org/viaf/50032226
https://personography.1890s.ca/persons/eisen-charles/	http://viaf.org/viaf/29533491
https://personography.1890s.ca/persons/rheam-henry-meynell/	http://viaf.org/viaf/95865097
https://personography.1890s.ca/persons/womrath-andrew-kay/	http://viaf.org/viaf/24871500
https://personography.1890s.ca/persons/macfie-ronald-campbell/	http://viaf.org/viaf/57960728
https://personography.1890s.ca/persons/meynell-alice/	http://viaf.org/viaf/71820798
https://personography.1890s.ca/persons/innes-james-dickson/	http://viaf.org/viaf/35397912
https://personography.1890s.ca/persons/ardizzone-edward/	http://viaf.org/viaf/41959457
https://personography.1890s.ca/persons/roche-alexander-ignatius/	http://viaf.org/viaf/95712891
https://personography.1890s.ca/persons/pimlott-john/	http://viaf.org/viaf/101814329
https://personography.1890s.ca/persons/bentley-e-c/	http://viaf.org/viaf/22138375
https://personography.1890s.ca/persons/dearmer-mabel/	http://viaf.org/viaf/3545734
https://personography.1890s.ca/persons/kennedy-william/	http://viaf.org/viaf/95684288
https://personography.1890s.ca/persons/duran-carolus/	http://viaf.org/viaf/34662644
https://personography.1890s.ca/persons/thorp-joseph-peter/	http://viaf.org/viaf/28515172
https://personography.1890s.ca/persons/sharp-elizabeth-a/	http://viaf.org/viaf/10126116
https://personography.1890s.ca/persons/forbes-stanhope-a/	http://viaf.org/viaf/22949653
https://personography.1890s.ca/persons/baring-maurice/	http://viaf.org/viaf/44386303
https://personography.1890s.ca/persons/paton-noel/	http://viaf.org/viaf/77119089
https://personography.1890s.ca/persons/lewis-wyndham/	http://viaf.org/viaf/41843119
https://personography.1890s.ca/persons/bauerle-karl-wilhelm/	http://viaf.org/viaf/231347290
https://personography.1890s.ca/persons/craik-dinah-mulock/	http://viaf.org/viaf/46793285
https://personography.1890s.ca/persons/cole-margaret-ward/	http://viaf.org/viaf/26426965
https://personography.1890s.ca/persons/orme-eliza/	http://viaf.org/viaf/291996145
https://personography.1890s.ca/persons/patmore-coventry/	http://viaf.org/viaf/29550062
https://personography.1890s.ca/persons/russell-george/	http://viaf.org/viaf/121823798
https://personography.1890s.ca/persons/couch-arthur-quiller/	http://viaf.org/viaf/5082639
https://personography.1890s.ca/persons/ainslie-douglas/	http://viaf.org/viaf/65490870
https://personography.1890s.ca/persons/lobley-john-hodgson/	http://viaf.org/viaf/95684430
https://personography.1890s.ca/persons/fullerton-william-morton/	http://viaf.org/viaf/5303330
https://personography.1890s.ca/persons/beardsley-mabel/	http://viaf.org/viaf/291744233
https://personography.1890s.ca/persons/tollemache-grace-e/	http://viaf.org/viaf/6164149198302974940000
https://personography.1890s.ca/persons/image-selwyn/	http://viaf.org/viaf/6177661
https://personography.1890s.ca/persons/sandys-frederick/	http://viaf.org/viaf/3387346
https://personography.1890s.ca/persons/bradley-gertrude/	http://viaf.org/viaf/76197271
https://personography.1890s.ca/persons/glazier-louise/	http://viaf.org/viaf/95727675
https://personography.1890s.ca/persons/farjeon-eleanor/	http://viaf.org/viaf/44768621
https://personography.1890s.ca/persons/williams-e-harcourt/	http://viaf.org/viaf/98305187
https://personography.1890s.ca/persons/miall-arthur-bernard/	http://viaf.org/viaf/109480709
https://personography.1890s.ca/persons/sharp-evelyn/	http://viaf.org/viaf/42106129
https://personography.1890s.ca/persons/coleridge-mary/	http://viaf.org/viaf/8191834
https://personography.1890s.ca/persons/walton-e-a/	http://viaf.org/viaf/51559279
https://personography.1890s.ca/persons/mcchesney-dora-greenwell/	http://viaf.org/viaf/41774835
https://personography.1890s.ca/persons/marzials-theo/	http://viaf.org/viaf/2518292
https://personography.1890s.ca/persons/nicoll-william-robertson/	http://viaf.org/viaf/295379886
https://personography.1890s.ca/persons/meinhold-william/	http://viaf.org/viaf/27133330
https://personography.1890s.ca/persons/clarke-austin/	http://viaf.org/viaf/54194438
https://personography.1890s.ca/persons/brooks-john-ellingham/	http://viaf.org/viaf/8122161453846464330006
https://personography.1890s.ca/persons/salt-h-s/	http://viaf.org/viaf/7511239
https://personography.1890s.ca/persons/ransome-arthur/	http://viaf.org/viaf/67261752
https://personography.1890s.ca/persons/maugham-w-somerset/	http://viaf.org/viaf/66470937
https://personography.1890s.ca/persons/sickert-bernhard/	http://viaf.org/viaf/194145003300961301773
https://personography.1890s.ca/persons/gray-alice/	http://viaf.org/viaf/42768801
https://personography.1890s.ca/persons/mew-charlotte-m/	http://viaf.org/viaf/62486187
https://personography.1890s.ca/persons/douglas-lord-alfred/	http://viaf.org/viaf/315673269
https://personography.1890s.ca/persons/campagnola-guilio/	http://viaf.org/viaf/39650159
https://personography.1890s.ca/persons/caird-mona/	http://viaf.org/viaf/24650758
https://personography.1890s.ca/persons/dixon-marion-hepworth/	http://viaf.org/viaf/2460156619142928780008
https://personography.1890s.ca/persons/edison-thomas/	http://viaf.org/viaf/66552944
https://personography.1890s.ca/persons/pearce-j-h/	http://viaf.org/viaf/17138120
https://personography.1890s.ca/persons/bayes-alfred-walter/	http://viaf.org/viaf/72893011
https://personography.1890s.ca/persons/lemmen-georges/	http://viaf.org/viaf/29583994
https://personography.1890s.ca/persons/de-lisle-charles-marie-rene-leconte/	http://viaf.org/viaf/64008239
https://personography.1890s.ca/persons/savile-clarke-henry/	http://viaf.org/viaf/28430533
https://personography.1890s.ca/persons/du-maurier-george/	http://viaf.org/viaf/10144
https://personography.1890s.ca/persons/cuffe-william/	http://viaf.org/viaf/43458819
https://personography.1890s.ca/persons/lee-vernon/	http://viaf.org/viaf/68945580
https://personography.1890s.ca/persons/john-gwen/	http://viaf.org/viaf/57417858
https://personography.1890s.ca/persons/de-guerin-maurice/	http://viaf.org/viaf/100175651
https://personography.1890s.ca/persons/benson-e-f/	http://viaf.org/viaf/49221488
https://personography.1890s.ca/persons/money-coutts-f-b/	http://viaf.org/viaf/50034113
https://personography.1890s.ca/persons/keats-john/	http://viaf.org/viaf/66508882
https://personography.1890s.ca/persons/james-henry/	http://viaf.org/viaf/36920030
https://personography.1890s.ca/persons/craigie-william/	http://viaf.org/viaf/76439526
https://personography.1890s.ca/persons/besant-annie/	http://viaf.org/viaf/68925562
https://personography.1890s.ca/persons/forster-francis-l-m/	http://viaf.org/viaf/95835366
https://personography.1890s.ca/persons/buchan-john/	http://viaf.org/viaf/66464527
https://personography.1890s.ca/persons/adams-harriet-isabel/	http://viaf.org/viaf/31815325
https://personography.1890s.ca/persons/garstin-norman/	http://viaf.org/viaf/77424344
https://personography.1890s.ca/persons/rhodes-cecil/	http://viaf.org/viaf/3250843
https://personography.1890s.ca/persons/benson-eugene/	http://viaf.org/viaf/122360942
https://personography.1890s.ca/persons/moorat-joseph/	http://viaf.org/viaf/112584542
https://personography.1890s.ca/persons/ruskin-john/	http://viaf.org/viaf/73859585
https://personography.1890s.ca/persons/gordon-alice-mary/	http://viaf.org/viaf/306161124
https://personography.1890s.ca/persons/ball-wilfred/	http://viaf.org/viaf/49496594
https://personography.1890s.ca/persons/pryde-james/	http://viaf.org/viaf/64754739
https://personography.1890s.ca/persons/ramsay-hugh/	http://viaf.org/viaf/4015070
https://personography.1890s.ca/persons/wilde-dolly/	http://viaf.org/viaf/11004152
https://personography.1890s.ca/persons/watt-francis/	http://viaf.org/viaf/66536648
https://personography.1890s.ca/persons/rolfe-frederick-william/	http://viaf.org/viaf/64026547
https://personography.1890s.ca/persons/fry-roger/	http://viaf.org/viaf/41884144
https://personography.1890s.ca/persons/roper-esther/	http://viaf.org/viaf/12153936
https://personography.1890s.ca/persons/caresme-ph/	http://viaf.org/viaf/32266244
https://personography.1890s.ca/persons/draper-h-j/	http://viaf.org/viaf/57665462
https://personography.1890s.ca/persons/rhys-ernest/	http://viaf.org/viaf/133909
https://personography.1890s.ca/persons/homer-winslow/	http://viaf.org/viaf/15044075
https://personography.1890s.ca/persons/housman-clemence/	http://viaf.org/viaf/38242134
https://personography.1890s.ca/persons/custance-olive/	http://viaf.org/viaf/22020017
https://personography.1890s.ca/persons/moreas-jean/	http://viaf.org/viaf/49229308
https://personography.1890s.ca/persons/maxwell-w-b/	http://viaf.org/viaf/73014818
https://personography.1890s.ca/persons/southall-j-e/	http://viaf.org/viaf/53877274
https://personography.1890s.ca/persons/mackmurdo-a-h/	http://viaf.org/viaf/112138456
https://personography.1890s.ca/persons/crawhall-joseph/	http://viaf.org/viaf/12731529
https://personography.1890s.ca/persons/bayes-jessie/	http://viaf.org/viaf/73529694
https://personography.1890s.ca/persons/powell-f-york/	http://viaf.org/viaf/8135243
https://personography.1890s.ca/persons/curzon-mary-victoria/	http://viaf.org/viaf/42658971
https://personography.1890s.ca/persons/roberts-r-ellis/	http://viaf.org/viaf/18300809
https://personography.1890s.ca/persons/crackanthorpe-hubert/	http://viaf.org/viaf/1393709
https://personography.1890s.ca/persons/graham-r-b-cunninghame/	http://viaf.org/viaf/61539913
https://personography.1890s.ca/persons/newill-mary-j/	http://viaf.org/viaf/4259707
https://personography.1890s.ca/persons/meynell-wilfrid-john/	http://viaf.org/viaf/10242705
https://personography.1890s.ca/persons/tuke-henry-scott/	http://viaf.org/viaf/40217163
https://personography.1890s.ca/persons/stevenson-r-m/	http://viaf.org/viaf/95784593
https://personography.1890s.ca/persons/robinson-winifred/	http://viaf.org/viaf/172581548
https://personography.1890s.ca/persons/binyon-laurence/	http://viaf.org/viaf/64101933
https://personography.1890s.ca/persons/nevinson-henry-w/	http://viaf.org/viaf/22469411
https://personography.1890s.ca/persons/moreau-gustave/	http://viaf.org/viaf/46844904
https://personography.1890s.ca/persons/knightley-louisa/	http://viaf.org/viaf/39748297
https://personography.1890s.ca/persons/harland-henry/	http://viaf.org/viaf/44660990
https://personography.1890s.ca/persons/robinson-william-heath/	http://viaf.org/viaf/95146331
https://personography.1890s.ca/persons/sickert-oswald-valentine/	http://viaf.org/viaf/92586838
https://personography.1890s.ca/persons/crane-walter/	http://viaf.org/viaf/74022344
https://personography.1890s.ca/persons/horne-herbert-p/	http://viaf.org/viaf/54305591
https://personography.1890s.ca/persons/meredith-george/	http://viaf.org/viaf/14773801
https://personography.1890s.ca/persons/destree-olivier-georges/	http://viaf.org/viaf/2596938
https://personography.1890s.ca/persons/pirie-george/	http://viaf.org/viaf/14533527
https://personography.1890s.ca/persons/dearmer-percy/	http://viaf.org/viaf/71477336
https://personography.1890s.ca/persons/haynes-e-s-p/	http://viaf.org/viaf/39748170
https://personography.1890s.ca/persons/watson-william/	http://viaf.org/viaf/36926713
https://personography.1890s.ca/persons/pound-ezra/	http://viaf.org/viaf/24606774
https://personography.1890s.ca/persons/raleigh-walter-alexander/	http://viaf.org/viaf/95299659
https://personography.1890s.ca/persons/frampton-george/	http://viaf.org/viaf/74935781
https://personography.1890s.ca/persons/john-augustus/	http://viaf.org/viaf/30822552
https://personography.1890s.ca/persons/rutter-frank/	http://viaf.org/viaf/19839450
https://personography.1890s.ca/persons/monkhouse-william-cosmo/	http://viaf.org/viaf/6478224
https://personography.1890s.ca/persons/hinkson-henry-albert/	http://viaf.org/viaf/1629778
https://personography.1890s.ca/persons/meynell-viola/	http://viaf.org/viaf/927144783100673482115
https://personography.1890s.ca/persons/barnes-djuna/	http://viaf.org/viaf/110217112
https://personography.1890s.ca/persons/collier-robert-j/	http://viaf.org/viaf/93403584
https://personography.1890s.ca/persons/bayes-walter/	http://viaf.org/viaf/73726263
https://personography.1890s.ca/persons/crawfurd-oswald/	http://viaf.org/viaf/28224410
https://personography.1890s.ca/persons/noyes-alfred/	http://viaf.org/viaf/34584944
https://personography.1890s.ca/persons/makower-stanley-victor/	http://viaf.org/viaf/70561909
https://personography.1890s.ca/persons/benson-mary-eleanor/	http://viaf.org/viaf/162787520
https://personography.1890s.ca/persons/forbes-vivian/	http://viaf.org/viaf/95845307
https://personography.1890s.ca/persons/millais-john-everett/	http://viaf.org/viaf/51738621
https://personography.1890s.ca/persons/gandhi-mahatma/	http://viaf.org/viaf/71391324
https://personography.1890s.ca/persons/gore-booth-eva/	http://viaf.org/viaf/26133285
https://personography.1890s.ca/persons/guys-constantin/	http://viaf.org/viaf/55463100
https://personography.1890s.ca/persons/gotch-caroline/	http://viaf.org/viaf/73799049
https://personography.1890s.ca/persons/pissarro-camille/	http://viaf.org/viaf/14775224
https://personography.1890s.ca/persons/burn-murdoch-w-g/	http://viaf.org/viaf/48273756
https://personography.1890s.ca/persons/swinburne-algernon-charles/	http://viaf.org/viaf/41846937
https://personography.1890s.ca/persons/riviere-joan/	http://viaf.org/viaf/39459373
https://personography.1890s.ca/persons/smith-cicely-fox/	http://viaf.org/viaf/261558649
https://personography.1890s.ca/persons/craigie-pearl/	http://viaf.org/viaf/64816663
https://personography.1890s.ca/persons/bland-hubert/	http://viaf.org/viaf/57806600
https://personography.1890s.ca/persons/park-carton-moore/	http://viaf.org/viaf/266163376
https://personography.1890s.ca/persons/mcneill-whistler-james/	http://viaf.org/viaf/46804212
https://personography.1890s.ca/persons/manson-j-b/	http://viaf.org/viaf/6293246
https://personography.1890s.ca/persons/henley-w-e/	http://viaf.org/viaf/9863730
https://personography.1890s.ca/persons/heijermans-h/	http://viaf.org/viaf/32107862
https://personography.1890s.ca/persons/hichens-robert/	http://viaf.org/viaf/27093504
https://personography.1890s.ca/persons/woods-margaret-l/	http://viaf.org/viaf/57798517
https://personography.1890s.ca/persons/shiel-matthew/	http://viaf.org/viaf/54194618
https://personography.1890s.ca/persons/meunier-dauphin/	http://viaf.org/viaf/64771227
https://personography.1890s.ca/persons/crane-stephen/	http://viaf.org/viaf/100175928
https://personography.1890s.ca/persons/field-michael/	http://viaf.org/viaf/91439238
https://personography.1890s.ca/persons/gissing-george-robert/	http://viaf.org/viaf/59083174
https://personography.1890s.ca/persons/way-t-r/	http://viaf.org/viaf/50602312
https://personography.1890s.ca/persons/karageorgevitch-bojidar/	http://viaf.org/viaf/186929885
https://personography.1890s.ca/persons/mendes-catulle/	http://viaf.org/viaf/34460397
https://personography.1890s.ca/persons/noble-james-ashcroft/	http://viaf.org/viaf/92289029
https://personography.1890s.ca/persons/hind-charles-lewis/	http://viaf.org/viaf/93145857811723020091
https://personography.1890s.ca/persons/mokuchu-urushibara/	http://viaf.org/viaf/306353942
https://personography.1890s.ca/persons/unwin-stanley/	http://viaf.org/viaf/79399809
https://personography.1890s.ca/persons/bell-florence/	http://viaf.org/viaf/46824542
https://personography.1890s.ca/persons/howells-william-dean/	http://viaf.org/viaf/95191935
https://personography.1890s.ca/persons/moore-g-e/	http://viaf.org/viaf/88634979
https://personography.1890s.ca/persons/sterner-albert/	http://viaf.org/viaf/23661217
https://personography.1890s.ca/persons/serusier-paul/	http://viaf.org/viaf/32004766
https://personography.1890s.ca/persons/cooper-edith-emma/	http://viaf.org/viaf/35570741
https://personography.1890s.ca/persons/sleator-james/	http://viaf.org/viaf/96495909
https://personography.1890s.ca/persons/haggard-h-rider/	http://viaf.org/viaf/9841446
https://personography.1890s.ca/persons/phillips-stephen/	http://viaf.org/viaf/6410920
https://personography.1890s.ca/persons/thompson-charles-miner/	http://viaf.org/viaf/25829917
https://personography.1890s.ca/persons/tayler-a-chevallier/	http://viaf.org/viaf/307468445
https://personography.1890s.ca/persons/ricketts-charles/	http://viaf.org/viaf/60944
https://personography.1890s.ca/persons/rossetti-william-michael/	http://viaf.org/viaf/68944986
https://personography.1890s.ca/persons/dircks-rudolf/	http://viaf.org/viaf/165641333
https://personography.1890s.ca/persons/ives-frederick/	http://viaf.org/viaf/43579200
https://personography.1890s.ca/persons/balfour-marie-clothilde/	http://viaf.org/viaf/41483538
https://personography.1890s.ca/persons/baildon-h-bellyse/	http://viaf.org/viaf/65364175
https://personography.1890s.ca/persons/herbertson-andrew-john/	http://viaf.org/viaf/24985521
https://personography.1890s.ca/persons/wharton-edith/	http://viaf.org/viaf/17230986
https://personography.1890s.ca/persons/sickert-walter-richard/	http://viaf.org/viaf/39554004
https://personography.1890s.ca/persons/mackie-charles-hodge/	http://viaf.org/viaf/67654362
https://personography.1890s.ca/persons/blanche-jacques-e/	http://viaf.org/viaf/12305305
https://personography.1890s.ca/persons/toulouse-lautrec-henri/	http://viaf.org/viaf/32003649
https://personography.1890s.ca/persons/bateman-may/	http://viaf.org/viaf/16912541
https://personography.1890s.ca/persons/lombroso-cesare/	http://viaf.org/viaf/59148930
https://personography.1890s.ca/persons/sargent-john-s/	http://viaf.org/viaf/12466780
https://personography.1890s.ca/persons/kellock-brown-alexander/	http://viaf.org/viaf/95873269
https://personography.1890s.ca/persons/rogers-bruce/	http://viaf.org/viaf/66588089
https://personography.1890s.ca/persons/harrison-frederic/	http://viaf.org/viaf/2534316
https://personography.1890s.ca/persons/russell-t-baron/	http://viaf.org/viaf/63782828
https://personography.1890s.ca/persons/herbertson-dorothy/	http://viaf.org/viaf/194460016
https://personography.1890s.ca/persons/berenson-bernard/	http://viaf.org/viaf/9878607
https://personography.1890s.ca/persons/pissarro-lucien/	http://viaf.org/viaf/49320353
https://personography.1890s.ca/persons/noel-roden/	http://viaf.org/viaf/76438424
https://personography.1890s.ca/persons/moore-t-sturge/	http://viaf.org/viaf/24709904
https://personography.1890s.ca/persons/garnett-richard/	http://viaf.org/viaf/56625067
https://personography.1890s.ca/persons/gilchrist-r-murray/	http://viaf.org/viaf/53076686
https://personography.1890s.ca/persons/mgw/	http://viaf.org/viaf/179153953225205560746
https://personography.1890s.ca/persons/simons-l/	http://viaf.org/viaf/121572429
https://personography.1890s.ca/persons/swettenham-frank-athelstane/	http://viaf.org/viaf/42704800
https://personography.1890s.ca/persons/keating-sean/	http://viaf.org/viaf/96348059
https://personography.1890s.ca/persons/sidgwick-cecily/	http://viaf.org/viaf/49406168
https://personography.1890s.ca/persons/sullivan-e-j/	http://viaf.org/viaf/64279900
https://personography.1890s.ca/persons/reclus-elie/	http://viaf.org/viaf/76388157
https://personography.1890s.ca/persons/brough-robert/	http://viaf.org/viaf/33358014
https://personography.1890s.ca/persons/creighton-mandell/	http://viaf.org/viaf/18016107
https://personography.1890s.ca/persons/barrie-j-m/	http://viaf.org/viaf/64001320
https://personography.1890s.ca/persons/gotch-t-c/	http://viaf.org/viaf/8168101
https://personography.1890s.ca/persons/robinson-thomas-heath/	http://viaf.org/viaf/69735990
https://personography.1890s.ca/persons/wallas-graham/	http://viaf.org/viaf/34519818
https://personography.1890s.ca/persons/raven-hill-leonard/	http://viaf.org/viaf/64276221
https://personography.1890s.ca/persons/klein-abbe-felix/	http://viaf.org/viaf/66502457
https://personography.1890s.ca/persons/roberts-charles-g-d/	http://viaf.org/viaf/4975240
https://personography.1890s.ca/persons/sandys-emma/	http://viaf.org/viaf/95862180
https://personography.1890s.ca/persons/carr-joseph-comyns/	http://viaf.org/viaf/39762577
https://personography.1890s.ca/persons/sickert-oswald-adalbert/	http://viaf.org/viaf/96343315
https://personography.1890s.ca/persons/moore-arthur-collin/	http://viaf.org/viaf/268489100
https://personography.1890s.ca/persons/wyllarde-dolf/	http://viaf.org/viaf/61461413
https://personography.1890s.ca/persons/turner-reginald/	http://viaf.org/viaf/18379781
https://personography.1890s.ca/persons/gilkin-iwan/	http://viaf.org/viaf/65430678
https://personography.1890s.ca/persons/craft-percy-r/	http://viaf.org/viaf/95683487
https://personography.1890s.ca/persons/hickson-mabel/	http://viaf.org/viaf/22024756
https://personography.1890s.ca/persons/lane-hugh/	http://viaf.org/viaf/25513259
https://personography.1890s.ca/persons/forbes-elizabeth-stanhope/	http://viaf.org/viaf/107083557
https://personography.1890s.ca/persons/duncombe-jewell-l-c/	http://viaf.org/viaf/93938029
https://personography.1890s.ca/persons/radford-ada/	http://viaf.org/viaf/276095089
https://personography.1890s.ca/persons/park-james-stuart/	http://viaf.org/viaf/3696547
https://personography.1890s.ca/persons/yeats-jack-butler/	http://viaf.org/viaf/49340985
https://personography.1890s.ca/persons/mallarme-stephane/	http://viaf.org/viaf/51692711
https://personography.1890s.ca/persons/harper-edward-s/	http://viaf.org/viaf/95824646
https://personography.1890s.ca/persons/gwynn-stephen/	http://viaf.org/viaf/40302822
https://personography.1890s.ca/persons/coppee-francois/	http://viaf.org/viaf/46759181
https://personography.1890s.ca/persons/bottomley-gordon/	http://viaf.org/viaf/66734450
https://personography.1890s.ca/persons/farr-florence/	http://viaf.org/viaf/94732733
https://personography.1890s.ca/persons/benson-a-c/	http://viaf.org/viaf/27314600
https://personography.1890s.ca/persons/macbeth-ann/	http://viaf.org/viaf/43816057
https://personography.1890s.ca/persons/beerbohm-max/	http://viaf.org/viaf/41851464
https://personography.1890s.ca/persons/graham-gabriela-cunninghame/	http://viaf.org/viaf/54118500
https://personography.1890s.ca/persons/carpenter-edward/	http://viaf.org/viaf/89629669
https://personography.1890s.ca/persons/holmes-charles/	http://viaf.org/viaf/40793485
https://personography.1890s.ca/persons/caine-hall/	http://viaf.org/viaf/24735241
https://personography.1890s.ca/persons/marriott-watson-h-b/	http://viaf.org/viaf/15808796
https://personography.1890s.ca/persons/buchan-alexander/	http://viaf.org/viaf/262817315
https://personography.1890s.ca/persons/hunt-margaret-raine/	http://viaf.org/viaf/30676892
https://personography.1890s.ca/persons/seurat-georges/	http://viaf.org/viaf/24608076
https://personography.1890s.ca/persons/shaw-george-bernard/	http://viaf.org/viaf/89019752
https://personography.1890s.ca/persons/noguchi-yone/	http://viaf.org/viaf/68993658
https://personography.1890s.ca/persons/smith-gertrude/	http://viaf.org/viaf/75476737
https://personography.1890s.ca/persons/gaskin-arthur/	http://viaf.org/viaf/62961516
https://personography.1890s.ca/persons/chesterton-cecil/	http://viaf.org/viaf/100373196
https://personography.1890s.ca/persons/browning-robert/	http://viaf.org/viaf/24598774
https://personography.1890s.ca/persons/de-la-mare-walter/	http://viaf.org/viaf/2502254
https://personography.1890s.ca/persons/hunt-violet/	http://viaf.org/viaf/27871864
https://personography.1890s.ca/persons/costa-giovanna/	http://viaf.org/viaf/19845965
https://personography.1890s.ca/persons/cockerell-sydney/	http://viaf.org/viaf/64149146
