59098690	http://www.wikidata.org/entity/Q314938
59091022	http://www.wikidata.org/entity/Q532457
29655268	http://www.wikidata.org/entity/Q3068116
55722181	http://www.wikidata.org/entity/Q5338537
95791906	http://www.wikidata.org/entity/Q7660014
4925052	http://www.wikidata.org/entity/Q42443
41843502	http://www.wikidata.org/entity/Q270632
18712191	http://www.wikidata.org/entity/Q3087071
9451732	http://www.wikidata.org/entity/Q58071391
46796707	http://www.wikidata.org/entity/Q645138
17236711	http://www.wikidata.org/entity/Q708515
40202284	http://www.wikidata.org/entity/Q1291901
40174630	http://www.wikidata.org/entity/Q2076179
9854560	http://www.wikidata.org/entity/Q5582
66740555	http://www.wikidata.org/entity/Q250732
41886212	http://www.wikidata.org/entity/Q455618
19587068	http://www.wikidata.org/entity/Q5076691
95708345	http://www.wikidata.org/entity/Q15856365
12401964	http://www.wikidata.org/entity/Q609328
22523511	http://www.wikidata.org/entity/Q57452253
14956527	http://www.wikidata.org/entity/Q15455983
274962130	http://www.wikidata.org/entity/Q94915969
88998504	http://www.wikidata.org/entity/Q366285
27148613	http://www.wikidata.org/entity/Q545544
49215571	http://www.wikidata.org/entity/Q5109044
13403558	http://www.wikidata.org/entity/Q922483
89801735	http://www.wikidata.org/entity/Q207947
67710679	http://www.wikidata.org/entity/Q246953
41861098	http://www.wikidata.org/entity/Q552983
124704999	http://www.wikidata.org/entity/Q2545507
40994347	http://www.wikidata.org/entity/Q5364935
69202953	http://www.wikidata.org/entity/Q319843
63998216	http://www.wikidata.org/entity/Q555442
91189606	http://www.wikidata.org/entity/Q106286996
57400673	http://www.wikidata.org/entity/Q3220163
88892922	http://www.wikidata.org/entity/Q6376248
14767483	http://www.wikidata.org/entity/Q1349144
18031604	http://www.wikidata.org/entity/Q160252
22796772	http://www.wikidata.org/entity/Q61985964
64018563	http://www.wikidata.org/entity/Q93871
12310055	http://www.wikidata.org/entity/Q237951
22942767	http://www.wikidata.org/entity/Q326311
100254861	http://www.wikidata.org/entity/Q467494
22160365	http://www.wikidata.org/entity/Q965927
76235681	http://www.wikidata.org/entity/Q5080648
32792713	http://www.wikidata.org/entity/Q1548482
64011051	http://www.wikidata.org/entity/Q447268
76676450	http://www.wikidata.org/entity/Q7925749
84720639	http://www.wikidata.org/entity/Q7925754
20894219	http://www.wikidata.org/entity/Q1999522
51724541	http://www.wikidata.org/entity/Q216873
100205056	http://www.wikidata.org/entity/Q332442
25469415	http://www.wikidata.org/entity/Q1606851
89019809	http://www.wikidata.org/entity/Q1894800
17246640	http://www.wikidata.org/entity/Q2628443
11235357	http://www.wikidata.org/entity/Q2442215
19836932	http://www.wikidata.org/entity/Q3595615
93322398	http://www.wikidata.org/entity/Q7000426
27084321	http://www.wikidata.org/entity/Q952452
4951293	http://www.wikidata.org/entity/Q1406507
54148778	http://www.wikidata.org/entity/Q132805
68986036	http://www.wikidata.org/entity/Q240526
19686045	http://www.wikidata.org/entity/Q1293865
34623453	http://www.wikidata.org/entity/Q5481927
95767355	http://www.wikidata.org/entity/Q21461070
73868561	http://www.wikidata.org/entity/Q925991
47136932	http://www.wikidata.org/entity/Q7792747
95787770	http://www.wikidata.org/entity/Q17479358
71486164	http://www.wikidata.org/entity/Q70618
61540536	http://www.wikidata.org/entity/Q173869
90724564	http://www.wikidata.org/entity/Q2342103
902251	http://www.wikidata.org/entity/Q364658
34674307	http://www.wikidata.org/entity/Q2580416
72676219	http://www.wikidata.org/entity/Q5567501
22146194	http://www.wikidata.org/entity/Q182589
7293793	http://www.wikidata.org/entity/Q52150654
53681271	http://www.wikidata.org/entity/Q3182289
15654483	http://www.wikidata.org/entity/Q5339567
10727443	http://www.wikidata.org/entity/Q5498174
25977565	http://www.wikidata.org/entity/Q3189108
1629491	http://www.wikidata.org/entity/Q56816646
62872887	http://www.wikidata.org/entity/Q57316215
29554433	http://www.wikidata.org/entity/Q151180
23236518	http://www.wikidata.org/entity/Q60157022
10135545	http://www.wikidata.org/entity/Q466677
29549983	http://www.wikidata.org/entity/Q259921
26376093	http://www.wikidata.org/entity/Q106975366
27064953	http://www.wikidata.org/entity/Q37693
18260003	http://www.wikidata.org/entity/Q5591357
40600779	http://www.wikidata.org/entity/Q6140272
66782560	http://www.wikidata.org/entity/Q15982614
95738290	http://www.wikidata.org/entity/Q18783989
35824817	http://www.wikidata.org/entity/Q18912445
96483564	http://www.wikidata.org/entity/Q19375224
27094651	http://www.wikidata.org/entity/Q271878
55502069	http://www.wikidata.org/entity/Q1969016
7927147270665435700004	http://www.wikidata.org/entity/Q3666572
69944781	http://www.wikidata.org/entity/Q63348763
30567229	http://www.wikidata.org/entity/Q18209222
49249069	http://www.wikidata.org/entity/Q351410
54148064	http://www.wikidata.org/entity/Q2523100
56884111	http://www.wikidata.org/entity/Q6130844
36782198	http://www.wikidata.org/entity/Q7926244
2743707	http://www.wikidata.org/entity/Q3330788
78671985	http://www.wikidata.org/entity/Q5342322
95684288	http://www.wikidata.org/entity/Q18619382
95155403	http://www.wikidata.org/entity/Q3335
22246740	http://www.wikidata.org/entity/Q275367
59113521	http://www.wikidata.org/entity/Q333106
38158382	http://www.wikidata.org/entity/Q52150339
6319143	http://www.wikidata.org/entity/Q5499013
59083692	http://www.wikidata.org/entity/Q40826
19921345	http://www.wikidata.org/entity/Q273170
49240682	http://www.wikidata.org/entity/Q314158
40320240	http://www.wikidata.org/entity/Q3132896
89854554	http://www.wikidata.org/entity/Q4800629
89854554	http://www.wikidata.org/entity/Q4800629
54905611	http://www.wikidata.org/entity/Q5387022
311438099	http://www.wikidata.org/entity/Q13529891
37011079	http://www.wikidata.org/entity/Q823245
71760079	http://www.wikidata.org/entity/Q3743178
311427974	http://www.wikidata.org/entity/Q15998271
7386737	http://www.wikidata.org/entity/Q37327
5738401	http://www.wikidata.org/entity/Q5082131
10985416	http://www.wikidata.org/entity/Q2086752
44305889	http://www.wikidata.org/entity/Q213447
7479661	http://www.wikidata.org/entity/Q333641
69203479	http://www.wikidata.org/entity/Q5480742
56625773	http://www.wikidata.org/entity/Q125249
166848460	http://www.wikidata.org/entity/Q1331815
13729751	http://www.wikidata.org/entity/Q7367090
95150359	http://www.wikidata.org/entity/Q34970
97006424	http://www.wikidata.org/entity/Q42511
88739636	http://www.wikidata.org/entity/Q272566
36922724	http://www.wikidata.org/entity/Q3262830
49591342	http://www.wikidata.org/entity/Q5312472
67672911	http://www.wikidata.org/entity/Q7052323
95730543	http://www.wikidata.org/entity/Q7103894
34828402	http://www.wikidata.org/entity/Q16943924
108321467	http://www.wikidata.org/entity/Q236669
48393117	http://www.wikidata.org/entity/Q725248
57413861	http://www.wikidata.org/entity/Q5077351
15140186	http://www.wikidata.org/entity/Q5720507
8154449	http://www.wikidata.org/entity/Q881422
44667862	http://www.wikidata.org/entity/Q23704781
27834098	http://www.wikidata.org/entity/Q4349086
34464414	http://www.wikidata.org/entity/Q30875
39385478	http://www.wikidata.org/entity/Q40909
46778576	http://www.wikidata.org/entity/Q76189
44421776	http://www.wikidata.org/entity/Q367745
69166925	http://www.wikidata.org/entity/Q532958
50025249	http://www.wikidata.org/entity/Q981852
74024682	http://www.wikidata.org/entity/Q3719466
20479934	http://www.wikidata.org/entity/Q18922399
225424550	http://www.wikidata.org/entity/Q345905
95719732	http://www.wikidata.org/entity/Q1615451
34500799	http://www.wikidata.org/entity/Q7457028
62956525	http://www.wikidata.org/entity/Q34371031
41906115	http://www.wikidata.org/entity/Q52123337
213988041	http://www.wikidata.org/entity/Q517349
76588572	http://www.wikidata.org/entity/Q1284465
1703478	http://www.wikidata.org/entity/Q17309177
9791117	http://www.wikidata.org/entity/Q5481274
89798474	http://www.wikidata.org/entity/Q9358
35262867	http://www.wikidata.org/entity/Q273207
53064923	http://www.wikidata.org/entity/Q5540392
13443582	http://www.wikidata.org/entity/Q7367306
71294873	http://www.wikidata.org/entity/Q19792224
232045360	http://www.wikidata.org/entity/Q56661280
76523409	http://www.wikidata.org/entity/Q548004
75877864	http://www.wikidata.org/entity/Q1429384
79202867	http://www.wikidata.org/entity/Q3703382
93860812	http://www.wikidata.org/entity/Q70115674
262964098	http://www.wikidata.org/entity/Q94812560
46767282	http://www.wikidata.org/entity/Q151573
73868557	http://www.wikidata.org/entity/Q271032
95723874	http://www.wikidata.org/entity/Q1377833
232475963	http://www.wikidata.org/entity/Q56798393
316801958	http://www.wikidata.org/entity/Q65553629
71396743	http://www.wikidata.org/entity/Q20951
32039190	http://www.wikidata.org/entity/Q462363
16715773	http://www.wikidata.org/entity/Q710607
11222977	http://www.wikidata.org/entity/Q19647287
76190701	http://www.wikidata.org/entity/Q21454547
10202024	http://www.wikidata.org/entity/Q5082354
7255642	http://www.wikidata.org/entity/Q19585802
12187246	http://www.wikidata.org/entity/Q6376318
19953199	http://www.wikidata.org/entity/Q21278996
73868906	http://www.wikidata.org/entity/Q381848
75182558	http://www.wikidata.org/entity/Q18954031
309814120	http://www.wikidata.org/entity/Q21463713
10095477	http://www.wikidata.org/entity/Q183245
27072663	http://www.wikidata.org/entity/Q193680
4937684	http://www.wikidata.org/entity/Q755
5203036	http://www.wikidata.org/entity/Q5078832
54144439	http://www.wikidata.org/entity/Q41513
73862853	http://www.wikidata.org/entity/Q82925
27066001	http://www.wikidata.org/entity/Q3817198
22992458	http://www.wikidata.org/entity/Q5560797
72475845	http://www.wikidata.org/entity/Q7777214
18289692	http://www.wikidata.org/entity/Q568051
22251233	http://www.wikidata.org/entity/Q1585832
56217655	http://www.wikidata.org/entity/Q104917832
62322662	http://www.wikidata.org/entity/Q2547129
91022437	http://www.wikidata.org/entity/Q3990241
32014566	http://www.wikidata.org/entity/Q7702037
95720318	http://www.wikidata.org/entity/Q27068037
41925418	http://www.wikidata.org/entity/Q1905056
56772661	http://www.wikidata.org/entity/Q972661
96099805	http://www.wikidata.org/entity/Q7148348
96456212	http://www.wikidata.org/entity/Q19408892
316801958	http://www.wikidata.org/entity/Q65553629
32010055	http://www.wikidata.org/entity/Q168728
99297727	http://www.wikidata.org/entity/Q328513
5024984	http://www.wikidata.org/entity/Q526994
49214806	http://www.wikidata.org/entity/Q3090708
41781416	http://www.wikidata.org/entity/Q59554801
59120251	http://www.wikidata.org/entity/Q216406
32004745	http://www.wikidata.org/entity/Q1388518
14904505	http://www.wikidata.org/entity/Q5364510
22985477	http://www.wikidata.org/entity/Q947417
305822821	http://www.wikidata.org/entity/Q4394452
24731419	http://www.wikidata.org/entity/Q4710951
96425475	http://www.wikidata.org/entity/Q5361141
61937937	http://www.wikidata.org/entity/Q64685587
32001793	http://www.wikidata.org/entity/Q7199
76311714	http://www.wikidata.org/entity/Q34782
29832058	http://www.wikidata.org/entity/Q125057
74645185	http://www.wikidata.org/entity/Q220703
23146574975838152430	http://www.wikidata.org/entity/Q6759769
15100261	http://www.wikidata.org/entity/Q315422
7398349	http://www.wikidata.org/entity/Q849
94507588	http://www.wikidata.org/entity/Q8016
1994353	http://www.wikidata.org/entity/Q18936197
13336710	http://www.wikidata.org/entity/Q554629
61660866	http://www.wikidata.org/entity/Q1389068
23202552	http://www.wikidata.org/entity/Q94259846
95207986	http://www.wikidata.org/entity/Q1512
191862721	http://www.wikidata.org/entity/Q14774958
54420453	http://www.wikidata.org/entity/Q560115
50497548	http://www.wikidata.org/entity/Q7663337
100797641	http://www.wikidata.org/entity/Q65613270
41838530	http://www.wikidata.org/entity/Q172684
41848725	http://www.wikidata.org/entity/Q186748
49231990	http://www.wikidata.org/entity/Q313055
47034164	http://www.wikidata.org/entity/Q1291563
43464191	http://www.wikidata.org/entity/Q16389277
3252348	http://www.wikidata.org/entity/Q336433
5060337	http://www.wikidata.org/entity/Q932340
7661227	http://www.wikidata.org/entity/Q3378808
36919188	http://www.wikidata.org/entity/Q314897
46825663	http://www.wikidata.org/entity/Q449758
84255921	http://www.wikidata.org/entity/Q465000
11000494	http://www.wikidata.org/entity/Q745714
20543259	http://www.wikidata.org/entity/Q4864591
101042729	http://www.wikidata.org/entity/Q330323
68945598	http://www.wikidata.org/entity/Q471413
76389729	http://www.wikidata.org/entity/Q614071
56749375	http://www.wikidata.org/entity/Q3034215
20485679	http://www.wikidata.org/entity/Q250165
23686559	http://www.wikidata.org/entity/Q5512469
44300643	http://www.wikidata.org/entity/Q6882
62662175	http://www.wikidata.org/entity/Q48700
34630247	http://www.wikidata.org/entity/Q1288248
14767719	http://www.wikidata.org/entity/Q183167
66826682	http://www.wikidata.org/entity/Q437184
61558452	http://www.wikidata.org/entity/Q711666
72475845	http://www.wikidata.org/entity/Q7777214
36003274	http://www.wikidata.org/entity/Q13157611
54318960	http://www.wikidata.org/entity/Q14954804
39500310	http://www.wikidata.org/entity/Q538549
100201551	http://www.wikidata.org/entity/Q920293
59893499	http://www.wikidata.org/entity/Q4502845
106931776	http://www.wikidata.org/entity/Q17415327
19624857	http://www.wikidata.org/entity/Q60352157
32751257	http://www.wikidata.org/entity/Q2826927
47143145	http://www.wikidata.org/entity/Q1149445
56729836	http://www.wikidata.org/entity/Q943172
49591342	http://www.wikidata.org/entity/Q5312472
45035730	http://www.wikidata.org/entity/Q88465218
56609913	http://www.wikidata.org/entity/Q34969
27144257	http://www.wikidata.org/entity/Q1575288
48791206	http://www.wikidata.org/entity/Q3087117
21912185	http://www.wikidata.org/entity/Q5920392
19686406	http://www.wikidata.org/entity/Q5669
95809187	http://www.wikidata.org/entity/Q15453284
7391698	http://www.wikidata.org/entity/Q1359140
46751757	http://www.wikidata.org/entity/Q1352525
120695179	http://www.wikidata.org/entity/Q1419967
19689601	http://www.wikidata.org/entity/Q352528
12312890	http://www.wikidata.org/entity/Q469888
42634131	http://www.wikidata.org/entity/Q1131497
35249976	http://www.wikidata.org/entity/Q6376239
95809044	http://www.wikidata.org/entity/Q7154473
61552610	http://www.wikidata.org/entity/Q49484
122002241	http://www.wikidata.org/entity/Q275628
50614178	http://www.wikidata.org/entity/Q5364481
29527929	http://www.wikidata.org/entity/Q1231493
48181948	http://www.wikidata.org/entity/Q55720903
68937142	http://www.wikidata.org/entity/Q107002
39651418	http://www.wikidata.org/entity/Q941953
22150466	http://www.wikidata.org/entity/Q2741203
29770970	http://www.wikidata.org/entity/Q2061698
89818453	http://www.wikidata.org/entity/Q2641917
49352981	http://www.wikidata.org/entity/Q2884308
185064650	http://www.wikidata.org/entity/Q5548178
49081605	http://www.wikidata.org/entity/Q7050073
37189998	http://www.wikidata.org/entity/Q16750759
73860698	http://www.wikidata.org/entity/Q191023
49232071	http://www.wikidata.org/entity/Q216478
45106836	http://www.wikidata.org/entity/Q449136
65453680	http://www.wikidata.org/entity/Q2748699
54239311	http://www.wikidata.org/entity/Q742371
62347159	http://www.wikidata.org/entity/Q2984705
59464851	http://www.wikidata.org/entity/Q3182612
50659878	http://www.wikidata.org/entity/Q5289275
71199695	http://www.wikidata.org/entity/Q6261287
7405944	http://www.wikidata.org/entity/Q319829
101814329	http://www.wikidata.org/entity/Q97671665
50032226	http://www.wikidata.org/entity/Q1521460
2473791	http://www.wikidata.org/entity/Q49747
35397912	http://www.wikidata.org/entity/Q3404191
3545734	http://www.wikidata.org/entity/Q21069889
7394811	http://www.wikidata.org/entity/Q231708
7396281	http://www.wikidata.org/entity/Q493
227730597	http://www.wikidata.org/entity/Q2573180
37054187	http://www.wikidata.org/entity/Q5623020
95684288	http://www.wikidata.org/entity/Q18619382
29533491	http://www.wikidata.org/entity/Q2744998
71820798	http://www.wikidata.org/entity/Q3611689
13715100	http://www.wikidata.org/entity/Q4968247
10126116	http://www.wikidata.org/entity/Q52155552
86607236	http://www.wikidata.org/entity/Q242666
73968086	http://www.wikidata.org/entity/Q329854
24871500	http://www.wikidata.org/entity/Q4757582
17394443	http://www.wikidata.org/entity/Q2356757
28515172	http://www.wikidata.org/entity/Q18756922
95865097	http://www.wikidata.org/entity/Q1295781
61932982	http://www.wikidata.org/entity/Q15491484
66511085	http://www.wikidata.org/entity/Q184366
44549388	http://www.wikidata.org/entity/Q515745
39421155	http://www.wikidata.org/entity/Q730223
41959457	http://www.wikidata.org/entity/Q3381186
34827260	http://www.wikidata.org/entity/Q6235040
57960728	http://www.wikidata.org/entity/Q7364723
17097064	http://www.wikidata.org/entity/Q6470403
57406963	http://www.wikidata.org/entity/Q195768
95712891	http://www.wikidata.org/entity/Q281207
95187284	http://www.wikidata.org/entity/Q334970
22138375	http://www.wikidata.org/entity/Q596925
55066267	http://www.wikidata.org/entity/Q1743249
235154590089443080222	http://www.wikidata.org/entity/Q75939031
73885426	http://www.wikidata.org/entity/Q239540
34662644	http://www.wikidata.org/entity/Q274901
66470937	http://www.wikidata.org/entity/Q134942
121823798	http://www.wikidata.org/entity/Q366070
3387346	http://www.wikidata.org/entity/Q1470796
5303330	http://www.wikidata.org/entity/Q8015868
295379886	http://www.wikidata.org/entity/Q8017677
7511239	http://www.wikidata.org/entity/Q1364647
5082639	http://www.wikidata.org/entity/Q322871
2518292	http://www.wikidata.org/entity/Q7781472
291744233	http://www.wikidata.org/entity/Q6721409
6177661	http://www.wikidata.org/entity/Q7448927
44768621	http://www.wikidata.org/entity/Q258669
62486187	http://www.wikidata.org/entity/Q458169
42106129	http://www.wikidata.org/entity/Q5416441
95684430	http://www.wikidata.org/entity/Q6239495
27133330	http://www.wikidata.org/entity/Q97304
29550062	http://www.wikidata.org/entity/Q716197
54194438	http://www.wikidata.org/entity/Q781055
77119089	http://www.wikidata.org/entity/Q1364698
46793285	http://www.wikidata.org/entity/Q2331155
65490870	http://www.wikidata.org/entity/Q5301196
8191834	http://www.wikidata.org/entity/Q433136
41774835	http://www.wikidata.org/entity/Q56562495
98305187	http://www.wikidata.org/entity/Q1237675
22949653	http://www.wikidata.org/entity/Q360724
67261752	http://www.wikidata.org/entity/Q515845
51559279	http://www.wikidata.org/entity/Q1291577
109480709	http://www.wikidata.org/entity/Q16943961
291996145	http://www.wikidata.org/entity/Q18910748
41843119	http://www.wikidata.org/entity/Q780102
44386303	http://www.wikidata.org/entity/Q1363814
39650159	http://www.wikidata.org/entity/Q1989594
10144	http://www.wikidata.org/entity/Q949700
36920030	http://www.wikidata.org/entity/Q170509
66464527	http://www.wikidata.org/entity/Q333004
11004152	http://www.wikidata.org/entity/Q909223
64026547	http://www.wikidata.org/entity/Q1289140
76439526	http://www.wikidata.org/entity/Q2005797
68945580	http://www.wikidata.org/entity/Q2669614
24650758	http://www.wikidata.org/entity/Q6897658
133909	http://www.wikidata.org/entity/Q5393735
28430533	http://www.wikidata.org/entity/Q16522494
3250843	http://www.wikidata.org/entity/Q19825
32266244	http://www.wikidata.org/entity/Q766867
41884144	http://www.wikidata.org/entity/Q547470
66536648	http://www.wikidata.org/entity/Q19357014
122360942	http://www.wikidata.org/entity/Q49420693
2460156619142928780008	http://www.wikidata.org/entity/Q56563959
29583994	http://www.wikidata.org/entity/Q1963612
73859585	http://www.wikidata.org/entity/Q179126
50034113	http://www.wikidata.org/entity/Q5481946
4015070	http://www.wikidata.org/entity/Q1951367
72893011	http://www.wikidata.org/entity/Q20549504
49496594	http://www.wikidata.org/entity/Q21463973
43458819	http://www.wikidata.org/entity/Q16059680
12153936	http://www.wikidata.org/entity/Q5401286
15044075	http://www.wikidata.org/entity/Q344838
57665462	http://www.wikidata.org/entity/Q918605
64754739	http://www.wikidata.org/entity/Q6141491
95835366	http://www.wikidata.org/entity/Q21459918
64008239	http://www.wikidata.org/entity/Q309704
77424344	http://www.wikidata.org/entity/Q1740505
66552944	http://www.wikidata.org/entity/Q8743
57417858	http://www.wikidata.org/entity/Q274339
100175651	http://www.wikidata.org/entity/Q551574
66508882	http://www.wikidata.org/entity/Q82083
68925562	http://www.wikidata.org/entity/Q464318
49221488	http://www.wikidata.org/entity/Q771698
306161124	http://www.wikidata.org/entity/Q76085205
61539913	http://www.wikidata.org/entity/Q334633
38242134	http://www.wikidata.org/entity/Q5131232
71477336	http://www.wikidata.org/entity/Q7167305
10242705	http://www.wikidata.org/entity/Q8001969
1393709	http://www.wikidata.org/entity/Q3787384
95784593	http://www.wikidata.org/entity/Q15435269
39748297	http://www.wikidata.org/entity/Q18559818
44660990	http://www.wikidata.org/entity/Q558410
1629778	http://www.wikidata.org/entity/Q18911515
22020017	http://www.wikidata.org/entity/Q7087146
49229308	http://www.wikidata.org/entity/Q353857
74022344	http://www.wikidata.org/entity/Q660917
8135243	http://www.wikidata.org/entity/Q5499166
53877274	http://www.wikidata.org/entity/Q20733393
6478224	http://www.wikidata.org/entity/Q8007143
14773801	http://www.wikidata.org/entity/Q90238
40217163	http://www.wikidata.org/entity/Q463962
2596938	http://www.wikidata.org/entity/Q20667740
24606774	http://www.wikidata.org/entity/Q163366
95146331	http://www.wikidata.org/entity/Q731717
19839450	http://www.wikidata.org/entity/Q5489306
14533527	http://www.wikidata.org/entity/Q5543436
36926713	http://www.wikidata.org/entity/Q8020076
18300809	http://www.wikidata.org/entity/Q52156315
64101933	http://www.wikidata.org/entity/Q1807972
74935781	http://www.wikidata.org/entity/Q2265709
95299659	http://www.wikidata.org/entity/Q7965909
73529694	http://www.wikidata.org/entity/Q19921836
42658971	http://www.wikidata.org/entity/Q788163
39748170	http://www.wikidata.org/entity/Q5148741
92586838	http://www.wikidata.org/entity/Q18629603
12731529	http://www.wikidata.org/entity/Q16059858
46844904	http://www.wikidata.org/entity/Q203828
54305591	http://www.wikidata.org/entity/Q597283
112138456	http://www.wikidata.org/entity/Q2662935
22469411	http://www.wikidata.org/entity/Q5726292
73014818	http://www.wikidata.org/entity/Q7945340
14775224	http://www.wikidata.org/entity/Q134741
93145857811723020091	http://www.wikidata.org/entity/Q2959650
73726263	http://www.wikidata.org/entity/Q15998780
162787520	http://www.wikidata.org/entity/Q18756958
6293246	http://www.wikidata.org/entity/Q4309861
9863730	http://www.wikidata.org/entity/Q552617
46804212	http://www.wikidata.org/entity/Q203643
55463100	http://www.wikidata.org/entity/Q662943
34584944	http://www.wikidata.org/entity/Q1390604
34460397	http://www.wikidata.org/entity/Q971215
27093504	http://www.wikidata.org/entity/Q2037944
64771227	http://www.wikidata.org/entity/Q16969064
70561909	http://www.wikidata.org/entity/Q64685817
32107862	http://www.wikidata.org/entity/Q36771
927144783100673482115	http://www.wikidata.org/entity/Q2527389
26133285	http://www.wikidata.org/entity/Q5415056
186929885	http://www.wikidata.org/entity/Q7243837
79399809	http://www.wikidata.org/entity/Q95160
51738621	http://www.wikidata.org/entity/Q159606
100175928	http://www.wikidata.org/entity/Q206534
41846937	http://www.wikidata.org/entity/Q315511
54194618	http://www.wikidata.org/entity/Q2517956
306353942	http://www.wikidata.org/entity/Q7901558
92289029	http://www.wikidata.org/entity/Q28045365
71391324	http://www.wikidata.org/entity/Q1001
110217112	http://www.wikidata.org/entity/Q234721
59083174	http://www.wikidata.org/entity/Q369790
57806600	http://www.wikidata.org/entity/Q3141942
57798517	http://www.wikidata.org/entity/Q3846897
28224410	http://www.wikidata.org/entity/Q7108136
266163376	http://www.wikidata.org/entity/Q20054908
95845307	http://www.wikidata.org/entity/Q21463011
73799049	http://www.wikidata.org/entity/Q47451192
91439238	http://www.wikidata.org/entity/Q839369
64816663	http://www.wikidata.org/entity/Q1701256
39459373	http://www.wikidata.org/entity/Q3179615
50602312	http://www.wikidata.org/entity/Q7793581
12466780	http://www.wikidata.org/entity/Q155626
9841446	http://www.wikidata.org/entity/Q237196
32004766	http://www.wikidata.org/entity/Q326606
39554004	http://www.wikidata.org/entity/Q703369
56625067	http://www.wikidata.org/entity/Q718512
60944	http://www.wikidata.org/entity/Q2332695
6410920	http://www.wikidata.org/entity/Q4484168
17230986	http://www.wikidata.org/entity/Q276032
59148930	http://www.wikidata.org/entity/Q202420
76438424	http://www.wikidata.org/entity/Q2160989
2534316	http://www.wikidata.org/entity/Q347222
121572429	http://www.wikidata.org/entity/Q3229598
41483538	http://www.wikidata.org/entity/Q15985316
68944986	http://www.wikidata.org/entity/Q719428
95873269	http://www.wikidata.org/entity/Q20638120
9878607	http://www.wikidata.org/entity/Q359047
49320353	http://www.wikidata.org/entity/Q964608
67654362	http://www.wikidata.org/entity/Q19983495
65364175	http://www.wikidata.org/entity/Q55418716
32003649	http://www.wikidata.org/entity/Q82445
12305305	http://www.wikidata.org/entity/Q936710
24985521	http://www.wikidata.org/entity/Q19037079
25829917	http://www.wikidata.org/entity/Q105046512
24709904	http://www.wikidata.org/entity/Q506813
95191935	http://www.wikidata.org/entity/Q526709
43579200	http://www.wikidata.org/entity/Q1452713
66588089	http://www.wikidata.org/entity/Q4978228
96495909	http://www.wikidata.org/entity/Q6143275
88634979	http://www.wikidata.org/entity/Q295386
23661217	http://www.wikidata.org/entity/Q3608043
42704800	http://www.wikidata.org/entity/Q4209641
53076686	http://www.wikidata.org/entity/Q7347897
46824542	http://www.wikidata.org/entity/Q1239638
35570741	http://www.wikidata.org/entity/Q3719235
41851464	http://www.wikidata.org/entity/Q472071
8168101	http://www.wikidata.org/entity/Q635980
76388157	http://www.wikidata.org/entity/Q1227381
64276221	http://www.wikidata.org/entity/Q6525658
18379781	http://www.wikidata.org/entity/Q5856101
54118500	http://www.wikidata.org/entity/Q50298639
39762577	http://www.wikidata.org/entity/Q4215991
69735990	http://www.wikidata.org/entity/Q19635857
25513259	http://www.wikidata.org/entity/Q1548836
49406168	http://www.wikidata.org/entity/Q58237078
33358014	http://www.wikidata.org/entity/Q7341877
51692711	http://www.wikidata.org/entity/Q767
64001320	http://www.wikidata.org/entity/Q81796
27314600	http://www.wikidata.org/entity/Q708934
61461413	http://www.wikidata.org/entity/Q56574426
4975240	http://www.wikidata.org/entity/Q5077925
43816057	http://www.wikidata.org/entity/Q4275582
40302822	http://www.wikidata.org/entity/Q7609373
3696547	http://www.wikidata.org/entity/Q21458438
95824646	http://www.wikidata.org/entity/Q21456424
107083557	http://www.wikidata.org/entity/Q386247
49340985	http://www.wikidata.org/entity/Q560488
18016107	http://www.wikidata.org/entity/Q2362238
66502457	http://www.wikidata.org/entity/Q16750728
276095089	http://www.wikidata.org/entity/Q27678631
46759181	http://www.wikidata.org/entity/Q380277
40793485	http://www.wikidata.org/entity/Q536483
65430678	http://www.wikidata.org/entity/Q2243172
22024756	http://www.wikidata.org/entity/Q6721493
89629669	http://www.wikidata.org/entity/Q984217
94732733	http://www.wikidata.org/entity/Q3073976
96348059	http://www.wikidata.org/entity/Q3775893
96343315	http://www.wikidata.org/entity/Q7108164
64279900	http://www.wikidata.org/entity/Q574404
66734450	http://www.wikidata.org/entity/Q1537980
95683487	http://www.wikidata.org/entity/Q2070296
95862180	http://www.wikidata.org/entity/Q2511313
34519818	http://www.wikidata.org/entity/Q2551919
62961516	http://www.wikidata.org/entity/Q4798790
2502254	http://www.wikidata.org/entity/Q981086
24735241	http://www.wikidata.org/entity/Q2331144
30676892	http://www.wikidata.org/entity/Q6759824
27871864	http://www.wikidata.org/entity/Q1677011
100373196	http://www.wikidata.org/entity/Q2943680
15808796	http://www.wikidata.org/entity/Q5628075
24598774	http://www.wikidata.org/entity/Q233265
24608076	http://www.wikidata.org/entity/Q34013
89019752	http://www.wikidata.org/entity/Q19185
19845965	http://www.wikidata.org/entity/Q9268271
64149146	http://www.wikidata.org/entity/Q966843
68993658	http://www.wikidata.org/entity/Q1899252
