"Term ID","Term Permalink",xml_id,"Term Name","Term Slug","Parent ID","Parent Name","Parent Slug",Count
639,https://personography.1890s.ca/occupations/professional/,#PRO,Professional,professional,0,,,0
640,https://personography.1890s.ca/occupations/domestic/,#DOM,Domestic,domestic,0,,,0
641,https://personography.1890s.ca/occupations/commercial/,#COMR,Commercial,commercial,0,,,0
642,https://personography.1890s.ca/occupations/agricultural/,#AGRI,Agricultural,agricultural,0,,,0
643,https://personography.1890s.ca/occupations/industrial/,#INDT,Industrial,industrial,0,,,0
645,https://personography.1890s.ca/occupations/professional/national-defence/,#NDEF,"National defence",national-defence,639,Professional,professional,1
646,https://personography.1890s.ca/occupations/professional/professions/,#PROFS,Professions,professions,639,Professional,professional,2
647,https://personography.1890s.ca/occupations/domestic/domestic-service-or-office/,#DOMS,"Domestic service or office",domestic-service-or-office,640,Domestic,domestic,0
648,https://personography.1890s.ca/occupations/commercial/commercial-occupations/,#COMO,"Commercial occupations",commercial-occupations,641,Commercial,commercial,0
649,https://personography.1890s.ca/occupations/commercial/conveyance-of-people-goods-messages/,#COMC,"Conveyance of people goods messages",conveyance-of-people-goods-messages,641,Commercial,commercial,0
650,https://personography.1890s.ca/occupations/agricultural/agriculture/,#AGRA,Agriculture,agriculture,642,Agricultural,agricultural,0
651,https://personography.1890s.ca/occupations/agricultural/animals/,#AGAN,Animals,animals,642,Agricultural,agricultural,0
653,https://personography.1890s.ca/occupations/industrial/dealers-in-machines-and-implements/,#MACH,"Dealers in machines and implements",dealers-in-machines-and-implements,643,Industrial,industrial,0
656,https://personography.1890s.ca/occupations/industrial/workers-and-dealers-in-ships-and-boats/,#SHIP,"Workers and dealers in ships and boats",workers-and-dealers-in-ships-and-boats,643,Industrial,industrial,0
657,https://personography.1890s.ca/occupations/industrial/workers-and-dealers-in-chemicals-and-compounds/,#CHEM,"Workers and dealers in chemicals and compounds",workers-and-dealers-in-chemicals-and-compounds,643,Industrial,industrial,0
659,https://personography.1890s.ca/occupations/industrial/workers-and-dealers-in-food-and-lodging/,#FLOD,"Workers and dealers in food and lodging",workers-and-dealers-in-food-and-lodging,643,Industrial,industrial,0
660,https://personography.1890s.ca/occupations/industrial/workers-and-dealers-in-textile-fabrics/,#TEXL,"Workers and dealers in textile fabrics",workers-and-dealers-in-textile-fabrics,643,Industrial,industrial,0
661,https://personography.1890s.ca/occupations/industrial/workers-and-dealers-in-dress/,#DRES,"Workers and dealers in dress",workers-and-dealers-in-dress,643,Industrial,industrial,0
662,https://personography.1890s.ca/occupations/industrial/workers-and-dealers-in-various-animal-substances/,#ASUB,"Workers and dealers in various animal substances",workers-and-dealers-in-various-animal-substances,643,Industrial,industrial,0
663,https://personography.1890s.ca/occupations/industrial/workers-and-dealers-in-various-vegetable-substances/,#VSUB,"Workers and dealers in various vegetable substances",workers-and-dealers-in-various-vegetable-substances,643,Industrial,industrial,0
664,https://personography.1890s.ca/occupations/industrial/workers-and-dealers-in-various-mineral-substances/,#MSUB,"Workers and dealers in various mineral substances",workers-and-dealers-in-various-mineral-substances,643,Industrial,industrial,0
665,https://personography.1890s.ca/occupations/industrial/workers-and-dealers-in-general-or-unspecified-commodities/,#GCOM,"Workers and dealers in general or unspecified commodities",workers-and-dealers-in-general-or-unspecified-commodities,643,Industrial,industrial,0
670,https://personography.1890s.ca/occupations/professional/national-defence/army/,#ARMY,Army,army,645,"National defence",national-defence,1
671,https://personography.1890s.ca/occupations/professional/national-defence/navy/,#NAVY,Navy,navy,645,"National defence",national-defence,0
672,https://personography.1890s.ca/occupations/professional/professions/clerical/,#CLERI,Clerical,clerical,646,Professions,professions,0
673,https://personography.1890s.ca/occupations/professional/professions/legal/,#LEGL,Legal,legal,646,Professions,professions,0
674,https://personography.1890s.ca/occupations/professional/professions/medical/,#MEDI,Medical,medical,646,Professions,professions,0
675,https://personography.1890s.ca/occupations/professional/professions/educational/,#EDUC,Educational,educational,646,Professions,professions,1
676,https://personography.1890s.ca/occupations/professional/professions/literary-and-scientific-persons/,#LITSCI,"Literary and scientific persons",literary-and-scientific-persons,646,Professions,professions,1
677,https://personography.1890s.ca/occupations/professional/professions/engineers-and-surveyors/,#ENGS,"Engineers and surveyors",engineers-and-surveyors,646,Professions,professions,0
678,https://personography.1890s.ca/occupations/professional/professions/artists-professions/,#ARTS,Artists,artists-professions,646,Professions,professions,2
679,https://personography.1890s.ca/occupations/professional/professions/exhibitions-shows-games/,#SHOW,"Exhibitions shows games",exhibitions-shows-games,646,Professions,professions,0
680,https://personography.1890s.ca/occupations/professional/professions/other-professional-and-administrative-work/,#POTH,"Other professional and administrative work",other-professional-and-administrative-work,646,Professions,professions,0
681,https://personography.1890s.ca/occupations/domestic/domestic-service-or-office/domestic-service/,#DSER,"Domestic service",domestic-service,647,"Domestic service or office",domestic-service-or-office,0
682,https://personography.1890s.ca/occupations/domestic/domestic-service-or-office/other-service/,#OSER,"Other service",other-service,647,"Domestic service or office",domestic-service-or-office,0
683,https://personography.1890s.ca/occupations/commercial/commercial-occupations/merchants-and-agents/,#MERCH,"Merchants and agents",merchants-and-agents,648,"Commercial occupations",commercial-occupations,0
684,https://personography.1890s.ca/occupations/commercial/conveyance-of-people-goods-messages/on-railways/,#RAIL,"On railways",on-railways,649,"Conveyance of people goods messages",conveyance-of-people-goods-messages,0
685,https://personography.1890s.ca/occupations/commercial/conveyance-of-people-goods-messages/on-roads/,#ROAD,"On roads",on-roads,649,"Conveyance of people goods messages",conveyance-of-people-goods-messages,0
686,https://personography.1890s.ca/occupations/commercial/conveyance-of-people-goods-messages/on-canals-rivers-seas/,#CANAL,"On canals rivers seas",on-canals-rivers-seas,649,"Conveyance of people goods messages",conveyance-of-people-goods-messages,0
687,https://personography.1890s.ca/occupations/commercial/conveyance-of-people-goods-messages/storage-portage-messages/,#MESS,"Storage portage messages",storage-portage-messages,649,"Conveyance of people goods messages",conveyance-of-people-goods-messages,0
688,https://personography.1890s.ca/occupations/agricultural/agriculture/fields-and-pastures/,#PAST,"Fields and pastures",fields-and-pastures,650,Agriculture,agriculture,0
692,https://personography.1890s.ca/occupations/industrial/dealers-in-machines-and-implements/machines/,#MCHS,Machines,machines,653,"Dealers in machines and implements",dealers-in-machines-and-implements,0
693,https://personography.1890s.ca/occupations/industrial/dealers-in-machines-and-implements/tools-and-implements/,#TOOL,"Tools and implements",tools-and-implements,653,"Dealers in machines and implements",dealers-in-machines-and-implements,0
694,https://personography.1890s.ca/occupations/industrial/dealers-in-machines-and-implements/surgical-instrument-maker/,#SURG,"Surgical instrument maker",surgical-instrument-maker,653,"Dealers in machines and implements",dealers-in-machines-and-implements,0
695,https://personography.1890s.ca/occupations/industrial/dealers-in-machines-and-implements/arms-and-ordnance/,#ARMS,"Arms and ordnance",arms-and-ordnance,653,"Dealers in machines and implements",dealers-in-machines-and-implements,0
696,https://personography.1890s.ca/occupations/industrial/dealers-in-machines-and-implements/musical-instrument-maker/,#MMAK,"Musical instrument maker",musical-instrument-maker,653,"Dealers in machines and implements",dealers-in-machines-and-implements,0
697,https://personography.1890s.ca/occupations/industrial/dealers-in-machines-and-implements/type-dies-medals-coins/,#TYPE,"Type, dies, medals, coins",type-dies-medals-coins,653,"Dealers in machines and implements",dealers-in-machines-and-implements,0
698,https://personography.1890s.ca/occupations/industrial/dealers-in-machines-and-implements/tackle-for-sports-and-games/,#TACK,"Tackle for sports and games",tackle-for-sports-and-games,653,"Dealers in machines and implements",dealers-in-machines-and-implements,0
704,https://personography.1890s.ca/occupations/industrial/workers-and-dealers-in-ships-and-boats/hull/,#HULL,Hull,hull,656,"Workers and dealers in ships and boats",workers-and-dealers-in-ships-and-boats,0
705,https://personography.1890s.ca/occupations/industrial/workers-and-dealers-in-ships-and-boats/mast-rigging-etc/,#MAST,"Mast, rigging, etc.",mast-rigging-etc,656,"Workers and dealers in ships and boats",workers-and-dealers-in-ships-and-boats,0
708,https://personography.1890s.ca/occupations/industrial/workers-and-dealers-in-chemicals-and-compounds/drugs-other-chemicals-and-compounds-workers-and-dealers-in-chemicals-industrial/,#DRUG,"Drugs and other chemicals and compounds",drugs-other-chemicals-and-compounds-workers-and-dealers-in-chemicals-industrial,657,"Workers and dealers in chemicals and compounds",workers-and-dealers-in-chemicals-and-compounds,0
710,https://personography.1890s.ca/occupations/industrial/workers-and-dealers-in-food-and-lodging/board-and-lodging/,#BOARD,"Board and lodging",board-and-lodging,659,"Workers and dealers in food and lodging",workers-and-dealers-in-food-and-lodging,0
711,https://personography.1890s.ca/occupations/industrial/workers-and-dealers-in-food-and-lodging/spirituous-drinks/,#SPIRIT,"Spirituous drinks",spirituous-drinks,659,"Workers and dealers in food and lodging",workers-and-dealers-in-food-and-lodging,0
712,https://personography.1890s.ca/occupations/industrial/workers-and-dealers-in-food-and-lodging/food/,#FOOD,Food,food,659,"Workers and dealers in food and lodging",workers-and-dealers-in-food-and-lodging,0
713,https://personography.1890s.ca/occupations/industrial/workers-and-dealers-in-textile-fabrics/wool-and-worsted/,#WOOL,"Wool and worsted",wool-and-worsted,660,"Workers and dealers in textile fabrics",workers-and-dealers-in-textile-fabrics,0
714,https://personography.1890s.ca/occupations/industrial/workers-and-dealers-in-textile-fabrics/silk/,#SILK,Silk,silk,660,"Workers and dealers in textile fabrics",workers-and-dealers-in-textile-fabrics,0
715,https://personography.1890s.ca/occupations/industrial/workers-and-dealers-in-textile-fabrics/cotton-and-flax/,#COTT,"Cotton and flax",cotton-and-flax,660,"Workers and dealers in textile fabrics",workers-and-dealers-in-textile-fabrics,0
716,https://personography.1890s.ca/occupations/industrial/workers-and-dealers-in-textile-fabrics/hemp-and-other-fibrous-materials/,#HEMP,"Hemp and other fibrous materials",hemp-and-other-fibrous-materials,660,"Workers and dealers in textile fabrics",workers-and-dealers-in-textile-fabrics,0
717,https://personography.1890s.ca/occupations/industrial/workers-and-dealers-in-textile-fabrics/mixed-or-unspecified-materials/,#MUSP,"Mixed or unspecified materials",mixed-or-unspecified-materials,660,"Workers and dealers in textile fabrics",workers-and-dealers-in-textile-fabrics,0
719,https://personography.1890s.ca/occupations/industrial/workers-and-dealers-in-various-animal-substances/grease-gut-bone-horn-ivory-whalebone/,#GRGT,"Grease, gut, bone, horn, ivory, whalebone",grease-gut-bone-horn-ivory-whalebone,662,"Workers and dealers in various animal substances",workers-and-dealers-in-various-animal-substances,0
720,https://personography.1890s.ca/occupations/industrial/workers-and-dealers-in-various-animal-substances/skins/,#SKIN,Skins,skins,662,"Workers and dealers in various animal substances",workers-and-dealers-in-various-animal-substances,0
721,https://personography.1890s.ca/occupations/industrial/workers-and-dealers-in-various-animal-substances/hair-and-feathers/,#HAIR,"Hair and feathers",hair-and-feathers,662,"Workers and dealers in various animal substances",workers-and-dealers-in-various-animal-substances,0
722,https://personography.1890s.ca/occupations/industrial/workers-and-dealers-in-various-vegetable-substances/oils-gums-resins/,#OILS,"Oils, gums, resins",oils-gums-resins,663,"Workers and dealers in various vegetable substances",workers-and-dealers-in-various-vegetable-substances,0
723,https://personography.1890s.ca/occupations/industrial/workers-and-dealers-in-various-vegetable-substances/cane-rush-straw/,#CANE,"Cane, rush, straw",cane-rush-straw,663,"Workers and dealers in various vegetable substances",workers-and-dealers-in-various-vegetable-substances,0
724,https://personography.1890s.ca/occupations/industrial/workers-and-dealers-in-various-vegetable-substances/wood-and-bark/,#WOOD,"Wood and bark",wood-and-bark,663,"Workers and dealers in various vegetable substances",workers-and-dealers-in-various-vegetable-substances,0
725,https://personography.1890s.ca/occupations/industrial/workers-and-dealers-in-various-vegetable-substances/paper/,#PAPR,Paper,paper,663,"Workers and dealers in various vegetable substances",workers-and-dealers-in-various-vegetable-substances,0
726,https://personography.1890s.ca/occupations/industrial/workers-and-dealers-in-various-mineral-substances/miners/,#MINE,Miners,miners,664,"Workers and dealers in various mineral substances",workers-and-dealers-in-various-mineral-substances,0
727,https://personography.1890s.ca/occupations/industrial/workers-and-dealers-in-various-mineral-substances/coal-coal-gas-etc/,#COAL,"Coal, coal gas, etc.",coal-coal-gas-etc,664,"Workers and dealers in various mineral substances",workers-and-dealers-in-various-mineral-substances,0
728,https://personography.1890s.ca/occupations/industrial/workers-and-dealers-in-various-mineral-substances/stone-clay-road-making/,#STON,"Stone, clay, road making",stone-clay-road-making,664,"Workers and dealers in various mineral substances",workers-and-dealers-in-various-mineral-substances,0
729,https://personography.1890s.ca/occupations/industrial/workers-and-dealers-in-various-mineral-substances/earthenware-and-glass/,#EGLS,"Earthenware and glass",earthenware-and-glass,664,"Workers and dealers in various mineral substances",workers-and-dealers-in-various-mineral-substances,0
730,https://personography.1890s.ca/occupations/industrial/workers-and-dealers-in-various-mineral-substances/salt/,#SALT,Salt,salt,664,"Workers and dealers in various mineral substances",workers-and-dealers-in-various-mineral-substances,0
731,https://personography.1890s.ca/occupations/industrial/workers-and-dealers-in-various-mineral-substances/water/,#WATR,Water,water,664,"Workers and dealers in various mineral substances",workers-and-dealers-in-various-mineral-substances,0
732,https://personography.1890s.ca/occupations/industrial/workers-and-dealers-in-various-mineral-substances/precious-metals-and-jewellery/,#METAL,"Precious metals and jewellery",precious-metals-and-jewellery,664,"Workers and dealers in various mineral substances",workers-and-dealers-in-various-mineral-substances,1
733,https://personography.1890s.ca/occupations/industrial/workers-and-dealers-in-various-mineral-substances/iron-and-steel/,#IRONS,"Iron and steel",iron-and-steel,664,"Workers and dealers in various mineral substances",workers-and-dealers-in-various-mineral-substances,0
734,https://personography.1890s.ca/occupations/industrial/workers-and-dealers-in-various-mineral-substances/copper/,#COPR,Copper,copper,664,"Workers and dealers in various mineral substances",workers-and-dealers-in-various-mineral-substances,0
735,https://personography.1890s.ca/occupations/industrial/workers-and-dealers-in-various-mineral-substances/tin-and-zinc/,#TZIN,"Tin and zinc",tin-and-zinc,664,"Workers and dealers in various mineral substances",workers-and-dealers-in-various-mineral-substances,0
736,https://personography.1890s.ca/occupations/industrial/workers-and-dealers-in-various-mineral-substances/lead/,#LEAD,Lead,lead,664,"Workers and dealers in various mineral substances",workers-and-dealers-in-various-mineral-substances,0
738,https://personography.1890s.ca/occupations/industrial/workers-and-dealers-in-general-or-unspecified-commodities/makers-and-dealers-unspecified/,#UMDS,"Makers and dealers (unspecified)",makers-and-dealers-unspecified,665,"Workers and dealers in general or unspecified commodities",workers-and-dealers-in-general-or-unspecified-commodities,0
739,https://personography.1890s.ca/occupations/industrial/refuse-matters/,#REFM,"Refuse matters",refuse-matters,643,Industrial,industrial,0
740,https://personography.1890s.ca/occupations/agricultural/animals/cattle-rancher/,#RANC,"Cattle rancher",cattle-rancher,651,Animals,animals,1
742,https://personography.1890s.ca/occupations/professional/national-defence/army/chaplain/,#CHAP,Chaplain,chaplain,670,Army,army,1
743,https://personography.1890s.ca/occupations/professional/national-defence/army/raf-staff-officer/,#STOFF,"RAF staff officer",raf-staff-officer,670,Army,army,2
744,https://personography.1890s.ca/occupations/professional/national-defence/army/army-captain/,#CAPT,"Army captain",army-captain,670,Army,army,6
745,https://personography.1890s.ca/occupations/professional/national-defence/army/army-lieutenant/,#LIEU,"Army lieutenant",army-lieutenant,670,Army,army,6
746,https://personography.1890s.ca/occupations/professional/national-defence/army/army-officer/,#OFF,"Army officer",army-officer,670,Army,army,4
747,https://personography.1890s.ca/occupations/professional/national-defence/army/medical-corps-officer/,#MOFF,"Medical corps officer",medical-corps-officer,670,Army,army,1
748,https://personography.1890s.ca/occupations/professional/professions/artists-professions/painter/,#PAINT,Painter,painter,678,Artists,artists-professions,167
749,https://personography.1890s.ca/occupations/professional/professions/artists-professions/curator/,#CURA,Curator,curator,678,Artists,artists-professions,3
750,https://personography.1890s.ca/occupations/professional/professions/artists-professions/composer/,#COM,Composer,composer,678,Artists,artists-professions,4
751,https://personography.1890s.ca/occupations/professional/professions/artists-professions/musician/,#MUC,Musician,musician,678,Artists,artists-professions,4
752,https://personography.1890s.ca/occupations/professional/professions/exhibitions-shows-games/actor/,#ACT,Actor,actor,679,"Exhibitions shows games",exhibitions-shows-games,12
753,https://personography.1890s.ca/occupations/professional/professions/artists-professions/play-director/,#DIR,"Play director",play-director,678,Artists,artists-professions,3
754,https://personography.1890s.ca/occupations/professional/professions/artists-professions/script-reader/,#SCRE,"Script reader",script-reader,678,Artists,artists-professions,1
755,https://personography.1890s.ca/occupations/professional/professions/artists-professions/illustrator/,#ILL,Illustrator,illustrator,678,Artists,artists-professions,95
756,https://personography.1890s.ca/occupations/professional/professions/artists-professions/sculptor/,#SCULPT,Sculptor,sculptor,678,Artists,artists-professions,4
757,https://personography.1890s.ca/occupations/professional/professions/artists-professions/pictorial-engraver/,#EGV,"Pictorial engraver",pictorial-engraver,678,Artists,artists-professions,8
758,https://personography.1890s.ca/occupations/professional/professions/artists-professions/photographer/,#PHO,Photographer,photographer,678,Artists,artists-professions,4
759,https://personography.1890s.ca/occupations/professional/professions/artists-professions/photography-assistant/,#PHOA,"Photography assistant",photography-assistant,678,Artists,artists-professions,1
761,https://personography.1890s.ca/occupations/professional/professions/literary-and-scientific-persons/architectural-clerk/,#ARCL,"Architectural clerk",architectural-clerk,676,"Literary and scientific persons",literary-and-scientific-persons,1
762,https://personography.1890s.ca/occupations/professional/professions/artists-professions/draughtsperson/,#DRA,Draughtsperson,draughtsperson,678,Artists,artists-professions,2
767,https://personography.1890s.ca/occupations/industrial/books-newspapers-prints-maps-industrial/publisher-books-newspapers-prints-maps-industrial/,#PUB,Publisher,publisher-books-newspapers-prints-maps-industrial,977,"Books newspapers prints maps",books-newspapers-prints-maps-industrial,6
768,https://personography.1890s.ca/occupations/industrial/books-newspapers-prints-maps-industrial/publishing-reader-books-newspapers-prints-maps/,#PREA,"Publishing reader",publishing-reader-books-newspapers-prints-maps,977,"Books newspapers prints maps",books-newspapers-prints-maps-industrial,0
770,https://personography.1890s.ca/occupations/industrial/books-newspapers-prints-maps-industrial/bookseller-books-newspapers-prints-maps-industrial/,#BOOK2,Bookseller,bookseller-books-newspapers-prints-maps-industrial,977,"Books newspapers prints maps",books-newspapers-prints-maps-industrial,0
771,https://personography.1890s.ca/occupations/commercial/conveyance-of-people-goods-messages/on-canals-rivers-seas/master-mariner-on-canals-rivers-seas-conveyance-commercial/,#MMAR,"Master mariner",master-mariner-on-canals-rivers-seas-conveyance-commercial,686,"On canals rivers seas",on-canals-rivers-seas,1
772,https://personography.1890s.ca/occupations/professional/professions/clerical/priest/,#PST,Priest,priest,672,Clerical,clerical,5
773,https://personography.1890s.ca/occupations/professional/professions/clerical/curate/,#CUR,Curate,curate,672,Clerical,clerical,3
777,https://personography.1890s.ca/occupations/industrial/wallpaper-and-ornamental-tile-design-workers-and-dealers-in-houses-industrial/,#WDES,"Wallpaper and ornamental tile design",wallpaper-and-ornamental-tile-design-workers-and-dealers-in-houses-industrial,643,Industrial,industrial,0
778,https://personography.1890s.ca/occupations/industrial/draper-house-decorations-workers-and-dealers-in-houses-industrial/,#DRAP,Draper,draper-house-decorations-workers-and-dealers-in-houses-industrial,643,Industrial,industrial,0
779,https://personography.1890s.ca/occupations/industrial/workers-and-dealers-in-dress/milliner/,#MILL,Milliner,milliner,661,"Workers and dealers in dress",workers-and-dealers-in-dress,1
780,https://personography.1890s.ca/occupations/professional/professions/educational/lecturer-educational-professions/,#LEC,Lecturer,lecturer-educational-professions,675,Educational,educational,29
781,https://personography.1890s.ca/occupations/professional/professions/educational/senior-lecturer-educational-professions/,#SLEC,"Senior lecturer",senior-lecturer-educational-professions,675,Educational,educational,0
782,https://personography.1890s.ca/occupations/professional/professions/educational/reader/,#READ,Reader,reader,675,Educational,educational,0
783,https://personography.1890s.ca/occupations/professional/professions/educational/assistant-teacher/,#TAS,"Assistant teacher",assistant-teacher,675,Educational,educational,1
784,https://personography.1890s.ca/occupations/professional/professions/educational/teacher/,#TEAC,Teacher,teacher,675,Educational,educational,38
785,https://personography.1890s.ca/occupations/professional/professions/educational/private-tutor/,#TUT,"Private tutor",private-tutor,675,Educational,educational,4
786,https://personography.1890s.ca/occupations/professional/professions/educational/governess/,#GOVN,Governess,governess,675,Educational,educational,1
787,https://personography.1890s.ca/occupations/professional/professions/educational/professor/,#PROF,Professor,professor,675,Educational,educational,21
788,https://personography.1890s.ca/occupations/professional/professions/educational/department-or-college-head/,#DHEAD,"Department or college head",department-or-college-head,675,Educational,educational,5
789,https://personography.1890s.ca/occupations/professional/professions/educational/department-or-college-director/,#DDIR,"Department or college director",department-or-college-director,675,Educational,educational,5
790,https://personography.1890s.ca/occupations/professional/professions/educational/headmaster/,#HEAD,Headmaster,headmaster,675,Educational,educational,7
791,https://personography.1890s.ca/occupations/professional/professions/educational/examiner/,#EXAM,Examiner,examiner,675,Educational,educational,1
792,https://personography.1890s.ca/occupations/professional/professions/educational/superindendent/,#SUPER,Superindendent,superindendent,675,Educational,educational,1
793,https://personography.1890s.ca/occupations/professional/professions/educational/vice-chancellor-or-principal/,#VCPR,"Vice-chancellor or principal",vice-chancellor-or-principal,675,Educational,educational,3
794,https://personography.1890s.ca/occupations/professional/professions/educational/keeper/,#KEEP,Keeper,keeper,675,Educational,educational,1
795,https://personography.1890s.ca/occupations/industrial/workers-and-dealers-in-various-mineral-substances/earthenware-and-glass/pottery-designer/,#PDES,"Potter or pottery designer",pottery-designer,729,"Earthenware and glass",earthenware-and-glass,2
796,https://personography.1890s.ca/occupations/industrial/workers-and-dealers-in-various-mineral-substances/earthenware-and-glass/glassware-or-stained-glass-designer/,#GDES,"Glassware or stained glass designer",glassware-or-stained-glass-designer,729,"Earthenware and glass",earthenware-and-glass,6
797,https://personography.1890s.ca/occupations/professional/professions/engineers-and-surveyors/city-planner/,#CITY,"City planner",city-planner,677,"Engineers and surveyors",engineers-and-surveyors,1
798,https://personography.1890s.ca/occupations/professional/professions/engineers-and-surveyors/surveyor/,#SURV,Surveyor,surveyor,677,"Engineers and surveyors",engineers-and-surveyors,1
799,https://personography.1890s.ca/occupations/industrial/workers-and-dealers-in-chemicals-and-compounds/sugar-refinery-chemist-chemicals-and-compouds-industrial/,#SUGC,"Sugar refinery chemist",sugar-refinery-chemist-chemicals-and-compouds-industrial,657,"Workers and dealers in chemicals and compounds",workers-and-dealers-in-chemicals-and-compounds,1
801,https://personography.1890s.ca/occupations/professional/professions/legal/law-clerk/,#LAWC,"Law clerk",law-clerk,673,Legal,legal,6
802,https://personography.1890s.ca/occupations/professional/professions/legal/solicitor/,#SOL,Solicitor,solicitor,673,Legal,legal,6
803,https://personography.1890s.ca/occupations/professional/professions/legal/barrister/,#BAR,Barrister,barrister,673,Legal,legal,7
804,https://personography.1890s.ca/occupations/professional/professions/legal/justice-of-the-peace/,#JUST,"Justice of the peace",justice-of-the-peace,673,Legal,legal,1
805,https://personography.1890s.ca/occupations/professional/professions/literary-and-scientific-persons/museum-assistant/,#MUS,"Museum assistant",museum-assistant,676,"Literary and scientific persons",literary-and-scientific-persons,2
806,https://personography.1890s.ca/occupations/professional/professions/literary-and-scientific-persons/dramatist/,#PLAY,Dramatist,dramatist,676,"Literary and scientific persons",literary-and-scientific-persons,7
807,https://personography.1890s.ca/occupations/professional/professions/literary-and-scientific-persons/author/,#AUT,Author,author,676,"Literary and scientific persons",literary-and-scientific-persons,304
808,https://personography.1890s.ca/occupations/professional/professions/literary-and-scientific-persons/editor/,#EDT,Editor,editor,676,"Literary and scientific persons",literary-and-scientific-persons,62
809,https://personography.1890s.ca/occupations/professional/professions/literary-and-scientific-persons/assistant-editor/,#AEDT,"Assistant editor",assistant-editor,676,"Literary and scientific persons",literary-and-scientific-persons,2
810,https://personography.1890s.ca/occupations/professional/professions/literary-and-scientific-persons/journalist/,#JOU,Journalist,journalist,676,"Literary and scientific persons",literary-and-scientific-persons,139
811,https://personography.1890s.ca/occupations/professional/professions/literary-and-scientific-persons/translator/,#TRA,Translator,translator,676,"Literary and scientific persons",literary-and-scientific-persons,35
812,https://personography.1890s.ca/occupations/professional/professions/literary-and-scientific-persons/sociologist/,#SOCI,Sociologist,sociologist,676,"Literary and scientific persons",literary-and-scientific-persons,1
813,https://personography.1890s.ca/occupations/professional/professions/literary-and-scientific-persons/scientist/,#SCIE,Scientist,scientist,676,"Literary and scientific persons",literary-and-scientific-persons,1
814,https://personography.1890s.ca/occupations/professional/professions/literary-and-scientific-persons/sexologist/,#SEX,Sexologist,sexologist,676,"Literary and scientific persons",literary-and-scientific-persons,1
815,https://personography.1890s.ca/occupations/professional/professions/literary-and-scientific-persons/criminologist/,#CRIM,Criminologist,criminologist,676,"Literary and scientific persons",literary-and-scientific-persons,1
816,https://personography.1890s.ca/occupations/professional/professions/literary-and-scientific-persons/geographer/,#GEOG,Geographer,geographer,676,"Literary and scientific persons",literary-and-scientific-persons,2
817,https://personography.1890s.ca/occupations/professional/professions/medical/general-physician/,#GPH,"General physician",general-physician,674,Medical,medical,3
818,https://personography.1890s.ca/occupations/professional/professions/medical/asylum-director/,#ADIR,"Asylum director",asylum-director,674,Medical,medical,1
819,https://personography.1890s.ca/occupations/professional/professions/medical/nurse/,#NUR,Nurse,nurse,674,Medical,medical,1
820,https://personography.1890s.ca/occupations/commercial/commercial-occupations/merchants-and-agents/accountant/,#ACCT,Accountant,accountant,683,"Merchants and agents",merchants-and-agents,2
821,https://personography.1890s.ca/occupations/commercial/commercial-occupations/merchants-and-agents/estate-agency-clerk/,#ESTC,"Estate agency clerk",estate-agency-clerk,683,"Merchants and agents",merchants-and-agents,1
822,https://personography.1890s.ca/occupations/commercial/commercial-occupations/merchants-and-agents/financial-agent/,#FINA,"Financial agent",financial-agent,683,"Merchants and agents",merchants-and-agents,1
823,https://personography.1890s.ca/occupations/commercial/commercial-occupations/merchants-and-agents/banker/,#BAN,Banker,banker,683,"Merchants and agents",merchants-and-agents,2
824,https://personography.1890s.ca/occupations/commercial/commercial-occupations/merchants-and-agents/bank-clerk/,#BANC,"Bank clerk",bank-clerk,683,"Merchants and agents",merchants-and-agents,5
825,https://personography.1890s.ca/occupations/commercial/commercial-occupations/merchants-and-agents/advertising-agent/,#ADV,"Advertising agent",advertising-agent,683,"Merchants and agents",merchants-and-agents,1
826,https://personography.1890s.ca/occupations/commercial/commercial-occupations/merchants-and-agents/railway-clearing-house-clerk/,#RAIC,"Railway Clearing House clerk",railway-clearing-house-clerk,683,"Merchants and agents",merchants-and-agents,1
827,https://personography.1890s.ca/occupations/commercial/commercial-occupations/merchants-and-agents/board-of-trade-clerk/,#BOTC,"Board of Trade clerk",board-of-trade-clerk,683,"Merchants and agents",merchants-and-agents,1
828,https://personography.1890s.ca/occupations/commercial/commercial-occupations/merchants-and-agents/salesperson/,#SALE,Salesperson,salesperson,683,"Merchants and agents",merchants-and-agents,1
829,https://personography.1890s.ca/occupations/commercial/commercial-occupations/merchants-and-agents/thread-firm-clerk/,#TFCL,"Thread firm clerk",thread-firm-clerk,683,"Merchants and agents",merchants-and-agents,1
830,https://personography.1890s.ca/occupations/commercial/commercial-occupations/merchants-and-agents/secretary-of-commercial-company/,#SECO,"Secretary of commercial company",secretary-of-commercial-company,683,"Merchants and agents",merchants-and-agents,1
831,https://personography.1890s.ca/occupations/commercial/commercial-occupations/merchants-and-agents/insurance-clerk/,#INCLK,"Insurance clerk",insurance-clerk,683,"Merchants and agents",merchants-and-agents,2
832,https://personography.1890s.ca/occupations/commercial/conveyance-of-people-goods-messages/storage-portage-messages/telephone-company-manager/,#TELE,"Telephone company manager",telephone-company-manager,687,"Storage portage messages",storage-portage-messages,0
833,https://personography.1890s.ca/occupations/commercial/conveyance-of-people-goods-messages/storage-portage-messages/telegraph-clerk/,#TELC,"Telegraph clerk",telegraph-clerk,687,"Storage portage messages",storage-portage-messages,0
834,https://personography.1890s.ca/occupations/industrial/workers-and-dealers-in-various-mineral-substances/precious-metals-and-jewellery/jewellery-designer/,#JDES,"Jewellery designer",jewellery-designer,732,"Precious metals and jewellery",precious-metals-and-jewellery,6
835,https://personography.1890s.ca/occupations/industrial/workers-and-dealers-in-various-mineral-substances/foundry-timekeeper-workers-and-dealers-in-various-mineral-substances/,#FOU,"Foundry timekeeper",foundry-timekeeper-workers-and-dealers-in-various-mineral-substances,664,"Workers and dealers in various mineral substances",workers-and-dealers-in-various-mineral-substances,0
836,https://personography.1890s.ca/occupations/industrial/workers-and-dealers-in-textile-fabrics/textile-and-embroidery-design/,#TDES,"Textile and embroidery design",textile-and-embroidery-design,660,"Workers and dealers in textile fabrics",workers-and-dealers-in-textile-fabrics,9
845,https://personography.1890s.ca/occupations/professional/national-government-civil-service-general-and-local-government-professional/inspector-of-returns-ministry-of-education-national-government/,#IRET,"Inspector of returns for Ministry of Education",inspector-of-returns-ministry-of-education-national-government,975,"National government",national-government-civil-service-general-and-local-government-professional,0
846,https://personography.1890s.ca/occupations/domestic/domestic-service-or-office/other-service/travel-companion/,#TCOM,"Travel companion",travel-companion,682,"Other service",other-service,1
847,https://personography.1890s.ca/occupations/professional/professions/other-professional-and-administrative-work/secretary-general-of-save-the-children-international/,#SSTC,"Secretary general of Save the Children International",secretary-general-of-save-the-children-international,680,"Other professional and administrative work",other-professional-and-administrative-work,1
848,https://personography.1890s.ca/occupations/professional/professions/other-professional-and-administrative-work/landlord/,#LAND,Landlord,landlord,680,"Other professional and administrative work",other-professional-and-administrative-work,3
849,https://personography.1890s.ca/occupations/professional/professions/exhibitions-shows-games/singer/,#SING,Singer,singer,679,"Exhibitions shows games",exhibitions-shows-games,1
850,https://personography.1890s.ca/occupations/commercial/conveyance-of-people-goods-messages/storage-portage-messages/postal-worker/,#PWOR,"Postal worker",postal-worker,687,"Storage portage messages",storage-portage-messages,1
851,https://personography.1890s.ca/occupations/professional/professions/educational/secretary-at-educational-institution/,#SECE,"Secretary at educational institution",secretary-at-educational-institution,675,Educational,educational,0
852,https://personography.1890s.ca/occupations/professional/professions/exhibitions-shows-games/theatre-director/,,"Theatre director",theatre-director,679,"Exhibitions shows games",exhibitions-shows-games,3
854,https://personography.1890s.ca/occupations/professional/professions/exhibitions-shows-games/stage-designer/,,"Stage designer",stage-designer,679,"Exhibitions shows games",exhibitions-shows-games,3
855,https://personography.1890s.ca/occupations/industrial/workers-and-dealers-in-dress/costume-designer/,,"Costume designer",costume-designer,661,"Workers and dealers in dress",workers-and-dealers-in-dress,1
856,https://personography.1890s.ca/occupations/professional/professions/exhibitions-shows-games/stage-manager/,,"Stage manager",stage-manager,679,"Exhibitions shows games",exhibitions-shows-games,3
857,https://personography.1890s.ca/occupations/professional/professions/exhibitions-shows-games/theatre-producer/,,"Theatre producer",theatre-producer,679,"Exhibitions shows games",exhibitions-shows-games,2
858,https://personography.1890s.ca/occupations/commercial/conveyance-of-people-goods-messages/on-canals-rivers-seas/merchant-marine-officer/,,"Merchant marine officer",merchant-marine-officer,686,"On canals rivers seas",on-canals-rivers-seas,0
859,https://personography.1890s.ca/occupations/professional/professions/literary-and-scientific-persons/poet-laureate/,,"Poet laureate",poet-laureate,676,"Literary and scientific persons",literary-and-scientific-persons,1
862,https://personography.1890s.ca/occupations/professional/professions/medical/surgeon/,#SURG,Surgeon,surgeon,674,Medical,medical,1
864,https://personography.1890s.ca/occupations/commercial/commercial-occupations/merchants-and-agents/import-firm-clerk/,,"Import firm clerk",import-firm-clerk,683,"Merchants and agents",merchants-and-agents,0
866,https://personography.1890s.ca/occupations/professional/professions/artists-professions/art-gallery-director/,#AGDIR,"Art gallery director",art-gallery-director,678,Artists,artists-professions,1
869,https://personography.1890s.ca/occupations/industrial/inventor/,#INVE,Inventor,inventor,643,Industrial,industrial,1
871,https://personography.1890s.ca/occupations/industrial/books-newspapers-prints-maps-industrial/typographer-books-newspapers-prints-maps-industrial/,#TYPE,Typographer,typographer-books-newspapers-prints-maps-industrial,977,"Books newspapers prints maps",books-newspapers-prints-maps-industrial,2
874,https://personography.1890s.ca/occupations/professional/professions/literary-and-scientific-persons/museum-director/,#MUSDIR,"Museum director",museum-director,676,"Literary and scientific persons",literary-and-scientific-persons,2
875,https://personography.1890s.ca/occupations/professional/national-defence/army/raf-lieutenant/,#RAFLT,"RAF lieutenant",raf-lieutenant,670,Army,army,0
884,https://personography.1890s.ca/occupations/professional/general-and-local-government-professional/,,"General and local government",general-and-local-government-professional,639,Professional,professional,0
912,https://personography.1890s.ca/occupations/industrial/workers-and-dealers-in-various-mineral-substances/other/,,Other,other,664,"Workers and dealers in various mineral substances",workers-and-dealers-in-various-mineral-substances,1
944,https://personography.1890s.ca/occupations/professional/professions/exhibitions-shows-games/theatre-proprietor/,#THEPROP,"Theatre proprietor",theatre-proprietor,679,"Exhibitions shows games",exhibitions-shows-games,2
945,https://personography.1890s.ca/occupations/professional/national-defence/intel-operative/,#INTOP,"Intelligence operative",intel-operative,645,"National defence",national-defence,2
947,https://personography.1890s.ca/occupations/professional/professions/literary-and-scientific-persons/architect-literary-and-scientific-persons/,,Architect,architect-literary-and-scientific-persons,676,"Literary and scientific persons",literary-and-scientific-persons,1
948,https://personography.1890s.ca/occupations/professional/professions/other-professional-and-administrative-work/secretary/,,Secretary,secretary,680,"Other professional and administrative work",other-professional-and-administrative-work,1
953,https://personography.1890s.ca/occupations/industrial/workers-and-dealers-in-chemicals-and-compounds/chemist-other-chemicals-and-compounds/,,Chemist,chemist-other-chemicals-and-compounds,657,"Workers and dealers in chemicals and compounds",workers-and-dealers-in-chemicals-and-compounds,1
954,https://personography.1890s.ca/occupations/industrial/workers-and-dealers-in-chemicals-and-compounds/drugs-other-chemicals-and-compounds-workers-and-dealers-in-chemicals-industrial/druggist-other-chemicals-and-compounds-industrial/,,Druggist,druggist-other-chemicals-and-compounds-industrial,708,"Drugs and other chemicals and compounds",drugs-other-chemicals-and-compounds-workers-and-dealers-in-chemicals-industrial,1
958,https://personography.1890s.ca/occupations/commercial/commercial-occupations/merchants-and-agents/art-agent/,,"Art agent",art-agent,683,"Merchants and agents",merchants-and-agents,1
973,https://personography.1890s.ca/occupations/professional/national-defence/army/army-administrator/,,"Army administrator",army-administrator,670,Army,army,1
975,https://personography.1890s.ca/occupations/professional/national-government-civil-service-general-and-local-government-professional/,,"National government",national-government-civil-service-general-and-local-government-professional,639,Professional,professional,0
976,https://personography.1890s.ca/occupations/professional/national-government-civil-service-general-and-local-government-professional/diplomatic-attache-national-government-civil-service-general-and-local-government-professional/,,"Diplomatic attache",diplomatic-attache-national-government-civil-service-general-and-local-government-professional,975,"National government",national-government-civil-service-general-and-local-government-professional,1
977,https://personography.1890s.ca/occupations/industrial/books-newspapers-prints-maps-industrial/,,"Books newspapers prints maps",books-newspapers-prints-maps-industrial,643,Industrial,industrial,0
979,https://personography.1890s.ca/occupations/industrial/books-newspapers-prints-maps-industrial/book-designer-books-newspapers-prints-maps-industrial/,#BOOKDES,"Book designer",book-designer-books-newspapers-prints-maps-industrial,977,"Books newspapers prints maps",books-newspapers-prints-maps-industrial,13
980,https://personography.1890s.ca/occupations/industrial/books-newspapers-prints-maps-industrial/engraving-firm-proprietor-books-newspapers-prints-maps-industrial/,,"Engraving firm proprietor",engraving-firm-proprietor-books-newspapers-prints-maps-industrial,977,"Books newspapers prints maps",books-newspapers-prints-maps-industrial,4
981,https://personography.1890s.ca/occupations/professional/national-government-civil-service-general-and-local-government-professional/govenor-general-of-canada-national-government-civil-service-general-and-local-government-professional/,,"Govenor general of Canada",govenor-general-of-canada-national-government-civil-service-general-and-local-government-professional,975,"National government",national-government-civil-service-general-and-local-government-professional,1
983,https://personography.1890s.ca/occupations/professional/national-government-civil-service-general-and-local-government-professional/president-of-indian-national-congress-national-government-civil-service-general-and-local-government-professional/,,"President of Indian National Congress",president-of-indian-national-congress-national-government-civil-service-general-and-local-government-professional,975,"National government",national-government-civil-service-general-and-local-government-professional,0
988,https://personography.1890s.ca/occupations/commercial/commercial-occupations/merchants-and-agents/literary-agent-merchants-and-agents-commercial-occupations-commercial/,,"Literary agent",literary-agent-merchants-and-agents-commercial-occupations-commercial,683,"Merchants and agents",merchants-and-agents,1
989,https://personography.1890s.ca/occupations/industrial/books-newspapers-prints-maps-industrial/librarian-books-newspapers-prints-maps-industrial/,,Librarian,librarian-books-newspapers-prints-maps-industrial,977,"Books newspapers prints maps",books-newspapers-prints-maps-industrial,6
990,https://personography.1890s.ca/occupations/professional/east-indian-and-colonial-service-civil-service-general-and-local-government-professional/,,"East Indian and colonial service",east-indian-and-colonial-service-civil-service-general-and-local-government-professional,639,Professional,professional,0
991,https://personography.1890s.ca/occupations/professional/east-indian-and-colonial-service-civil-service-general-and-local-government-professional/british-foreign-office-clerk-east-indian-and-colonial-service-civil-service-general-and-local-government-professional/,,"British foreign office clerk",british-foreign-office-clerk-east-indian-and-colonial-service-civil-service-general-and-local-government-professional,990,"East Indian and colonial service",east-indian-and-colonial-service-civil-service-general-and-local-government-professional,3
992,https://personography.1890s.ca/occupations/professional/east-indian-and-colonial-service-civil-service-general-and-local-government-professional/british-foreign-office-head-east-indian-and-colonial-service-civil-service-general-and-local-government-professional/,,"British foreign office head",british-foreign-office-head-east-indian-and-colonial-service-civil-service-general-and-local-government-professional,990,"East Indian and colonial service",east-indian-and-colonial-service-civil-service-general-and-local-government-professional,1
993,https://personography.1890s.ca/occupations/industrial/books-newspapers-prints-maps-industrial/printer-books-newspapers-prints-maps-industrial/,#PRINT,Printer,printer-books-newspapers-prints-maps-industrial,977,"Books newspapers prints maps",books-newspapers-prints-maps-industrial,5
994,https://personography.1890s.ca/occupations/industrial/books-newspapers-prints-maps-industrial/library-clerk-books-newspapers-prints-maps-industrial/,,"Library clerk",library-clerk-books-newspapers-prints-maps-industrial,977,"Books newspapers prints maps",books-newspapers-prints-maps-industrial,2
996,https://personography.1890s.ca/occupations/industrial/furniture-design-workers-and-dealers-in-houses-furniture-decoration-industrial/,,"Furniture designer",furniture-design-workers-and-dealers-in-houses-furniture-decoration-industrial,643,Industrial,industrial,3
997,https://personography.1890s.ca/occupations/professional/national-government-civil-service-general-and-local-government-professional/president-of-ireland-national-government-civil-service-general-and-local-government-professional/,,"President of Ireland",president-of-ireland-national-government-civil-service-general-and-local-government-professional,975,"National government",national-government-civil-service-general-and-local-government-professional,1
1007,https://personography.1890s.ca/occupations/professional/national-government-civil-service-general-and-local-government-professional/war-pensions-committee-coordinator-civil-service-general-and-local-government-professional/,,"War Pensions Committee coordinator",war-pensions-committee-coordinator-civil-service-general-and-local-government-professional,975,"National government",national-government-civil-service-general-and-local-government-professional,1
1010,https://personography.1890s.ca/occupations/professional/national-government-civil-service-general-and-local-government-professional/consul-national-government-civil-service-general-and-local-government-professional/,,Consul,consul-national-government-civil-service-general-and-local-government-professional,975,"National government",national-government-civil-service-general-and-local-government-professional,1
1012,https://personography.1890s.ca/occupations/professional/national-government-civil-service-general-and-local-government-professional/civil-servant-national-government-civil-service-general-and-local-government-professional/,,"Civil servant",civil-servant-national-government-civil-service-general-and-local-government-professional,975,"National government",national-government-civil-service-general-and-local-government-professional,4
1013,https://personography.1890s.ca/occupations/professional/national-government-civil-service-general-and-local-government-professional/director-of-british-press-service-national-government-civil-service-general-and-local-government-professional/,,"Director of British Press Service",director-of-british-press-service-national-government-civil-service-general-and-local-government-professional,975,"National government",national-government-civil-service-general-and-local-government-professional,1
1014,https://personography.1890s.ca/occupations/professional/national-government-civil-service-general-and-local-government-professional/secretary-of-irish-unionist-alliance-national-government-civil-service-general-and-local-government-professional/,,"Secretary of Irish Unionist Alliance",secretary-of-irish-unionist-alliance-national-government-civil-service-general-and-local-government-professional,975,"National government",national-government-civil-service-general-and-local-government-professional,1
1015,https://personography.1890s.ca/occupations/professional/east-indian-and-colonial-service-civil-service-general-and-local-government-professional/colonial-administrator-east-indian-and-colonial-service-civil-service-general-and-local-government-professional/,,"Colonial administrator",colonial-administrator-east-indian-and-colonial-service-civil-service-general-and-local-government-professional,990,"East Indian and colonial service",east-indian-and-colonial-service-civil-service-general-and-local-government-professional,1
1018,https://personography.1890s.ca/occupations/industrial/books-newspapers-prints-maps-industrial/printseller-books-newspapers-prints-maps-industrial/,,Printseller,printseller-books-newspapers-prints-maps-industrial,977,"Books newspapers prints maps",books-newspapers-prints-maps-industrial,1
1019,https://personography.1890s.ca/occupations/industrial/books-newspapers-prints-maps-industrial/lithographer-books-newspapers-prints-maps-industrial/,,Lithographer,lithographer-books-newspapers-prints-maps-industrial,977,"Books newspapers prints maps",books-newspapers-prints-maps-industrial,3
1020,https://personography.1890s.ca/occupations/professional/local-government-civil-service-general-and-local-government-professional/,,"Local government",local-government-civil-service-general-and-local-government-professional,639,Professional,professional,0
1021,https://personography.1890s.ca/occupations/professional/local-government-civil-service-general-and-local-government-professional/municipal-mayor-local-government-civil-service-general-and-local-government-professional/,,"Municipal mayor",municipal-mayor-local-government-civil-service-general-and-local-government-professional,1020,"Local government",local-government-civil-service-general-and-local-government-professional,1
1022,https://personography.1890s.ca/occupations/industrial/interior-decorator-workers-and-dealers-in-houses-furniture-decoration-industrial/,,"Interior decorator",interior-decorator-workers-and-dealers-in-houses-furniture-decoration-industrial,643,Industrial,industrial,2
1023,https://personography.1890s.ca/occupations/professional/national-government-civil-service-general-and-local-government-professional/irish-state-senator-national-government-civil-service-general-and-local-government-professional/,,"Irish state senator",irish-state-senator-national-government-civil-service-general-and-local-government-professional,975,"National government",national-government-civil-service-general-and-local-government-professional,1
1029,https://personography.1890s.ca/occupations/professional/national-government-civil-service-general-and-local-government-professional/member-of-portuguese-house-of-representatives-national-government-general-and-local-government/,,"Member of Portuguese House of Representatives",member-of-portuguese-house-of-representatives-national-government-general-and-local-government,975,"National government",national-government-civil-service-general-and-local-government-professional,0
1031,https://personography.1890s.ca/occupations/professional/national-defence/intelligence-department-head/,,"Intelligence department head",intelligence-department-head,645,"National defence",national-defence,1
1032,https://personography.1890s.ca/occupations/commercial/commercial-occupations/merchants-and-agents/business-clerk/,,"Business clerk",business-clerk,683,"Merchants and agents",merchants-and-agents,1
1033,https://personography.1890s.ca/occupations/professional/professions/literary-and-scientific-persons/museum-administrator/,,"Museum administrator",museum-administrator,676,"Literary and scientific persons",literary-and-scientific-persons,1
1035,https://personography.1890s.ca/occupations/commercial/commercial-occupations/merchants-and-agents/economist/,,Economist,economist,683,"Merchants and agents",merchants-and-agents,1
1036,https://personography.1890s.ca/occupations/professional/professions/literary-and-scientific-persons/art-critic/,,"Art Critic",art-critic,676,"Literary and scientific persons",literary-and-scientific-persons,0
1037,https://personography.1890s.ca/occupations/professional/professions/artists-professions/art-historian/,,"Art Historian",art-historian,678,Artists,artists-professions,1
1038,https://personography.1890s.ca/occupations/professional/professions/literary-and-scientific-persons/cataloguer/,,Cataloguer,cataloguer,676,"Literary and scientific persons",literary-and-scientific-persons,1
1039,https://personography.1890s.ca/occupations/industrial/books-newspapers-prints-maps-industrial/etcher/,,Etcher,etcher,977,"Books newspapers prints maps",books-newspapers-prints-maps-industrial,2
1040,https://personography.1890s.ca/occupations/industrial/books-newspapers-prints-maps-industrial/woodcut-artist/,,"Woodcut Artist",woodcut-artist,977,"Books newspapers prints maps",books-newspapers-prints-maps-industrial,8
1041,https://personography.1890s.ca/occupations/professional/professions/artists-professions/artist/,,Artist,artist,678,Artists,artists-professions,11
1042,https://personography.1890s.ca/occupations/professional/professions/literary-and-scientific-persons/poet/,,Poet,poet,676,"Literary and scientific persons",literary-and-scientific-persons,2
1043,https://personography.1890s.ca/occupations/professional/general-and-local-government-professional/politician/,,Politician,politician,884,"General and local government",general-and-local-government-professional,2
1044,https://personography.1890s.ca/occupations/industrial/books-newspapers-prints-maps-industrial/private-press-director/,,"Private Press Director",private-press-director,977,"Books newspapers prints maps",books-newspapers-prints-maps-industrial,1
1045,https://personography.1890s.ca/occupations/professional/professions/educational/scholar/,,Scholar,scholar,675,Educational,educational,1
1046,https://personography.1890s.ca/occupations/professional/professions/other-professional-and-administrative-work/social-worker/,,"Social Worker",social-worker,680,"Other professional and administrative work",other-professional-and-administrative-work,1
1047,https://personography.1890s.ca/occupations/professional/professions/artists-professions/performance-artist/,,"Performance Artist",performance-artist,678,Artists,artists-professions,1
1048,https://personography.1890s.ca/occupations/industrial/books-newspapers-prints-maps-industrial/tarot-deck-designer/,,"Tarot Deck Designer",tarot-deck-designer,977,"Books newspapers prints maps",books-newspapers-prints-maps-industrial,1
1049,https://personography.1890s.ca/occupations/industrial/books-newspapers-prints-maps-industrial/engraver/,,Engraver,engraver,977,"Books newspapers prints maps",books-newspapers-prints-maps-industrial,2
