<http://temp.lincsproject.ca/anthologie/language/por>	<https://anthologiagraeca.org/api/languages/por/>
<http://temp.lincsproject.ca/anthologie/language/fra>	<https://anthologiagraeca.org/api/languages/fra/>
<http://temp.lincsproject.ca/anthologie/language/grc>	<https://anthologiagraeca.org/api/languages/grc/>
<http://temp.lincsproject.ca/anthologie/language/eng>	<https://anthologiagraeca.org/api/languages/eng/>
<http://temp.lincsproject.ca/anthologie/language/ita>	<https://anthologiagraeca.org/api/languages/ita/>
<http://temp.lincsproject.ca/anthologie/language/lat>	<https://anthologiagraeca.org/api/languages/lat/>
<http://temp.lincsproject.ca/anthologie/language/spa>	<https://anthologiagraeca.org/api/languages/spa/>