person_y90s	viaf_y90s	wikidata_y90s	Label_y90s	LabelAltOrder_y90s	altName_y90s	gender_y90s	birthDate_y90s	birthPlace_y90s	deathDate_y90s	deathPlace_y90s	namedGraph
https://personography.1890s.ca/persons/adamson-sydney/	http://viaf.org/viaf/41781416	http://www.wikidata.org/entity/Q59554801	"Adamson, Sydney"	Sydney Adamson	"Adamson, Sydney"	man					orlando
https://personography.1890s.ca/persons/allen-christine/			"Allen, Christine"	Christine Allen	"Allen, Christine"						orlando
https://personography.1890s.ca/persons/an-unknown-artist/			An Unknown Artist	An Unknown Artist 	An Unknown Artist						orlando
https://personography.1890s.ca/persons/annesley-francis/			"Annesley, Francis"	Francis Annesley	"Annesley, Francis; 6th Earl of Annesley"	man	1884	Castlewellan	1914	Belgium	orlando
https://personography.1890s.ca/persons/armitage-edward/	http://viaf.org/viaf/47034164	http://www.wikidata.org/entity/Q1291563	"Armitage, Edward"	Edward Armitage	"Armitage, Edward"						orlando
https://personography.1890s.ca/persons/armour-margaret/	http://viaf.org/viaf/69944781	http://www.wikidata.org/entity/Q63348763	"Armour, Margaret"	Margaret Armour	"Armour, Margaret"	woman	1860	Abercorn	1943	Edinburgh	orlando
https://personography.1890s.ca/persons/ashbee-c-r/	http://viaf.org/viaf/76389729	http://www.wikidata.org/entity/Q614071	"Ashbee, C. R."	C. R. Ashbee	"Ashbee, C. R."						orlando
https://personography.1890s.ca/persons/baildon-h-bellyse/	http://viaf.org/viaf/65364175	http://www.wikidata.org/entity/Q55418716	"Baildon, H. Bellyse"	H. Bellyse Baildon	"Baildon, H. Bellyse; Baildon, Henry Bellyse"	man					orlando
https://personography.1890s.ca/persons/baillie-rosa/			"Baillie, Rosa"	Rosa Baillie	"Baillie, Rosa"						orlando
https://personography.1890s.ca/persons/balfour-marie-clothilde/	http://viaf.org/viaf/41483538	http://www.wikidata.org/entity/Q15985316	"Balfour, Marie Clothilde"	Marie Clothilde Balfour	"Balfour, Marie Clothilde"	woman	1862	Edinburgh	1931	London	orlando
https://personography.1890s.ca/persons/ball-wilfred/	http://viaf.org/viaf/49496594	http://www.wikidata.org/entity/Q21463973	"Ball, Wilfred"	Wilfred Ball	"Ball, Wilfred"	man	1853	London	1917	Khartoum	orlando
https://personography.1890s.ca/persons/barbaud-anna-letitia/			"Barbauld, Anna Letitia"	Anna Letitia Barbauld	"Barbauld, Mrs.; Barbauld, Anna Letitia"	woman					orlando
https://personography.1890s.ca/persons/baxter-rose/			"Baxter, Rose"	Rose Baxter	"Baxter, Rose"	woman					orlando
https://personography.1890s.ca/persons/bayes-gilbert/	http://viaf.org/viaf/22992458	http://www.wikidata.org/entity/Q5560797	"Bayes, Gilbert"	Gilbert Bayes	"Bayes, Gilbert"						orlando
https://personography.1890s.ca/persons/bayes-jessie/	http://viaf.org/viaf/73529694	http://www.wikidata.org/entity/Q19921836	"Bayes, Jessie"	Jessie Bayes	"Bayes, Jessie"						orlando
https://personography.1890s.ca/persons/beach-william-frederick-hicks/			"Beach, William Frederick Hicks"	William Frederick Hicks Beach	"Beach, William Frederick Hicks"						orlando
https://personography.1890s.ca/persons/beaux-cecilia/	http://viaf.org/viaf/10135545	http://www.wikidata.org/entity/Q466677	"Beaux, Cecilia"	Cecilia Beaux	"Beaux, Cecilia"						orlando
https://personography.1890s.ca/persons/bell-r-anning/	http://viaf.org/viaf/11235357	http://www.wikidata.org/entity/Q2442215	"Bell, R. Anning"	R. Anning Bell	"Bell, Robert Anning; Bell, R. Anning"	man	1863	St Giles	1933	Holland Park	orlando
https://personography.1890s.ca/persons/belloc-hillaire/	http://viaf.org/viaf/59113521	http://www.wikidata.org/entity/Q333106	"Belloc, Hillaire"	Hillaire Belloc	"Belloc, Hillaire"						orlando
https://personography.1890s.ca/persons/benson-mary-eleanor/	http://viaf.org/viaf/162787520	http://www.wikidata.org/entity/Q18756958	"Benson, Mary Eleanor"	Mary Eleanor Benson	"Benson, Mary Eleanor"						orlando
https://personography.1890s.ca/persons/bentley-e-c/	http://viaf.org/viaf/22138375	http://www.wikidata.org/entity/Q596925	"Bentley, E. C."	E. C. Bentley	"Bentley, E. C."						orlando
https://personography.1890s.ca/persons/bernhard-smith-alice-mary/			"Bernhard-Smith, Alice Mary"	Alice Mary Bernhard-Smith	"Bernhard-Smith, Alice Mary"						orlando
https://personography.1890s.ca/persons/best-richard/			"Best, Richard"	Richard Best	"Best, Richard"						orlando
https://personography.1890s.ca/persons/blair-wally/			"Blair, Wally"	Wally Blair	"Blair, Wally"	man					orlando
https://personography.1890s.ca/persons/blanche-jacques-e/	http://viaf.org/viaf/12305305	http://www.wikidata.org/entity/Q936710	"Blanche, Jacques E."	Jacques E. Blanche	"Blanche, Jacques E.; Blanche, Jacques L."	man	1861	Paris	1942	Offranville	orlando
https://personography.1890s.ca/persons/blatherwick-lily/	http://viaf.org/viaf/96483564	http://www.wikidata.org/entity/Q19375224	"Blatherwick, Lily"	Lily Blatherwick	"Blatherwick, Lily"						orlando
https://personography.1890s.ca/persons/bottomley-emily/			"Bottomley, Emily"	Emily Bottomley	"Bottomley, Emily"						orlando
https://personography.1890s.ca/persons/bottomley-gordon/	http://viaf.org/viaf/66734450	http://www.wikidata.org/entity/Q1537980	"Bottomley, Gordon"	Gordon Bottomley	"Bottomley, Gordon"	man	1874	Keighley	1948	Wiltshire	orlando
https://personography.1890s.ca/persons/boughton-alice/			"Boughton, Alice"	Alice Boughton	"Boughton, Alice"						orlando
https://personography.1890s.ca/persons/boughton-george-henry/	http://viaf.org/viaf/227730597	http://www.wikidata.org/entity/Q2573180	"Boughton, George Henry"	George Henry Boughton	"Boughton, George Henry"						orlando
https://personography.1890s.ca/persons/boulderson-s/			"Boulderson, Shadwell"	Shadwell Boulderson	"Boulderson, Shadwell"	man	1878	Bath			orlando
https://personography.1890s.ca/persons/boutall-walter/	http://viaf.org/viaf/316801958	http://www.wikidata.org/entity/Q65553629	"Boutall, Walter"	Walter Boutall	"Boutall, Walter"	man					orlando
https://personography.1890s.ca/persons/bradley-katharine-harris/	http://viaf.org/viaf/66782560	http://www.wikidata.org/entity/Q15982614	"Bradley, Katharine Harris"	Katharine Harris Bradley	"Leigh, Arran; Michael Field; Bradley, Katharine Harris"	woman	1846	Birmingham	1914	Richmond	orlando
https://personography.1890s.ca/persons/bramley-frank/			"Bramley, Frank"	Frank Bramley	"Bramley, Frank"	man	1857	Sibsey	1915	Chalford	orlando
https://personography.1890s.ca/persons/brandes-ernst/			"Brandes, Ernst"	Ernst Brandes	"Brandes, Ernst"						orlando
https://personography.1890s.ca/persons/branford-victor-v/	http://viaf.org/viaf/76676450	http://www.wikidata.org/entity/Q7925749	"Branford, Victor V."	Victor V. Branford	"V.V.B; Branford, Victor V.; V.V.B., V.O.C.S"	man	1863	Oundle	1930	"34 And 35, Wellington Square"	orlando
https://personography.1890s.ca/persons/breakwell-ada/			"Breakwell, Ada"	Ada Breakwell	"Breakwell, Ada"						orlando
https://personography.1890s.ca/persons/bridges-victor/	http://viaf.org/viaf/84720639	http://www.wikidata.org/entity/Q7925754	"Bridges, Victor"	Victor Bridges	"Bridges, Victor; Bridges, Victor George De Freyne"	man	1878	Clifton	1972	Alton	orlando
https://personography.1890s.ca/persons/brooks-w-h/			"Brooks, W. H."	W. H. Brooks	"Brooks, W. H."						orlando
https://personography.1890s.ca/persons/brough-robert/	http://viaf.org/viaf/33358014	http://www.wikidata.org/entity/Q7341877	"Brough, Robert"	Robert Brough	"Brough, Robert"	man	1872	Kilmuir	1905	Sheffield	orlando
https://personography.1890s.ca/persons/brown-ford-madox/	http://viaf.org/viaf/69202953	http://www.wikidata.org/entity/Q319843	"Brown, Ford Madox"	Ford Madox Brown	"Brown, Ford Madox"						orlando
https://personography.1890s.ca/persons/brown-mary/			"Brown, Mary"	Mary Brown	"Brown, Mary"	woman					orlando
https://personography.1890s.ca/persons/burrow-charles-kennett/	http://viaf.org/viaf/100797641	http://www.wikidata.org/entity/Q65613270	"Burrow, Charles Kennett"	Charles Kennett Burrow	"Burrow, Charles Kennett"	man					orlando
https://personography.1890s.ca/persons/butcher-john-george/	http://viaf.org/viaf/311438099	http://www.wikidata.org/entity/Q13529891	"Butcher, John George"	John George Butcher	"Butcher, John George"						orlando
https://personography.1890s.ca/persons/c-h/			C.H.	C.H. 	C.H.						orlando
https://personography.1890s.ca/persons/cadenhead-james/	http://viaf.org/viaf/56884111	http://www.wikidata.org/entity/Q6130844	"Cadenhead, James"	James Cadenhead	"Cadenhead, James"	man	1858	Aberdeen			orlando
https://personography.1890s.ca/persons/cahan-abraham/	http://viaf.org/viaf/73968086	http://www.wikidata.org/entity/Q329854	"Cahan, Abraham"	Abraham Cahan	"Cahan, Abraham"						orlando
https://personography.1890s.ca/persons/cameron-d-y/	http://viaf.org/viaf/79202867	http://www.wikidata.org/entity/Q3703382	"Cameron, D. Y."	D. Y. Cameron	"Cameron, D. Y.; Cameron, David Young"	man	1865	Glasgow	1945	Perth	orlando
https://personography.1890s.ca/persons/campagnola-giulio/			"Campagnola, Giulio"	Giulio Campagnola	"Campagnola, Giulio"						orlando
https://personography.1890s.ca/persons/campagnola-guilio/	http://viaf.org/viaf/39650159	http://www.wikidata.org/entity/Q1989594	"Campagnola, Guilio"	Guilio Campagnola	"Campagnola, Guilio"	man					orlando
https://personography.1890s.ca/persons/caresme-ph/	http://viaf.org/viaf/32266244	http://www.wikidata.org/entity/Q766867	"Caresme, Ph."	Ph. Caresme	"Caresme, Ph.; Caresme, Jacques Philippe"	man					orlando
https://personography.1890s.ca/persons/carr-joseph-comyns/	http://viaf.org/viaf/39762577	http://www.wikidata.org/entity/Q4215991	"Carr, Joseph Comyns"	Joseph Comyns Carr	"Carr, Joseph Comyns"						orlando
https://personography.1890s.ca/persons/catty-charles-william-stratford/			"Catty, Charles William Stratford"	Charles William Stratford Catty	"Catty, Charles William Stratford"	man	1859	Kensington	1938	Abbey Road	orlando
https://personography.1890s.ca/persons/chambers-robert/	http://viaf.org/viaf/14767483	http://www.wikidata.org/entity/Q1349144	"Chambers, Robert"	Robert Chambers	"Chambers, Robert"						orlando
https://personography.1890s.ca/persons/chesson-hugh/	http://viaf.org/viaf/61937937	http://www.wikidata.org/entity/Q64685587	"Chesson, Hugh"	Hugh Chesson	"Chesson, Hugh"						orlando
https://personography.1890s.ca/persons/chesterton-cecil/	http://viaf.org/viaf/100373196	http://www.wikidata.org/entity/Q2943680	"Chesterton, Cecil"	Cecil Chesterton	"Chesterton, Cecil"						orlando
https://personography.1890s.ca/persons/chesterton-g-k/	http://viaf.org/viaf/14767719	http://www.wikidata.org/entity/Q183167	"Chesterton, G. K."	G. K. Chesterton	"Chesterton, G. K."	man	1874	Campden Hill	1936	Beaconsfield	orlando
https://personography.1890s.ca/persons/christian-susan/			"Christian, Susan"	Susan Christian	"Hicks-Beach, Susan EmilyHicks Beach, Mrs. William; Christian, Susan"	woman	1866	Gloucestershire			orlando
https://personography.1890s.ca/persons/christie-j-e/			"Christie, J. E."	J. E. Christie	"Christie, James Elder; Christie, J. E."	man	1847	Guardbridge			orlando
https://personography.1890s.ca/persons/clamour-alfred-c/			"Clamour, Alfred C."	Alfred C. Clamour	"Clamour, Alfred C."						orlando
https://personography.1890s.ca/persons/clark-clara-savile/			"Clark, Clara Savile"	Clara Savile Clark	"Clarke, Clara Savile; The Author of ""A Mere Man""; Clark, Clara Savile; A New Writer"		1869	Paddington			orlando
https://personography.1890s.ca/persons/cobban-grace/			"Cobban, Grace"	Grace Cobban	"Cobban, Grace"						orlando
https://personography.1890s.ca/persons/coke-desmond-f-t/	http://viaf.org/viaf/7293793	http://www.wikidata.org/entity/Q52150654	"Coke, Desmond F. T."	Desmond F. T. Coke	"Coke, Desmond F. T."	man	1879	England	1931	Worthing	orlando
https://personography.1890s.ca/persons/cole-alphaeus/			"Cole, Alphaeus"	Alphaeus Cole	"Cole, Alphaeus"						orlando
https://personography.1890s.ca/persons/collingwood-w-g/	http://viaf.org/viaf/56749375	http://www.wikidata.org/entity/Q3034215	"Collingwood, W. G."	W. G. Collingwood	"Collingwood, W. G."						orlando
https://personography.1890s.ca/persons/conder-charles-edward/	http://viaf.org/viaf/76588572	http://www.wikidata.org/entity/Q1284465	"Conder, Charles Edward"	Charles Edward Conder	"Conder, Charles Edward"	man	1868	Tottenham	1909	Holloway Sanatorium	orlando
https://personography.1890s.ca/persons/coppee-francois/	http://viaf.org/viaf/46759181	http://www.wikidata.org/entity/Q380277	"Copp√©e, Fran√ßois"	Fran√ßois Copp√©e	"Copp√©e, Fran√ßois"						orlando
https://personography.1890s.ca/persons/costa-giovanna/	http://viaf.org/viaf/19845965	http://www.wikidata.org/entity/Q9268271	"Costa, Giovanna"	Giovanna Costa	"Costa, Giovanna"						orlando
https://personography.1890s.ca/persons/costa-john-da/	http://viaf.org/viaf/48181948	http://www.wikidata.org/entity/Q55720903	"Costa, John da"	John da Costa	"Costa, John da; Da Costa, John Henry Alphonse Frederick Francis"	man	1866	Teignmouth	1931	London	orlando
https://personography.1890s.ca/persons/cotman-f-g/	http://viaf.org/viaf/95767355	http://www.wikidata.org/entity/Q21461070	"Cotman, F. G."	F. G. Cotman	"Cotman, F. G.; Cotman, Frederick George"	man	1850	Ipswich			orlando
https://personography.1890s.ca/persons/cotterell-constance-a-m/			"Cotterell, Constance A. M."	Constance A. M. Cotterell	"Cotterell, Constance A. M."	woman					orlando
https://personography.1890s.ca/persons/craft-percy-r/	http://viaf.org/viaf/95683487	http://www.wikidata.org/entity/Q2070296	"Craft, Percy R."	Percy R. Craft	"Craft, Percy R."	man	1856	London	1934	London	orlando
https://personography.1890s.ca/persons/craig-edith/			"Craig, Edith"	Edith Craig	"Craig, Edith; Craig, Edith Ailsa Gordon"						orlando
https://personography.1890s.ca/persons/crawhall-j/			"Crawhall, J."	J. Crawhall	"Crawhall, Joseph E.; Crawhall, J."	man	1861	Morpeth	1913	Redcliffe Gardens	orlando
https://personography.1890s.ca/persons/crawhall-joseph/	http://viaf.org/viaf/12731529	http://www.wikidata.org/entity/Q16059858	"Crawhall, Joseph"	Joseph Crawhall	"Crawhall, Joseph"						orlando
https://personography.1890s.ca/persons/creswick-paul/	http://viaf.org/viaf/41906115	http://www.wikidata.org/entity/Q52123337	"Creswick, Paul"	Paul Creswick	"Creswick, Paul"	man	1866	England	1947	Hove	orlando
https://personography.1890s.ca/persons/crockett-s-r/	http://viaf.org/viaf/50025249	http://www.wikidata.org/entity/Q981852	"Crockett, S.R."	S.R. Crockett	"Ford Ber√™ton; Crockett, S.R.; Crockett, Samuel Rutherford"	man	1859	Balmaghie	1914	Villa Philipson	orlando
https://personography.1890s.ca/persons/crooke-john/			"Crooke, John"	John Crooke	"Crooke, John"	man	1861	Manchester	1935	London	orlando
https://personography.1890s.ca/persons/cuffe-william/	http://viaf.org/viaf/43458819	http://www.wikidata.org/entity/Q16059680	"Cuffe, William"	William Cuffe	"Cuffe, William"						orlando
https://personography.1890s.ca/persons/curzon-mary-victoria/	http://viaf.org/viaf/42658971	http://www.wikidata.org/entity/Q788163	"Curzon, Mary Victoria"	Mary Victoria Curzon	"Curzon, Mary Victoria"						orlando
https://personography.1890s.ca/persons/dalmon-c-w/	http://viaf.org/viaf/19587068	http://www.wikidata.org/entity/Q5076691	"Dalmon, C. W."	C. W. Dalmon	"Dalmon, Charles William; Dalmon, C. W."	man	1862	Steyning	1938	London Borough of Islington	orlando
https://personography.1890s.ca/persons/day-fred-holland/	http://viaf.org/viaf/63998216	http://www.wikidata.org/entity/Q555442	"Day, Fred Holland"	Fred Holland Day	"Day, Fred Holland"						orlando
https://personography.1890s.ca/persons/de-chavannes-p-puvis/	http://viaf.org/viaf/51724541	http://www.wikidata.org/entity/Q216873	"de Chavannes, P. Puvis"	P. Puvis de Chavannes	"de Chavannes, P. Puvis"	man					orlando
https://personography.1890s.ca/persons/de-guerin-maurice/	http://viaf.org/viaf/100175651	http://www.wikidata.org/entity/Q551574	"de Guerin, Maurice"	Maurice de Guerin	"de Guerin, Maurice"						orlando
https://personography.1890s.ca/persons/de-la-mare-walter/	http://viaf.org/viaf/2502254	http://www.wikidata.org/entity/Q981086	"de la Mare, Walter"	Walter de la Mare	"de la Mare, Walter"						orlando
https://personography.1890s.ca/persons/de-mattos-a-teixeira/	http://viaf.org/viaf/55502069	http://www.wikidata.org/entity/Q1969016	"de Mattos, A. Teixeira"	A. Teixeira de Mattos	"de Mattos, A. Teixeira"	man	1865	Amsterdam	1921	St Ives	orlando
https://personography.1890s.ca/persons/de-vere-aubrey/			"de Vere, Aubrey"	Aubrey de Vere	"de Vere, Aubrey"						orlando
https://personography.1890s.ca/persons/destree-olivier-georges/	http://viaf.org/viaf/2596938	http://www.wikidata.org/entity/Q20667740	"Destr√©e, Olivier Georges"	Olivier Georges Destr√©e	"Destr√©e, Olivier Georges; Dom Bruno Destr√©e"	man	1867	Marcinelle			orlando
https://personography.1890s.ca/persons/dixon-william-hepworth/	http://viaf.org/viaf/37011079	http://www.wikidata.org/entity/Q823245	"Dixon, William Hepworth"	William Hepworth Dixon	"Dixon, William Hepworth"						orlando
https://personography.1890s.ca/persons/dobson-frances-mary/			"Dobson, Frances Mary"	Frances Mary Dobson	"Dobson, Frances Mary"						orlando
https://personography.1890s.ca/persons/dodd-francis/	http://viaf.org/viaf/69203479	http://www.wikidata.org/entity/Q5480742	"Dodd, Francis"	Francis Dodd	"Dodd, Francis"						orlando
https://personography.1890s.ca/persons/dodd-gertrude-helen/			"Dodd, Gertrude Helen"	Gertrude Helen Dodd	"Dodd, Gertrude Helen"						orlando
https://personography.1890s.ca/persons/dodgson-campbell/	http://viaf.org/viaf/37054187	http://www.wikidata.org/entity/Q5623020	"Dodgson, Campbell"	Campbell Dodgson	"Dodgson, Campbell"						orlando
https://personography.1890s.ca/persons/douglas-george/			"Douglas, George"	George Douglas	"Douglas, George Brisbane Scott; Douglas, George"	man	1856	Gibraltar			orlando
https://personography.1890s.ca/persons/dow-thomas-millie/	http://viaf.org/viaf/95719732	http://www.wikidata.org/entity/Q1615451	"Dow, Thomas Millie"	Thomas Millie Dow	"Dow, Thomas Millie"						orlando
https://personography.1890s.ca/persons/dowson-ernest/	http://viaf.org/viaf/29527929	http://www.wikidata.org/entity/Q1231493	"Dowson, Ernest"	Ernest Dowson	"Dowson, Ernest"	man	1867	Lee	1900	London	orlando
https://personography.1890s.ca/persons/draper-h-j/	http://viaf.org/viaf/57665462	http://www.wikidata.org/entity/Q918605	"Draper, H. J."	H. J. Draper	"Draper, H. J.; Draper, Herbert James"	man	1863	London	1920	London	orlando
https://personography.1890s.ca/persons/dreeme-willard/			"Dreeme, Willard"	Willard Dreeme	"Dreeme, Willard"						orlando
https://personography.1890s.ca/persons/drummond-john/	http://viaf.org/viaf/99297727	http://www.wikidata.org/entity/Q328513	"Drummond, John"	John Drummond	"Drummond, John"						orlando
https://personography.1890s.ca/persons/e-2/			E	E 	E						orlando
https://personography.1890s.ca/persons/e/			E.	E. 	E.						orlando
https://personography.1890s.ca/persons/edwards-osman/	http://viaf.org/viaf/35824817	http://www.wikidata.org/entity/Q18912445	"Edwards, Osman"	Osman Edwards	"Edwards, Osman"	man	1864	Liverpool			orlando
https://personography.1890s.ca/persons/egerton-francis/	http://viaf.org/viaf/47143145	http://www.wikidata.org/entity/Q1149445	"Egerton, Francis"	Francis Egerton	"Ellesmere, Earl of; Egerton, Francis Charles Granville; Egerton, Francis"						orlando
https://personography.1890s.ca/persons/eisen-charles/	http://viaf.org/viaf/29533491	http://www.wikidata.org/entity/Q2744998	"Eisen, Charles"	Charles Eisen	"Eisen, Charles"	man					orlando
https://personography.1890s.ca/persons/enderby-samuel-green/			"Enderby, Samuel Green"	Samuel Green Enderby	"Enderby, Samuel Green"						orlando
https://personography.1890s.ca/persons/eustace-jennie-a/	http://viaf.org/viaf/232045360	http://www.wikidata.org/entity/Q56661280	"Eustace, Jennie A."	Jennie A. Eustace	"Eustace, Jennie A."	woman					orlando
https://personography.1890s.ca/persons/eyre-todd-george/	http://viaf.org/viaf/38158382	http://www.wikidata.org/entity/Q52150339	"Eyre-Todd, George"	George Eyre-Todd	"Eyre-Todd, George"	man	1862	Glasgow			orlando
https://personography.1890s.ca/persons/fanshawe-w-s/			"Fanshawe, W.S."	W.S. Fanshawe	"Fanshawe, W.S."						orlando
https://personography.1890s.ca/persons/farncombe-c-j/			"Farncombe, C. J."	C. J. Farncombe	"Farncombe, C. J."						orlando
https://personography.1890s.ca/persons/ferriera-antonio/			"Ferriera, Antonio"	Antonio Ferriera	"Ferriera, Antonio"	man					orlando
https://personography.1890s.ca/persons/finch-constance/			"Finch, Constance"	Constance Finch	"Finch, Constance"	woman					orlando
https://personography.1890s.ca/persons/forbes-vivian/	http://viaf.org/viaf/95845307	http://www.wikidata.org/entity/Q21463011	"Forbes, Vivian"	Vivian Forbes	"Forbes, Vivian"						orlando
https://personography.1890s.ca/persons/forster-francis-l-m/	http://viaf.org/viaf/95835366	http://www.wikidata.org/entity/Q21459918	"Forster, Francis L. M."	Francis L. M. Forster	"Forster, Francis L. M."	man					orlando
https://personography.1890s.ca/persons/frederic-harold/	http://viaf.org/viaf/22251233	http://www.wikidata.org/entity/Q1585832	"Frederic, Harold"	Harold Frederic	"Forth, George; Frederic, Harold"	man	1856	Utica	1898	Henley-on-Thames	orlando
https://personography.1890s.ca/persons/frew-a/			"Frew, A."	A. Frew	"Frew, Alexander Cunningham; Frew, A."	man			1908	Portsmouth	orlando
https://personography.1890s.ca/persons/fullerton-william-morton/	http://viaf.org/viaf/5303330	http://www.wikidata.org/entity/Q8015868	"Fullerton, William Morton"	William Morton Fullerton	"Fullerton, William Morton"	man	1865	Norwich			orlando
https://personography.1890s.ca/persons/furse-charles-wellington/	http://viaf.org/viaf/2743707	http://www.wikidata.org/entity/Q3330788	"Furse, Charles Wellington"	Charles Wellington Furse	"Furse, Charles Wellington"	man	1868	Staines-upon-Thames	1904	Reading	orlando
https://personography.1890s.ca/persons/furse-katherine/			"Furse, Katherine"	Katherine Furse	"Furse, Katherine"						orlando
https://personography.1890s.ca/persons/g-f/			G. F.	G. F. 	G. F.						orlando
https://personography.1890s.ca/persons/g-j-2/			G. J.	G. J. 	G. J.						orlando
https://personography.1890s.ca/persons/g-j/			G. J.	G. J. 	G. J.						orlando
https://personography.1890s.ca/persons/garnett-richard/	http://viaf.org/viaf/56625067	http://www.wikidata.org/entity/Q718512	"Garnett, Richard"	Richard Garnett	"Garnett, Richard"	man	1835	Lichfield	1906	Hampstead	orlando
https://personography.1890s.ca/persons/garstin-althea-dochie/	http://viaf.org/viaf/75182558	http://www.wikidata.org/entity/Q18954031	"Garstin, Althea Dochie"	Althea Dochie Garstin	"Garstin, Althea Dochie"						orlando
https://personography.1890s.ca/persons/garstin-norman/	http://viaf.org/viaf/77424344	http://www.wikidata.org/entity/Q1740505	"Garstin, Norman"	Norman Garstin	"Garstin, Norman"	man	1847	Caherconlish	1926	Penzance	orlando
https://personography.1890s.ca/persons/gaskin-arthur/	http://viaf.org/viaf/62961516	http://www.wikidata.org/entity/Q4798790	"Gaskin, Arthur"	Arthur Gaskin	"Gaskin, Arthur"	man	1862	Birmingham	1928	Chipping Campden	orlando
https://personography.1890s.ca/persons/gaskin-mrs-a-j/	http://viaf.org/viaf/185064650	http://www.wikidata.org/entity/Q5548178	"Gaskin, Georgina"	Georgina Gaskin	"France, Georgina Evelyn Cave; Gaskin, Georgie; Gaskin, Mrs. A. J.; Gaskin, Georgina"	woman	1866	Shrewsbury	1934	West Malling	orlando
https://personography.1890s.ca/persons/gaugin-paul/	http://viaf.org/viaf/27064953	http://www.wikidata.org/entity/Q37693	"Gaugin, Paul"	Paul Gaugin	"Gaugin, Paul"						orlando
https://personography.1890s.ca/persons/gauld-d/			"Gauld, D."	D. Gauld	"Gauld, David; Gauld, D."	man					orlando
https://personography.1890s.ca/persons/geddes-patrick/	http://viaf.org/viaf/73868906	http://www.wikidata.org/entity/Q381848	"Geddes, Patrick"	Patrick Geddes	"The Authors of 'The Evolution of Sex'; Geddes, Patrick"	man	1854	Ballater	1932	Scots College (Paris)	orlando
https://personography.1890s.ca/persons/geddie-john/	http://viaf.org/viaf/34827260	http://www.wikidata.org/entity/Q6235040	"Geddie, John"	John Geddie	"Geddie, John"	man	1848	Garmouth			orlando
https://personography.1890s.ca/persons/gere-c-m/	http://viaf.org/viaf/76235681	http://www.wikidata.org/entity/Q5080648	"Gere, C. M."	C. M. Gere	"Gere, Charles March; Gere, C. M."	man	1869	Gloucester	1957	Sheffield	orlando
https://personography.1890s.ca/persons/gilbert-h/			"Gilbert, H."	H. Gilbert	"Gilbert, H.; Gilbert, Henry Franklin Belknap"	man					orlando
https://personography.1890s.ca/persons/gilbert-john-thomas/			"Gilbert, John Thomas"	John Thomas Gilbert	"Gilbert, John Thomas"						orlando
https://personography.1890s.ca/persons/gilchrist-r-murray/	http://viaf.org/viaf/53076686	http://www.wikidata.org/entity/Q7347897	"Gilchrist, R. Murray"	R. Murray Gilchrist	"Gilchrist, R. Murray; Gilchrist, Robert Murray"	man	1868	Sheffield			orlando
https://personography.1890s.ca/persons/gilkin-iwan/	http://viaf.org/viaf/65430678	http://www.wikidata.org/entity/Q2243172	"Gilkin, Iwan"	Iwan Gilkin	"Gilkin, Iwan"						orlando
https://personography.1890s.ca/persons/gillett-gabriel/			"Gillett, Gabriel"	Gabriel Gillett	"Gillett, George Gabriel Scott; Gillett, Gabriel"	man	1873	Hawley	1948	St Leonards-on-Sea	orlando
https://personography.1890s.ca/persons/gilmour-leonie/			"Gilmour, L√©onie"	L√©onie Gilmour	"Gilmour, L√©onie"						orlando
https://personography.1890s.ca/persons/giraud-albert/	http://viaf.org/viaf/56772661	http://www.wikidata.org/entity/Q972661	"Giraud, Albert"	Albert Giraud	"Giraud, Albert"						orlando
https://personography.1890s.ca/persons/gissing-george-robert/	http://viaf.org/viaf/59083174	http://www.wikidata.org/entity/Q369790	"Gissing, George Robert"	George Robert Gissing	"Gissing, George Robert"	man	1857	Wakefield	1903	Saint-Jean-de-Luz	orlando
https://personography.1890s.ca/persons/godwin-edward-william/			"Godwin, Edward William"	Edward William Godwin	"Godwin, Edward William"						orlando
https://personography.1890s.ca/persons/gordon-alice-mary/	http://viaf.org/viaf/306161124	http://www.wikidata.org/entity/Q76085205	"Gordon, Alice Mary"	Alice Mary Gordon	"Butcher, Alice Mary; Gordon, Mrs. J.E.H.; Brandreth, Alice Mary; Gordon, Alice Mary; Gordon, Mrs. James Edward Henry"	woman					orlando
https://personography.1890s.ca/persons/gordon-woodhouse-violet/			"Gordon-Woodhouse, Violet"	Violet Gordon-Woodhouse	"Gordon-Woodhouse, Violet"						orlando
https://personography.1890s.ca/persons/gotch-caroline/	http://viaf.org/viaf/73799049	http://www.wikidata.org/entity/Q47451192	"Gotch, Caroline"	Caroline Gotch	"Gotch, Caroline Burland; Yates, Caroline Burland; Gotch, Caroline"	woman	1854	Liverpool	1945	Newlyn	orlando
https://personography.1890s.ca/persons/gotch-t-c/	http://viaf.org/viaf/8168101	http://www.wikidata.org/entity/Q635980	"Gotch, T. C."	T. C. Gotch	"Gotch, Thomas Cooper; Gotch, T. C."	man	1854	Kettering	1931	London	orlando
https://personography.1890s.ca/persons/graham-gabriela-cunninghame/	http://viaf.org/viaf/54118500	http://www.wikidata.org/entity/Q50298639	"Graham, Gabriela Cunninghame"	Gabriela Cunninghame Graham	"Graham, Gabriela Cunninghame; de la Balmondi√®re, Gabriela Maria; Horsfall, Caroline"	woman	1859	Masham	1906	Hendaye	orlando
https://personography.1890s.ca/persons/graham-katherine/			"Graham, Katherine"	Katherine Graham	"Graham, Katherine"						orlando
https://personography.1890s.ca/persons/graham-r-b-cunninghame/	http://viaf.org/viaf/61539913	http://www.wikidata.org/entity/Q334633	"Graham, R.B. Cunninghame"	R.B. Cunninghame Graham	"Graham, R.B. Cunninghame"						orlando
https://personography.1890s.ca/persons/grant-lewis/			"Grant, Lewis"	Lewis Grant	"Grant, Lewis"	man					orlando
https://personography.1890s.ca/persons/graves-robert-von-ranke/			"Graves, Robert von Ranke"	Robert von Ranke Graves	"Graves, Robert von Ranke"						orlando
https://personography.1890s.ca/persons/gray-john/	http://viaf.org/viaf/39421155	http://www.wikidata.org/entity/Q730223	"Gray, John"	John Gray	"Gray, John"	man	1866	Bethnal Green	1934	Edinburgh	orlando
https://personography.1890s.ca/persons/greene-g-a/			"Greene, G.A."	G.A. Greene	"Greene, G.A."						orlando
https://personography.1890s.ca/persons/greenwood-frederick/	http://viaf.org/viaf/48791206	http://www.wikidata.org/entity/Q3087117	"Greenwood, Frederick"	Frederick Greenwood	"Greenwood, Frederick; A Woman"	man	1830	Kensington	1909	Sydenham	orlando
https://personography.1890s.ca/persons/greenwood-james-william/			"Greenwood, James William"	James William Greenwood	"Greenwood, James William"						orlando
https://personography.1890s.ca/persons/gregory-william-henry/			"Gregory, William Henry"	William Henry Gregory	"Gregory, William Henry"						orlando
https://personography.1890s.ca/persons/greins-j-t/			"Greins, J. T."	J. T. Greins	"Greins, Jacob Thomas; Greins, J. T."	man	1862	Amsterdam	1935	Victoria Road	orlando
https://personography.1890s.ca/persons/grigg-f-l/			"Grigg, F.L."	F.L. Grigg	"Grigg, F.L."						orlando
https://personography.1890s.ca/persons/grosvenor-susan-charlotte/			"Grosvenor, Susan Charlotte"	Susan Charlotte Grosvenor	"Grosvenor, Susan Charlotte"						orlando
https://personography.1890s.ca/persons/gurney-arthur-thompson/			"Gurney, Arthur Thompson"	Arthur Thompson Gurney	"Gurney, Arthur Thompson"						orlando
https://personography.1890s.ca/persons/gurney-sybella-catherine-nino/			"Gurney, Sybella Catherine Nino"	Sybella Catherine Nino Gurney	"Gurney, Sybella Catherine Nino"						orlando
https://personography.1890s.ca/persons/guthrie-james-j/			"Guthrie, James J."	James J. Guthrie	"Guthrie, James J."	man					orlando
https://personography.1890s.ca/persons/guys-constantin/	http://viaf.org/viaf/55463100	http://www.wikidata.org/entity/Q662943	"Guys, Constantin"	Constantin Guys	"Guys, Ernest Adolphe Hyacinthe Constantin; Guys, Constantin"	man					orlando
https://personography.1890s.ca/persons/gyles-althea/	http://viaf.org/viaf/1994353	http://www.wikidata.org/entity/Q18936197	"Gyles, Althea"	Althea Gyles	"Gyles, Althea"	woman	1868	Kilmurray	1949	Beckenham	orlando
https://personography.1890s.ca/persons/halford-constance/			"Halford, Constance"	Constance Halford	"Halford, Constance"	woman	1865	London			orlando
https://personography.1890s.ca/persons/hall-frederick/			"Hall, Frederick"	Frederick Hall	"Hall, Frederick"	man	1860	Stillington	1948	Newbury	orlando
https://personography.1890s.ca/persons/halls-robert/			"Halls, Robert"	Robert Halls	"Halls, Robert"	man					orlando
https://personography.1890s.ca/persons/hamerton-philip-gilbert/	http://viaf.org/viaf/10985416	http://www.wikidata.org/entity/Q2086752	"Hamerton, Philip-Gilbert"	Philip-Gilbert Hamerton	"Hamerton, Philip-Gilbert; Segrave, Adolphus"	man	1834	Lancashire	1894	Boulogne-sur-Mer	orlando
https://personography.1890s.ca/persons/hamilton-james-whitelaw/	http://viaf.org/viaf/7255642	http://www.wikidata.org/entity/Q19585802	"Hamilton, James Whitelaw"	James Whitelaw Hamilton	"Hamilton, James Whitelaw"	man	1860	Glasgow	1932	Helensburgh	orlando
https://personography.1890s.ca/persons/hapgood-hutchins/	http://viaf.org/viaf/54318960	http://www.wikidata.org/entity/Q14954804	"Hapgood, Hutchins"	Hutchins Hapgood	"Hapgood, Hutchins"						orlando
https://personography.1890s.ca/persons/hapgood-norman/	http://viaf.org/viaf/67672911	http://www.wikidata.org/entity/Q7052323	"Hapgood, Norman"	Norman Hapgood	"Hapgood, Norman"	man	1868	Chicago	1937	New York City	orlando
https://personography.1890s.ca/persons/hare-charles/			"Hare, Charles"	Charles Hare	"Hare, Charles"	man					orlando
https://personography.1890s.ca/persons/harland-henry/	http://viaf.org/viaf/44660990	http://www.wikidata.org/entity/Q558410	"Harland, Henry"	Henry Harland	"Robert Shews; Harland, Henry; The Yellow Dwarf; Samuel Scott Mathewson, Robert Shews, Sidney Luska"	man	1861	Brooklyn	1905	Sanremo	orlando
https://personography.1890s.ca/persons/haxton-frederick-gerald/			"Haxton, Frederick Gerald"	Frederick Gerald Haxton	"Haxton, Frederick Gerald"						orlando
https://personography.1890s.ca/persons/hay-jane/			"Hay, Jane"	Jane Hay	"Hay, Jane"	woman					orlando
https://personography.1890s.ca/persons/hayes-alfred/			"Hayes, Alfred"	Alfred Hayes	"Hayes, Alfred"	man	1857	England			orlando
https://personography.1890s.ca/persons/heimann-margaret/			"Heimann, Margaret"	Margaret Heimann	"Heimann, Margaret"						orlando
https://personography.1890s.ca/persons/hemingway-percy/			"Hemingway, Percy"	Percy Hemingway	"Hemingway, Percy"	man	1866	Bowdown and Chamberhouse Woods			orlando
https://personography.1890s.ca/persons/henderson-j-j/			"Henderson, J.J."	J.J. Henderson	"Henderson, J.J."						orlando
https://personography.1890s.ca/persons/henley-w-e/	http://viaf.org/viaf/9863730	http://www.wikidata.org/entity/Q552617	"Henley, W.E."	W.E. Henley	"Henley, W.E."						orlando
https://personography.1890s.ca/persons/henry-george/			"Henry, George"	George Henry	"Hendry, George; Henry, George"	man	1858	Irvine	1943	"130 And 132, Fulham Road Sw3"	orlando
https://personography.1890s.ca/persons/henry-h/			"Henry, H."	H. Henry	"Henry, H."						orlando
https://personography.1890s.ca/persons/hentschel-carl/			"Hentschel, Carl"	Carl Hentschel	"Hentschel, Carl"	man	1864	≈Å√≥d≈∫	1930	London	orlando
https://personography.1890s.ca/persons/heredia-jose-maria-de/	http://viaf.org/viaf/95187284	http://www.wikidata.org/entity/Q334970	"H√©r√©dia, Jose Maria de"	Jose Maria de H√©r√©dia	"H√©r√©dia, Jose Maria de"	man	1842	Havana	1905	Houdan	orlando
https://personography.1890s.ca/persons/hickson-mabel/	http://viaf.org/viaf/22024756	http://www.wikidata.org/entity/Q6721493	"Hickson, Mabel"	Mabel Hickson	"Greenhow, Mabel; Hickson, Mabel; Hickson, Mrs. Murray; Kitcat, Mabel"	woman	1858	England			orlando
https://personography.1890s.ca/persons/higginbotham-elsie/			"Higginbotham, Elsie"	Elsie Higginbotham	"Higginbotham, Elsie"	woman					orlando
https://personography.1890s.ca/persons/hills-laura-coombs/	http://viaf.org/viaf/71294873	http://www.wikidata.org/entity/Q19792224	"Hills, Laura Coombs"	Laura Coombs Hills	"Hills, Laura Coombs"						orlando
https://personography.1890s.ca/persons/hinkson-henry-albert/	http://viaf.org/viaf/1629778	http://www.wikidata.org/entity/Q18911515	"Hinkson, Henry Albert"	Henry Albert Hinkson	"Hinkson, Henry Albert"						orlando
https://personography.1890s.ca/persons/holden-violet/	http://viaf.org/viaf/91189606	http://www.wikidata.org/entity/Q106286996	"Holden, Violet"	Violet Holden	"Holden, Violet"						orlando
https://personography.1890s.ca/persons/homer-winslow/	http://viaf.org/viaf/15044075	http://www.wikidata.org/entity/Q344838	"Homer, Winslow"	Winslow Homer	"Homer, Winslow"						orlando
https://personography.1890s.ca/persons/hornel-e/	http://viaf.org/viaf/22985477	http://www.wikidata.org/entity/Q947417	"Hornel, E."	E. Hornel	"Hornel, E.; Hornel, Edward Atkinson"	man	1864	Bacchus Marsh	1933	Kirkcudbright	orlando
https://personography.1890s.ca/persons/housman-edward/			"Housman, Edward"	Edward Housman	"Housman, Edward"						orlando
https://personography.1890s.ca/persons/howard-francis-harrison/			"Howard, Francis Harrison"	Francis Harrison Howard	"Howard, Francis Harrison"	man			1954	Surrey	orlando
https://personography.1890s.ca/persons/howard-keble/			"Howard, Keble"	Keble Howard	"Howard, Keble"						orlando
https://personography.1890s.ca/persons/hudson-w-h/	http://viaf.org/viaf/7391698	http://www.wikidata.org/entity/Q1359140	"Hudson, W. H."	W. H. Hudson	"Hudson, W. H."						orlando
https://personography.1890s.ca/persons/hunt-alfred-william/	http://viaf.org/viaf/17236711	http://www.wikidata.org/entity/Q708515	"Hunt, Alfred William"	Alfred William Hunt	"Hunt, Alfred William"						orlando
https://personography.1890s.ca/persons/hunt-margaret-raine/	http://viaf.org/viaf/30676892	http://www.wikidata.org/entity/Q6759824	"Hunt, Margaret Raine"	Margaret Raine Hunt	"Hunt, Margaret Raine"						orlando
https://personography.1890s.ca/persons/hyland-fred/			"Hyland, Fred"	Fred Hyland	"Hyland, Fred"	man					orlando
https://personography.1890s.ca/persons/irving-laurence/	http://viaf.org/viaf/62662175	http://www.wikidata.org/entity/Q48700	"Irving, Laurence"	Laurence Irving	"Irving, Laurence; Irving, Laurence Sydney Bodribb"	man	1871	England	1914	St. Lawrence River	orlando
https://personography.1890s.ca/persons/jackson-frank-g/			"Jackson, Frank G."	Frank G. Jackson	"Jackson, Frank G."						orlando
https://personography.1890s.ca/persons/jackson-mason/			"Jackson, Mason"	Mason Jackson	"Jackson, Mason"						orlando
https://personography.1890s.ca/persons/james-humphrey/			"James, Humphrey"	Humphrey James	"James, Humphrey"	man					orlando
https://personography.1890s.ca/persons/james-william/	http://viaf.org/viaf/56625773	http://www.wikidata.org/entity/Q125249	"James, William"	William James	"James, William"						orlando
https://personography.1890s.ca/persons/janvier-catharine-a/	http://viaf.org/viaf/11222977	http://www.wikidata.org/entity/Q19647287	"Janvier, Catharine A."	Catharine A. Janvier	"Drinker, Catherine Ann; Janvier, Catharine A."	woman	1841	Philadelphia			orlando
https://personography.1890s.ca/persons/janvier-thomas-allibone/	http://viaf.org/viaf/61932982	http://www.wikidata.org/entity/Q15491484	"Janvier, Thomas Allibone"	Thomas Allibone Janvier	"Janvier, Thomas Allibone"						orlando
https://personography.1890s.ca/persons/jones-ethelwyn-sylvia/			"Jones, Ethelwyn Sylvia"	Ethelwyn Sylvia Jones	"Jones, Ethelwyn Sylvia"						orlando
https://personography.1890s.ca/persons/jones-mary-emma/			"Jones, Mary Emma"	Mary Emma Jones	"Jones, Mary Emma"						orlando
https://personography.1890s.ca/persons/joy-maurice/			"Joy, Maurice"	Maurice Joy	"Joy, Maurice"	man					orlando
https://personography.1890s.ca/persons/joynes-catherine-leigh/			"Joynes, Catherine Leigh"	Catherine Leigh Joynes	"Joynes, Catherine Leigh"						orlando
https://personography.1890s.ca/persons/kahn-florence/	http://viaf.org/viaf/75877864	http://www.wikidata.org/entity/Q1429384	"Kahn, Florence"	Florence Kahn	"Kahn, Florence"						orlando
https://personography.1890s.ca/persons/karageorgevitch-bojidar/	http://viaf.org/viaf/186929885	http://www.wikidata.org/entity/Q7243837	"Karageorgevitch, Bojidar"	Bojidar Karageorgevitch	"Karageorgevitch, Bojidar"	man	1861	Serbia	1908	Versailles	orlando
https://personography.1890s.ca/persons/kasbier-gertrude/			"Kasbier, Gertrude"	Gertrude Kasbier	"Kasbier, Gertrude"						orlando
https://personography.1890s.ca/persons/kay-arthur/			"Kay, Arthur"	Arthur Kay	"Kay, Arthur"						orlando
https://personography.1890s.ca/persons/kay-j-illingworth/			"Kay, J. Illingworth"	J. Illingworth Kay	"Kay, J. Illingworth; Kay, James Illingworth"	man					orlando
https://personography.1890s.ca/persons/keating-sean/	http://viaf.org/viaf/96348059	http://www.wikidata.org/entity/Q3775893	"Keating, Sean"	Sean Keating	"Keating, Sean"						orlando
https://personography.1890s.ca/persons/kellock-brown-william/			"Kellock Brown, William"	William Kellock Brown	"Kellock Brown, William"	man	1856	Glasgow	1934	Glasgow	orlando
https://personography.1890s.ca/persons/kennedy-william/	http://viaf.org/viaf/95684288	http://www.wikidata.org/entity/Q18619382	"Kennedy, William"	William Kennedy	"Kennedy, William"	man	1859	Glasgow	1918	Tangier	orlando
https://personography.1890s.ca/persons/khamara-smar/			"Khamara, Smar"	Smar Khamara	"Khamara, Smar"						orlando
https://personography.1890s.ca/persons/king-annie-philippine/			"King, Annie Philippine"	Annie Philippine King	"King, Annie Philippine"						orlando
https://personography.1890s.ca/persons/king-elizabeth-hamilton/			"King, Elizabeth Hamilton"	Elizabeth Hamilton King	"King, Elizabeth Hamilton"						orlando
https://personography.1890s.ca/persons/king-henry/			"King, Henry"	Henry King	"King, Henry"						orlando
https://personography.1890s.ca/persons/klein-abbe-felix/	http://viaf.org/viaf/66502457	http://www.wikidata.org/entity/Q16750728	"Klein, Abb√© F√©lix"	Abb√© F√©lix Klein	"Klein, Abb√© F√©lix"	man	1862	NTM			orlando
https://personography.1890s.ca/persons/knewstub-alice/			"Knewstub, Alice"	Alice Knewstub	"Knewstub, Alice"						orlando
https://personography.1890s.ca/persons/knightley-louisa/	http://viaf.org/viaf/39748297	http://www.wikidata.org/entity/Q18559818	"Knightley, Louisa"	Louisa Knightley	"Knightley, Louisa; Knightley of Fawsley, Lady"	woman					orlando
https://personography.1890s.ca/persons/koster-edward-bernard/	http://viaf.org/viaf/21912185	http://www.wikidata.org/entity/Q5920392	"Koster, Edward Bernard"	Edward Bernard Koster	"Koster, Edward Bernard"	man	1861	London	1937	The Hague	orlando
https://personography.1890s.ca/persons/kropotkin-pyotor/			"Kropotkin, Pyotor"	Pyotor Kropotkin	"Kropotkin, Pyotor"						orlando
https://personography.1890s.ca/persons/la-thangue-henry/	http://viaf.org/viaf/25469415	http://www.wikidata.org/entity/Q1606851	"La Thangue, Henry"	Henry La Thangue	"La Thangue, Henry"						orlando
https://personography.1890s.ca/persons/lambert-g-w/	http://viaf.org/viaf/124704999	http://www.wikidata.org/entity/Q2545507	"Lambert, G. W."	G. W. Lambert	"Lambert, George Washington; Lambert, G. W."	man	1873	Saint Petersburg	1930	New South Wales	orlando
https://personography.1890s.ca/persons/lamont-florence/			"Lamont, Florence"	Florence Lamont	"Lamont, Florence"						orlando
https://personography.1890s.ca/persons/lane-john/	http://viaf.org/viaf/95684288	http://www.wikidata.org/entity/Q18619382	"Lane, John"	John Lane	"Le France, Jean; Lane, John"	man	1854	West Putford	1925	Bayswater	orlando
https://personography.1890s.ca/persons/langley-walter/	http://viaf.org/viaf/95723874	http://www.wikidata.org/entity/Q1377833	"Langley, Walter"	Walter Langley	"Langley, Walter"	man	1852	Birmingham	1922	Penzance	orlando
https://personography.1890s.ca/persons/lanteri-eduoard/			"Lanteri, √âduoard"	√âduoard Lanteri	"Lanteri, √âduoard"						orlando
https://personography.1890s.ca/persons/lavery-john/	http://viaf.org/viaf/12401964	http://www.wikidata.org/entity/Q609328	"Lavery, John"	John Lavery	"Lavery, John"	man	1856	Belfast	1941	Rossenarra House	orlando
https://personography.1890s.ca/persons/lee-sydney/	http://viaf.org/viaf/95791906	http://www.wikidata.org/entity/Q7660014	"Lee, Sydney"	Sydney Lee	"Lee, Sydney"	man	1866	Manchester	1949	London	orlando
https://personography.1890s.ca/persons/lees-edith/	http://viaf.org/viaf/55722181	http://www.wikidata.org/entity/Q5338537	"Lees, Edith"	Edith Lees	"Lees, Edith"						orlando
https://personography.1890s.ca/persons/lessore-therese/	http://viaf.org/viaf/95738290	http://www.wikidata.org/entity/Q18783989	"Lessore, Therese"	Therese Lessore	"Lessore, Therese"						orlando
https://personography.1890s.ca/persons/lindsay-margaret/			"Lindsay, Margaret"	Margaret Lindsay	"Lindsay, Margaret"						orlando
https://personography.1890s.ca/persons/linnell-john/	http://viaf.org/viaf/66740555	http://www.wikidata.org/entity/Q250732	"Linnell, John"	John Linnell	"Linnell, John"	man					orlando
https://personography.1890s.ca/persons/lombroso-cesare/	http://viaf.org/viaf/59148930	http://www.wikidata.org/entity/Q202420	"Lombroso, Cesare"	Cesare Lombroso	"Lombroso, Cesare"	man	1835	Verona	1909	Turin	orlando
https://personography.1890s.ca/persons/macbeth-ann/	http://viaf.org/viaf/43816057	http://www.wikidata.org/entity/Q4275582	"Macbeth, Ann"	Ann Macbeth	"Macbeth, Ann"	woman	1875	Lancashire	1948	Carlisle	orlando
https://personography.1890s.ca/persons/macbeth-norman/	http://viaf.org/viaf/95787770	http://www.wikidata.org/entity/Q17479358	"Macbeth, Norman"	Norman Macbeth	"Macbeth, Norman"						orlando
https://personography.1890s.ca/persons/maccoll-d-s/	http://viaf.org/viaf/49591342	http://www.wikidata.org/entity/Q5312472	"MacColl, D. S."	D. S. MacColl	"MacColl, D. S."	man					orlando
https://personography.1890s.ca/persons/macdonald-leila/			"Macdonald, Leila"	Leila Macdonald	"Macdonald, Leila; Crackanthorpe, Mrs."	woman	1871	Mayfair	1944	Paris	orlando
https://personography.1890s.ca/persons/macdonald-margaret/			"Macdonald, Margaret"	Margaret Macdonald	"Macdonald, Margaret"	woman	1864	Tipton	1933	Chelsea; Royal Borough of Kensington and Chelsea	orlando
https://personography.1890s.ca/persons/macdonald-william/			"MacDonald, William"	William MacDonald	"W. M.; MacDonald, William"	man					orlando
https://personography.1890s.ca/persons/macdonnell-annie/			"Macdonnell, Annie"	Annie Macdonnell	"Macdonnell, Annie"	woman					orlando
https://personography.1890s.ca/persons/macdougall-w-brown/			"Macdougall, W. Brown"	W. Brown Macdougall	"Macdougal, William Brown; Macdougall, W. Brown"	man	1868	Glasgow	1936	Loughton	orlando
https://personography.1890s.ca/persons/macgillvray-pittendrigh/			"Macgillvray, Pittendrigh"	Pittendrigh Macgillvray	"Macgillvray, Pittendrigh"	man	1856	Inverurie	1938	Edinburgh	orlando
https://personography.1890s.ca/persons/mackenzie-j-d/			"Mackenzie, J. D."	J. D. Mackenzie	"Mackenzie, J. D.; Mackenzie, John Drew"	man	1861	Shanghai	1918	Norfolk	orlando
https://personography.1890s.ca/persons/mackenzie-t/			"Mackenzie, T."	T. Mackenzie	"Mackenzie, Tessa; Mackenzie, T."	woman					orlando
https://personography.1890s.ca/persons/mackenzie-w-a/			"Mackenzie, W. A."	W. A. Mackenzie	"Mackenzie, William Andrew; Mackenzie, W. A."	man	1870	Invergordon	1942	Geneva	orlando
https://personography.1890s.ca/persons/mackie-annie/			"Mackie, Annie"	Annie Mackie	"Mackie, Annie; MacDonald Walls, Anne"	woman					orlando
https://personography.1890s.ca/persons/mackie-charles-hodge/	http://viaf.org/viaf/67654362	http://www.wikidata.org/entity/Q19983495	"Mackie, Charles Hodge"	Charles Hodge Mackie	"Mackie, Charles Hodge"	man			1920	Edinburgh	orlando
https://personography.1890s.ca/persons/mackinlay-jean-sterling/			"Mackinlay, Jean Sterling"	Jean Sterling Mackinlay	"Mackinlay, Jean Sterling"						orlando
https://personography.1890s.ca/persons/mackintosh-charles-rennie/	http://viaf.org/viaf/74645185	http://www.wikidata.org/entity/Q220703	"Mackintosh, Charles Rennie"	Charles Rennie Mackintosh	"Mackintosh, Charles Rennie"						orlando
https://personography.1890s.ca/persons/mackmurdo-a-h/	http://viaf.org/viaf/112138456	http://www.wikidata.org/entity/Q2662935	"Mackmurdo, A. H."	A. H. Mackmurdo	"Mackmurdo, A. H."						orlando
https://personography.1890s.ca/persons/maclagan-ernest/	http://viaf.org/viaf/54905611	http://www.wikidata.org/entity/Q5387022	"Maclagan, Ernest"	Ernest Maclagan	"E.M.; Maclagan, Eric; Maclagan, Ernest"	man	1879	London	1951	Spain	orlando
https://personography.1890s.ca/persons/macleod-fiona/	http://viaf.org/viaf/27144257	http://www.wikidata.org/entity/Q1575288	"Macleod, Fiona"	Fiona Macleod	"Macleod, Fiona"	woman					orlando
https://personography.1890s.ca/persons/makower-stanley-victor/	http://viaf.org/viaf/70561909	http://www.wikidata.org/entity/Q64685817	"Makower, Stanley Victor"	Stanley Victor Makower	"Makower, Stanley Victor; V., V.O.C.S."	man	1871	London			orlando
https://personography.1890s.ca/persons/mallarme-stephane/	http://viaf.org/viaf/51692711	http://www.wikidata.org/entity/Q767	"Mallarme, Stephane"	Stephane Mallarme	"Mallarme, Stephane"	man					orlando
https://personography.1890s.ca/persons/mann-harrington/			"Mann, Harrington"	Harrington Mann	"Mann, Harrington"	man	1864	Glasgow	1937	New York City	orlando
https://personography.1890s.ca/persons/manson-j-b/	http://viaf.org/viaf/6293246	http://www.wikidata.org/entity/Q4309861	"Manson, J. B."	J. B. Manson	"Manson, J. B."						orlando
https://personography.1890s.ca/persons/marazion-james/			"Marazion, James"	James Marazion	"Marazion, James"						orlando
https://personography.1890s.ca/persons/marshall-christabel/	http://viaf.org/viaf/49215571	http://www.wikidata.org/entity/Q5109044	"Marshall, Christabel"	Christabel Marshall	"Marshall, Christabel Gertrude; Willett, Joanna C. M.; St John, Christopher; Marshall, Christabel; Christopher St John"		1871	Exeter	1960	Tenterden	orlando
https://personography.1890s.ca/persons/marston-lina/			"Marston, Lina"	Lina Marston	"Marston, Lina"	woman	1866	Middlesex			orlando
https://personography.1890s.ca/persons/martin-d/			"Martin, D."	D. Martin	"Martin, D.; Martin, David"	man					orlando
https://personography.1890s.ca/persons/marzials-theo/	http://viaf.org/viaf/2518292	http://www.wikidata.org/entity/Q7781472	"Marzials, Theo"	Theo Marzials	"Beverley, Mike; Marzials, Theophile Jules Henri; Marzials, Theo"	man	1850	Hautes-Pyr√©n√©es	1920	Colyton	orlando
https://personography.1890s.ca/persons/masefield-judith/			"Masefield, Judith"	Judith Masefield	"Masefield, Judith"						orlando
https://personography.1890s.ca/persons/masefield-lewis/			"Masefield, Lewis"	Lewis Masefield	"Masefield, Lewis"						orlando
https://personography.1890s.ca/persons/mason-marion-a/			"Mason, Marion A."	Marion A. Mason	"Mason, Marion A."	woman					orlando
https://personography.1890s.ca/persons/matheson-sarah-robertson/			"Matheson, Sarah Robertson"	Sarah Robertson Matheson	"Matheson, Sarah Robertson"	woman	1863	Dunfermline			orlando
https://personography.1890s.ca/persons/mathieu-wierzbinski-roman/			"Mathieu-Wierzbinski, Roman"	Roman Mathieu-Wierzbinski	"Mathieu-Wierzbinski, Roman"	man					orlando
https://personography.1890s.ca/persons/mattos-katharine-de/	http://viaf.org/viaf/88892922	http://www.wikidata.org/entity/Q6376248	"Mattos, Katharine de"	Katharine de Mattos	"Hertz-Garten, Theodor; Mattos, Katharine de; Stevenson, Katharine Elizabeth Alan"	woman	1851	Scotland	1939	Chelsea	orlando
https://personography.1890s.ca/persons/maugham-syrie/	http://viaf.org/viaf/50497548	http://www.wikidata.org/entity/Q7663337	"Maugham, Syrie"	Syrie Maugham	"Maugham, Syrie"						orlando
https://personography.1890s.ca/persons/maxwell-w-b/	http://viaf.org/viaf/73014818	http://www.wikidata.org/entity/Q7945340	"Maxwell, W. B."	W. B. Maxwell	"Maxwell, W. B.; Maxwell, William Babington"	man	1866	Richmond	1938	London	orlando
https://personography.1890s.ca/persons/may-phil/	http://viaf.org/viaf/7661227	http://www.wikidata.org/entity/Q3378808	"May, Phil"	Phil May	"May, Phil"	man	1864	Leeds	1903	St John's Wood	orlando
https://personography.1890s.ca/persons/mayne-ethel-colburn/	http://viaf.org/viaf/30567229	http://www.wikidata.org/entity/Q18209222	"Mayne, Ethel Colburn"	Ethel Colburn Mayne	"Mayne, Ethel Colburn; Mayne, Ethelind Frances Colburn; Frances E. Huntley"	woman	1865	County Kilkenny	1941	Torquay	orlando
https://personography.1890s.ca/persons/mcneill-dorelia/			"McNeill, Dorelia"	Dorelia McNeill	"McNeill, Dorelia"						orlando
https://personography.1890s.ca/persons/meinhold-william/	http://viaf.org/viaf/27133330	http://www.wikidata.org/entity/Q97304	"Meinhold, William"	William Meinhold	"Meinhold, William"						orlando
https://personography.1890s.ca/persons/melville-arthur/	http://viaf.org/viaf/16715773	http://www.wikidata.org/entity/Q710607	"Melville, Arthur"	Arthur Melville	"Melville, Arthur"						orlando
https://personography.1890s.ca/persons/mendes-catulle/	http://viaf.org/viaf/34460397	http://www.wikidata.org/entity/Q971215	"Mend√®s, Catulle"	Catulle Mend√®s	"Mend√®s, Catulle"						orlando
https://personography.1890s.ca/persons/meteyard-sydney-2/			"Meteyard, Sydney"	Sydney Meteyard	"Meteyard, Sydney"	man					orlando
https://personography.1890s.ca/persons/meunier-dauphin/	http://viaf.org/viaf/64771227	http://www.wikidata.org/entity/Q16969064	"Meunier, Dauphin"	Dauphin Meunier	"Meunier, Dauphin"	man					orlando
https://personography.1890s.ca/persons/meyer-zundel-suzanne/	http://viaf.org/viaf/56217655	http://www.wikidata.org/entity/Q104917832	"Meyer-Zundel, Suzanne"	Suzanne Meyer-Zundel	"Meyer-Zundel, Suzanne"						orlando
https://personography.1890s.ca/persons/milman-lena/	http://viaf.org/viaf/1629491	http://www.wikidata.org/entity/Q56816646	"Milman, Lena"	Lena Milman	"Clarke, Lena; Milman, Lena; Milman, Angelena Frances"	woman					orlando
https://personography.1890s.ca/persons/mokuchu-urushibara/	http://viaf.org/viaf/306353942	http://www.wikidata.org/entity/Q7901558	"Mokuchu, Urushibara"	Urushibara Mokuchu	"Mokuchu, Urushibara"						orlando
https://personography.1890s.ca/persons/money-coutts-f-b/	http://viaf.org/viaf/50034113	http://www.wikidata.org/entity/Q5481946	"Money Coutts, F. B."	F. B. Money Coutts	"Money, Francis Burdett Thomas; Coutts-Nevill, Francis Burdett ThomasLatymer, BaronMountjoy; Money Coutts, F. B."	man			1923	London	orlando
https://personography.1890s.ca/persons/monk-w/	http://viaf.org/viaf/95720318	http://www.wikidata.org/entity/Q27068037	"Monk, William"	William Monk	"Monk, William"	man	1863	Chester	1937	Chester	orlando
https://personography.1890s.ca/persons/monroe-claude/			"Monroe, Claude"	Claude Monroe	"Monroe, Claude"	man					orlando
https://personography.1890s.ca/persons/monsell-e/	http://viaf.org/viaf/96425475	http://www.wikidata.org/entity/Q5361141	"Monsell, E."	E. Monsell	"Darwin, Elinor; Monsell, E.; E. M.; Monsell, Elinor"	woman	1879	Limerick	1954	England; Limerick	orlando
https://personography.1890s.ca/persons/monsell-j/	http://viaf.org/viaf/311427974	http://www.wikidata.org/entity/Q15998271	"Monsell, J."	J. Monsell	"Monsell, J.; Monsell, John Robert"	man	1877	Limerick	1952	Sussex	orlando
https://personography.1890s.ca/persons/moore-g-e/	http://viaf.org/viaf/88634979	http://www.wikidata.org/entity/Q295386	"Moore, G. E."	G. E. Moore	"Moore, G. E."						orlando
https://personography.1890s.ca/persons/moore-george-augustus/	http://viaf.org/viaf/22160365	http://www.wikidata.org/entity/Q965927	"Moore, George Augustus"	George Augustus Moore	"Moore, George Augustus"	man	1852	Moore Hall	1933	Belgravia	orlando
https://personography.1890s.ca/persons/moore-t-sturge/	http://viaf.org/viaf/24709904	http://www.wikidata.org/entity/Q506813	"Moore, T. Sturge"	T. Sturge Moore	"Moore, T. Sturge"	man	1870	Hastings	1944	Windsor	orlando
https://personography.1890s.ca/persons/moreas-jean/	http://viaf.org/viaf/49229308	http://www.wikidata.org/entity/Q353857	"Mor√©as, Jean"	Jean Mor√©as	"Papadiamant√≥poulos, Y√°nnis; Mor√©as, Jean"	man	1856	Athens	1910	Paris	orlando
https://personography.1890s.ca/persons/morley-george/			"Morley, George"	George Morley	"Morley, George"	man					orlando
https://personography.1890s.ca/persons/morton-t-c/			"Morton, T. C."	T. C. Morton	"Morton, T. C.; Morton, Thomas Corsan"	man	1859	Glasgow	1928	Kirkcaldy	orlando
https://personography.1890s.ca/persons/moulton-louise-chandler/	http://viaf.org/viaf/13715100	http://www.wikidata.org/entity/Q4968247	"Moulton, Louise Chandler"	Louise Chandler Moulton	"Moulton, Louise Chandler"						orlando
https://personography.1890s.ca/persons/mulholland-clara/	http://viaf.org/viaf/19624857	http://www.wikidata.org/entity/Q60352157	"Mulholland, Clara"	Clara Mulholland	"Mulholland, Clara"						orlando
https://personography.1890s.ca/persons/mumford-lewis/	http://viaf.org/viaf/12312890	http://www.wikidata.org/entity/Q469888	"Mumford, Lewis"	Lewis Mumford	"Mumford, Lewis"						orlando
https://personography.1890s.ca/persons/myron-a/			"Myron, A."	A. Myron	"Myron, A."						orlando
https://personography.1890s.ca/persons/nairn-james/	http://viaf.org/viaf/40600779	http://www.wikidata.org/entity/Q6140272	"Nairn, James"	James Nairn	"Nairn, James"						orlando
https://personography.1890s.ca/persons/nansen-peter/	http://viaf.org/viaf/27834098	http://www.wikidata.org/entity/Q4349086	"Nansen, Peter"	Peter Nansen	"Nansen, Peter"						orlando
https://personography.1890s.ca/persons/naumann-paul/	http://viaf.org/viaf/262964098	http://www.wikidata.org/entity/Q94812560	"Naumann, Paul"	Paul Naumann	"Naumann, Paul"	man					orlando
https://personography.1890s.ca/persons/nettleship-j-t/	http://viaf.org/viaf/71199695	http://www.wikidata.org/entity/Q6261287	"Nettleship, J. T."	J. T. Nettleship	"Nettleship, John Trivett; Nettleship, J. T."	man	1841	Kettering	1902	Beaumont Street	orlando
https://personography.1890s.ca/persons/nevinson-henry-w/	http://viaf.org/viaf/22469411	http://www.wikidata.org/entity/Q5726292	"Nevinson, Henry W."	Henry W. Nevinson	"Nevinson, Henry W."	man	1856	Leicester	1941	Chipping Campden	orlando
https://personography.1890s.ca/persons/newbery-f-h/	http://viaf.org/viaf/9791117	http://www.wikidata.org/entity/Q5481274	"Newbery, F. H."	F. H. Newbery	"Newbery, F. H.; Newbery, Francis"	man	1855	Membury	1946	Corfe Castle	orlando
https://personography.1890s.ca/persons/newbery-jessie-wylie/			"Newbery, Jessie Wylie"	Jessie Wylie Newbery	"Newbery, Jessie Wylie"						orlando
https://personography.1890s.ca/persons/nicholson-frances/			"Nicholson, Frances"	Frances Nicholson	"Nicholson, Frances"						orlando
https://personography.1890s.ca/persons/nicoll-william-robertson/	http://viaf.org/viaf/295379886	http://www.wikidata.org/entity/Q8017677	"Nicoll, William Robertson"	William Robertson Nicoll	"Nicoll, William Robertson"						orlando
https://personography.1890s.ca/persons/noguchi-isamu/			"Noguchi, Isamu"	Isamu Noguchi	"Noguchi, Isamu"						orlando
https://personography.1890s.ca/persons/noguchi-yone/	http://viaf.org/viaf/68993658	http://www.wikidata.org/entity/Q1899252	"Noguchi, Yone"	Yone Noguchi	"Noguchi, Yonejir≈ç; Noguchi, Yone"	man	1875	Nagoya	1947	Tokyo	orlando
https://personography.1890s.ca/persons/oneill-maire/			"O'Neill, Maire"	Maire O'Neill	"O'Neill, Maire"						orlando
https://personography.1890s.ca/persons/oury-louis/	http://viaf.org/viaf/36922724	http://www.wikidata.org/entity/Q3262830	"Oury, Louis"	Louis Oury	"Oury, L√©on Louis; Oury, Louis"	man					orlando
https://personography.1890s.ca/persons/paine-albert-bigelow/	http://viaf.org/viaf/24731419	http://www.wikidata.org/entity/Q4710951	"Paine, Albert Bigelow"	Albert Bigelow Paine	"Paine, Albert Bigelow"	man	1861	New Bedford	1937	New Smyrna Beach	orlando
https://personography.1890s.ca/persons/park-carton-moore/	http://viaf.org/viaf/266163376	http://www.wikidata.org/entity/Q20054908	"Park, Carton Moore"	Carton Moore Park	"Frederick William Carton Moore Park; Carton Moorepark; Park, Carton Moore"	man	1877	Dublin	1956	New York City	orlando
https://personography.1890s.ca/persons/park-james-stuart/	http://viaf.org/viaf/3696547	http://www.wikidata.org/entity/Q21458438	"Park, James Stuart"	James Stuart Park	"Park, James Stuart"	man	1862	Kidderminster	1933	Kilmarnock	orlando
https://personography.1890s.ca/persons/paterson-a-mcc/			"Paterson, A. McC."	A. McC. Paterson	"Paterson, A. McC."						orlando
https://personography.1890s.ca/persons/paton-noel/	http://viaf.org/viaf/77119089	http://www.wikidata.org/entity/Q1364698	"Paton, No√´l"	No√´l Paton	"Paton, No√´l"	man	1821	Dunfermline	1901	Edinburgh	orlando
https://personography.1890s.ca/persons/pears-c-f/			"Pears, C. F."	C. F. Pears	"Pears, Charles; Pears, C. F.; Pears, Chas"	man	1873	Pontefract	1958	Truro	orlando
https://personography.1890s.ca/persons/pettie-john/	http://viaf.org/viaf/53681271	http://www.wikidata.org/entity/Q3182289	"Pettie, John"	John Pettie	"Pettie, John"						orlando
https://personography.1890s.ca/persons/phillips-stephen/	http://viaf.org/viaf/6410920	http://www.wikidata.org/entity/Q4484168	"Phillips, Stephen"	Stephen Phillips	"Phillips, Stephen"	man	1864	Summertown	1915	Goodwin's Cottage	orlando
https://personography.1890s.ca/persons/pimlott-e-philip/	http://viaf.org/viaf/232475963	http://www.wikidata.org/entity/Q56798393	"Pimlott, E. Philip"	E. Philip Pimlott	"Pimlott, E. Philip"	man					orlando
https://personography.1890s.ca/persons/pimlott-john/	http://viaf.org/viaf/101814329	http://www.wikidata.org/entity/Q97671665	"Pimlott, John"	John Pimlott	"Pimlott, John"						orlando
https://personography.1890s.ca/persons/pirie-george/	http://viaf.org/viaf/14533527	http://www.wikidata.org/entity/Q5543436	"Pirie, George"	George Pirie	"Pirie, George"	man	1863	Campbeltown	1946	Stirlingshire	orlando
https://personography.1890s.ca/persons/pissarro-camille/	http://viaf.org/viaf/14775224	http://www.wikidata.org/entity/Q134741	"Pissarro, Camille"	Camille Pissarro	"Pissarro, Camille"						orlando
https://personography.1890s.ca/persons/pissarro-orovida-camille/	http://viaf.org/viaf/95730543	http://www.wikidata.org/entity/Q7103894	"Pissarro, Orovida Camille"	Orovida Camille Pissarro	"Pissarro, Orovida Camille"						orlando
https://personography.1890s.ca/persons/plarr-victor/	http://viaf.org/viaf/36782198	http://www.wikidata.org/entity/Q7926244	"Plarr, Victor"	Victor Plarr	"Plarr, Victor"	man	1863	Olbernhau	1929	Wimbledon	orlando
https://personography.1890s.ca/persons/powell-f-york/	http://viaf.org/viaf/8135243	http://www.wikidata.org/entity/Q5499166	"Powell, F. York"	F. York Powell	"Powell, F. York"	man	1850	London	1904	London	orlando
https://personography.1890s.ca/persons/power-arthur/	http://viaf.org/viaf/22796772	http://www.wikidata.org/entity/Q61985964	"Power, Arthur"	Arthur Power	"Power, Arthur"						orlando
https://personography.1890s.ca/persons/prestage-edgar/	http://viaf.org/viaf/49214806	http://www.wikidata.org/entity/Q3090708	"Prestage, Edgar"	Edgar Prestage	"Prestage, Edgar"	man	1869	Manchester	1951	"16, Holland Street W8"	orlando
https://personography.1890s.ca/persons/prevost-francis/			"Prevost, Francis"	Francis Prevost	"Prevost, Francis; Prevost Battersby, Henry Francis"	man					orlando
https://personography.1890s.ca/persons/price-nancy/	http://viaf.org/viaf/36003274	http://www.wikidata.org/entity/Q13157611	"Price, Nancy"	Nancy Price	"Price, Nancy"						orlando
https://personography.1890s.ca/persons/prideaux-brune-gertrude/			"Prideaux-Brune, Gertrude"	Gertrude Prideaux-Brune	"Prideaux-Brune, Gertrude"	woman	1855	Cornwall	1945	Sunbury-on-Thames	orlando
https://personography.1890s.ca/persons/proctor-thea/	http://viaf.org/viaf/72475845	http://www.wikidata.org/entity/Q7777214	"Proctor, Thea"	Thea Proctor	"Proctor, Thea"						orlando
https://personography.1890s.ca/persons/pryde-james/	http://viaf.org/viaf/64754739	http://www.wikidata.org/entity/Q6141491	"Pryde, James"	James Pryde	"Pryde, James"						orlando
https://personography.1890s.ca/persons/pyke-nott-j-s/			"Pyke Nott, J. S."	J. S. Pyke Nott	"Pyke-Nott, James S.; Pyke Nott, J. S."	man					orlando
https://personography.1890s.ca/persons/quental-anthero-tarquinio-de/	http://viaf.org/viaf/100254861	http://www.wikidata.org/entity/Q467494	"Quental, Anthero Tarquinio de"	Anthero Tarquinio de Quental	"Quental, Anthero Tarquinio de"	man					orlando
https://personography.1890s.ca/persons/radford-ada/	http://viaf.org/viaf/276095089	http://www.wikidata.org/entity/Q27678631	"Radford, Ada"	Ada Radford	"Radford, Audrey; Wallas, Ada Radford; Radford, Ada"	woman	1859	Plymouth			orlando
https://personography.1890s.ca/persons/radford-dollie/	http://viaf.org/viaf/50659878	http://www.wikidata.org/entity/Q5289275	"Radford, Dollie"	Dollie Radford	"Maitland, Caroline; Radford, Dollie"	woman	1858	London	1922	England; Limerick	orlando
https://personography.1890s.ca/persons/rae-cecil-william/			"Rae, Cecil William"	Cecil William Rae	"Rae, Cecil William"						orlando
https://personography.1890s.ca/persons/raferty/			Raferty	Raferty 	"Raftery; Raifteiri, Antoine O.; Raferty"	man					orlando
https://personography.1890s.ca/persons/raffalovich-marc-andre/			"Raffalovich, Marc-Andr√©"	Marc-Andr√© Raffalovich	"Raffalovich, Marc-Andr√©"						orlando
https://personography.1890s.ca/persons/ramsay-effie/			"Ramsay, Effie"	Effie Ramsay	"Ramsay, Effie"	woman					orlando
https://personography.1890s.ca/persons/ramsay-hugh/	http://viaf.org/viaf/4015070	http://www.wikidata.org/entity/Q1951367	"Ramsay, Hugh"	Hugh Ramsay	"Ramsay, Hugh"						orlando
https://personography.1890s.ca/persons/raven-hill-leonard/	http://viaf.org/viaf/64276221	http://www.wikidata.org/entity/Q6525658	"Raven-Hill, Leonard"	Leonard Raven-Hill	"Raven-Hill, Leonard"						orlando
https://personography.1890s.ca/persons/reclus-elie/	http://viaf.org/viaf/76388157	http://www.wikidata.org/entity/Q1227381	"Reclus, Elie"	Elie Reclus	"Reclus, Elie"	man					orlando
https://personography.1890s.ca/persons/reclus-elisee/	http://viaf.org/viaf/71396743	http://www.wikidata.org/entity/Q20951	"Reclus, √âlis√©e"	√âlis√©e Reclus	"Reclus, √âlis√©e"	man	1830	Sainte-Foy-la-Grande	1905	Torhout	orlando
https://personography.1890s.ca/persons/reed-ethel/	http://viaf.org/viaf/305822821	http://www.wikidata.org/entity/Q4394452	"Reed, Ethel"	Ethel Reed	"Reed, Ethel"	woman	1874	Newburyport	1912	London	orlando
https://personography.1890s.ca/persons/rheam-henry-meynell/	http://viaf.org/viaf/95865097	http://www.wikidata.org/entity/Q1295781	"Rheam, Henry Meynell"	Henry Meynell Rheam	"Rheam, Henry Meynell"	man	1859	Birkenhead	1920	Alverton	orlando
https://personography.1890s.ca/persons/rhys-grace/	http://viaf.org/viaf/18260003	http://www.wikidata.org/entity/Q5591357	"Rhys, Grace"	Grace Rhys	"Rhys, Grace"						orlando
https://personography.1890s.ca/persons/richard-laure-caroline/			"Richard, Laure Caroline"	Laure Caroline Richard	"Richard, Laure Caroline"						orlando
https://personography.1890s.ca/persons/rigby-reginald/			"Rigby, Reginald"	Reginald Rigby	"Rigby, Reginald; Rigby, Thomas Reginald"	man	1881	Lancashire			orlando
https://personography.1890s.ca/persons/rinder-frank/	http://viaf.org/viaf/23202552	http://www.wikidata.org/entity/Q94259846	"Rinder, Frank"	Frank Rinder	"Rinder, Frank"						orlando
https://personography.1890s.ca/persons/risley-r-v/			"Risley, R. V."	R. V. Risley	"Risley, R. V.; Risley, Richard Voorhees"	man					orlando
https://personography.1890s.ca/persons/ritter-carl/			"Ritter, Carl"	Carl Ritter	"Ritter, Carl"						orlando
https://personography.1890s.ca/persons/roberts-r-ellis/	http://viaf.org/viaf/18300809	http://www.wikidata.org/entity/Q52156315	"Roberts, R. Ellis"	R. Ellis Roberts	"Roberts, R. Ellis"	man	1879	England	1953	California	orlando
https://personography.1890s.ca/persons/roberts-thomas-william/	http://viaf.org/viaf/40202284	http://www.wikidata.org/entity/Q1291901	"Roberts, Thomas William"	Thomas William Roberts	"Roberts, Thomas William"						orlando
https://personography.1890s.ca/persons/robertson-john-mackinnon/	http://viaf.org/viaf/7479661	http://www.wikidata.org/entity/Q333641	"Robertson, John Mackinnon"	John Mackinnon Robertson	"Robertson, John Mackinnon"	man	1856	Brodick	1933	South Kensington	orlando
https://personography.1890s.ca/persons/robertson-nora-murray/			"Robertson, Nora Murray"	Nora Murray Robertson	"Robertson, Nora Murray"	woman					orlando
https://personography.1890s.ca/persons/robertson-w-j/			"Robertson, W.J."	W.J. Robertson	"Robertson, W.J."						orlando
https://personography.1890s.ca/persons/robinson-janetta-newton/			"Robinson, Janetta Newton"	Janetta Newton Robinson	"Robinson, Janetta Newton"						orlando
https://personography.1890s.ca/persons/robinson-mary/			"Robinson, Mary"	Mary Robinson	"Robinson, Mary"						orlando
https://personography.1890s.ca/persons/robinson-thomas-heath/	http://viaf.org/viaf/69735990	http://www.wikidata.org/entity/Q19635857	"Robinson, Thomas Heath"	Thomas Heath Robinson	"Robinson, Thomas Heath"						orlando
https://personography.1890s.ca/persons/robinson-thomas/			"Robinson, Thomas"	Thomas Robinson	"Robinson, Thomas"						orlando
https://personography.1890s.ca/persons/robinson-william-heath/	http://viaf.org/viaf/95146331	http://www.wikidata.org/entity/Q731717	"Robinson, William Heath"	William Heath Robinson	"Robinson, William Heath"						orlando
https://personography.1890s.ca/persons/roche-alexander-ignatius/	http://viaf.org/viaf/95712891	http://www.wikidata.org/entity/Q281207	"Roche, Alexander Ignatius"	Alexander Ignatius Roche	"Roche, Alexander Ignatius"	man	1861	Glasgow	1921	Slateford	orlando
https://personography.1890s.ca/persons/rodstand-edmond/			"Rodstand, Edmond"	Edmond Rodstand	"Rodstand, Edmond"	man					orlando
https://personography.1890s.ca/persons/rolfe-frederick-william/	http://viaf.org/viaf/64026547	http://www.wikidata.org/entity/Q1289140	"Rolfe, Frederick William"	Frederick William Rolfe	"Baron Corvo; Rolfe, Frederick William; Prospero, FrederickRolfe, Frederick William Serafino Austin Lewis Mary"	man	1860	Cheapside	1913	Venice	orlando
https://personography.1890s.ca/persons/rowe-louise-jopling/			"Rowe, Louise Jopling"	Louise Jopling Rowe	"Rowe, Louise Jopling"						orlando
https://personography.1890s.ca/persons/russell-george/	http://viaf.org/viaf/121823798	http://www.wikidata.org/entity/Q366070	"Russell, George"	George Russell	"Russell, George William; Russell, George; AE"	man	1867	Lurgan	1935	Bournemouth	orlando
https://personography.1890s.ca/persons/russell-w-w/			"Russell, W. W."	W. W. Russell	"Russell, Walter Westley; Russell, W. W."	man	1867	Forest Gate	1949	Kensington	orlando
https://personography.1890s.ca/persons/s/			S.	S. 	S.						orlando
https://personography.1890s.ca/persons/saintsbury-george-edward-bateman/	http://viaf.org/viaf/120695179	http://www.wikidata.org/entity/Q1419967	"Saintsbury, George Edward Bateman"	George Edward Bateman Saintsbury	"Saintsbury, George Edward Bateman"	man	1845	Southampton	1933	Royal Crescent	orlando
https://personography.1890s.ca/persons/salt-h-s/	http://viaf.org/viaf/7511239	http://www.wikidata.org/entity/Q1364647	"Salt, H. S."	H. S. Salt	"Salt, Henry Stephens; Salt, H. S."	man	1851	Nainital	1939	Brighton	orlando
https://personography.1890s.ca/persons/sandys-emma/	http://viaf.org/viaf/95862180	http://www.wikidata.org/entity/Q2511313	"Sandys, Emma"	Emma Sandys	"Sandys, Emma"						orlando
https://personography.1890s.ca/persons/sandys-frederick/	http://viaf.org/viaf/3387346	http://www.wikidata.org/entity/Q1470796	"Sandys, Frederick"	Frederick Sandys	"Sandys, Frederick"	man	1829	Norwich	1904	Kensington	orlando
https://personography.1890s.ca/persons/sargent-john-s/	http://viaf.org/viaf/12466780	http://www.wikidata.org/entity/Q155626	"Sargent, John S."	John S. Sargent	"Sargent, John S."	man	1856	Florence	1925	Tite Street	orlando
https://personography.1890s.ca/persons/sarolea-charles/	http://viaf.org/viaf/10202024	http://www.wikidata.org/entity/Q5082354	"Sarol√©a, Charles"	Charles Sarol√©a	"Sarol√©a, Charles"	man	1870	Tongeren	1953	"Edinburgh, 21 Royal Terrace"	orlando
https://personography.1890s.ca/persons/scott-samuel-mathewson/			"Scott, Samuel Mathewson"	Samuel Mathewson Scott	"Scott, Samuel Mathewson"	man					orlando
https://personography.1890s.ca/persons/seeley-john-richard/			"Seeley, John Richard"	John Richard Seeley	"Seeley, John Richard"						orlando
https://personography.1890s.ca/persons/serusier-paul/	http://viaf.org/viaf/32004766	http://www.wikidata.org/entity/Q326606	"S√©rusier, Paul"	Paul S√©rusier	"S√©rusier, Paul"	man	1864	Paris	1927	Morlaix	orlando
https://personography.1890s.ca/persons/setoun-gabriel/	http://viaf.org/viaf/47136932	http://www.wikidata.org/entity/Q7792747	"Setoun, Gabriel"	Gabriel Setoun	"Hepburn, Thomas Nicoll; Setoun, Gabriel"	man					orlando
https://personography.1890s.ca/persons/seurat-georges/	http://viaf.org/viaf/24608076	http://www.wikidata.org/entity/Q34013	"Seurat, Georges"	Georges Seurat	"Seurat, Georges"						orlando
https://personography.1890s.ca/persons/shand-w-l/			"Shand, W. L."	W. L. Shand	"Shand, W. L."	man					orlando
https://personography.1890s.ca/persons/shannon-charles-h/	http://viaf.org/viaf/5203036	http://www.wikidata.org/entity/Q5078832	"Shannon, Charles H."	Charles H. Shannon	"Charles Hazelwood Shannon; Charles Haslewood Shannon; Shannon, Charles H."	man	1863	Quarrington	1937	Richmond	orlando
https://personography.1890s.ca/persons/sharp-elizabeth-a/	http://viaf.org/viaf/10126116	http://www.wikidata.org/entity/Q52155552	"Sharp, Elizabeth A."	Elizabeth A. Sharp	"Sharp, Elizabeth A."	woman	1856	London			orlando
https://personography.1890s.ca/persons/shaw-geoffrey/			"Shaw, Geoffrey"	Geoffrey Shaw	"Shaw, Geoffrey"						orlando
https://personography.1890s.ca/persons/shaw-herbert/			"Shaw, Herbert"	Herbert Shaw	"Shaw, Herbert; Shaw, Richard James Herbert"	man	1885	Dublin			orlando
https://personography.1890s.ca/persons/shiel-matthew/	http://viaf.org/viaf/54194618	http://www.wikidata.org/entity/Q2517956	"Shiel, Matthew"	Matthew Shiel	"Shiel, Matthew"						orlando
https://personography.1890s.ca/persons/sickert-oswald-adalbert/	http://viaf.org/viaf/96343315	http://www.wikidata.org/entity/Q7108164	"Sickert, Oswald Adalbert"	Oswald Adalbert Sickert	"Sickert, Oswald Adalbert"						orlando
https://personography.1890s.ca/persons/sickert-oswald-valentine/	http://viaf.org/viaf/92586838	http://www.wikidata.org/entity/Q18629603	"Sickert, Oswald Valentine"	Oswald Valentine Sickert	"O., V.O.C.S.; Sickert, Oswald Valentine"	man	1871	London			orlando
https://personography.1890s.ca/persons/sidgwick-cecily/	http://viaf.org/viaf/49406168	http://www.wikidata.org/entity/Q58237078	"Sidgwick, Cecily"	Cecily Sidgwick	"Sidgwick, Cecily"						orlando
https://personography.1890s.ca/persons/signac-paul/	http://viaf.org/viaf/46767282	http://www.wikidata.org/entity/Q151573	"Signac, Paul"	Paul Signac	"Signac, Paul"						orlando
https://personography.1890s.ca/persons/simons-l/	http://viaf.org/viaf/121572429	http://www.wikidata.org/entity/Q3229598	"Simons, L."	L. Simons	"Simons, Leo; Simons, L."	man	1862	The Hague	1932	Rotterdam	orlando
https://personography.1890s.ca/persons/simpson-fred-m/			"Simpson, Fred M."	Fred M. Simpson	"Simpson, Fred M."	man					orlando
https://personography.1890s.ca/persons/sinclair-alexander-garden/	http://viaf.org/viaf/76190701	http://www.wikidata.org/entity/Q21454547	"Sinclair, Alexander Garden"	Alexander Garden Sinclair	"Sinclair, Alexander Garden"	man	1859	Kenmore	1930	Edinburgh	orlando
https://personography.1890s.ca/persons/sleator-james/	http://viaf.org/viaf/96495909	http://www.wikidata.org/entity/Q6143275	"Sleator, James"	James Sleator	"Sleator, James"						orlando
https://personography.1890s.ca/persons/sleigh-bernard-barney/			"Sleigh, Bernard Barney"	Bernard Barney Sleigh	"Sleigh, Bernard Barney"	man	1872	Birmingham			orlando
https://personography.1890s.ca/persons/smalley-evelyn-garnaut/			"Smalley, Evelyn Garnaut"	Evelyn Garnaut Smalley	"Smalley, Evelyn Garnaut"	woman	1869	New York City	1938	Hautes-Pyr√©n√©es	orlando
https://personography.1890s.ca/persons/smith-bernhard/			"Smith, Bernhard"	Bernhard Smith	"Bernhard-Smith, William Arthur Hans; Smith, Bernhard"	man			1927	Birchington	orlando
https://personography.1890s.ca/persons/smith-pamela-colman/	http://viaf.org/viaf/44549388	http://www.wikidata.org/entity/Q515745	"Smith, Pamela Colman"	Pamela Colman Smith	"P. C. S.; Smith, Pamela Colman"	woman	1878	Belgrave Road	1951	Bude	orlando
https://personography.1890s.ca/persons/smith-w/			"Smith, W."	W. Smith	"Smith, W."						orlando
https://personography.1890s.ca/persons/southall-j-e/	http://viaf.org/viaf/53877274	http://www.wikidata.org/entity/Q20733393	"Southall, J. E."	J. E. Southall	"Southall, Joseph Edward; Southall, J. E."	man	1861	Nottingham	1944	"13 And 14, Charlotte Road B3"	orlando
https://personography.1890s.ca/persons/starr-ellen-gates/	http://viaf.org/viaf/166848460	http://www.wikidata.org/entity/Q1331815	"Starr, Ellen Gates"	Ellen Gates Starr	"Starr, Ellen Gates"						orlando
https://personography.1890s.ca/persons/stedman-e-c/	http://viaf.org/viaf/74024682	http://www.wikidata.org/entity/Q3719466	"Stedman, E. C."	E. C. Stedman	"Stedman, E. C."						orlando
https://personography.1890s.ca/persons/steer-p-wilson/	http://viaf.org/viaf/40174630	http://www.wikidata.org/entity/Q2076179	"Steer, P. Wilson"	P. Wilson Steer	"Steer, Philip Wilson; Steer, P. Wilson"	man	1860	Birkenhead	1942	Cheyne Walk	orlando
https://personography.1890s.ca/persons/stevenson-r-m/	http://viaf.org/viaf/95784593	http://www.wikidata.org/entity/Q15435269	"Stevenson, R. M."	R. M. Stevenson	"Stevenson, R. M.; Stevenson, Robert Macaulay"	man	1854	Glasgow	1952	"Bardowie, Robinsfield"	orlando
https://personography.1890s.ca/persons/stevenson-robert-louis/	http://viaf.org/viaf/95207986	http://www.wikidata.org/entity/Q1512	"Stevenson, Robert Louis"	Robert Louis Stevenson	"Stevenson, Robert Louis"						orlando
https://personography.1890s.ca/persons/storrs-ronald/	http://viaf.org/viaf/65453680	http://www.wikidata.org/entity/Q2748699	"Storrs, Ronald"	Ronald Storrs	"Storrs, Ronald"						orlando
https://personography.1890s.ca/persons/street-g-s/	http://viaf.org/viaf/23686559	http://www.wikidata.org/entity/Q5512469	"Street, G. S."	G. S. Street	"Street, G. S.; Street, George Slythe"	man	1867	Wimbledon			orlando
https://personography.1890s.ca/persons/strettell-alice-vansittart/			"Strettell, Alice Vansittart"	Alice Vansittart Strettell	"Strettell, Alice Vansittart"						orlando
https://personography.1890s.ca/persons/sullivan-e-j/	http://viaf.org/viaf/64279900	http://www.wikidata.org/entity/Q574404	"Sullivan, E. J."	E. J. Sullivan	"Sullivan, E. J.; Sullivan, Edmund Joseph"	man	1869	London	1933	London	orlando
https://personography.1890s.ca/persons/svevo-italo/	http://viaf.org/viaf/49232071	http://www.wikidata.org/entity/Q216478	"Svevo, Italo"	Italo Svevo	"Svevo, Italo"						orlando
https://personography.1890s.ca/persons/swain-junior-joseph/			"Swain Junior, Joseph"	Joseph Swain Junior	"Swain Junior, Joseph"						orlando
https://personography.1890s.ca/persons/swain-senior-joseph/			"Swain Senior, Joseph"	Joseph Swain Senior	"Swain Senior, Joseph"						orlando
https://personography.1890s.ca/persons/swettenham-frank-athelstane/	http://viaf.org/viaf/42704800	http://www.wikidata.org/entity/Q4209641	"Swettenham, Frank Athelstane"	Frank Athelstane Swettenham	"Swettenham, Frank Athelstane"	man	1850	Belper	1946	Hyde Park Gate	orlando
https://personography.1890s.ca/persons/sydney-charles/			"Sydney, Charles"	Charles Sydney	"Sydney, Charles"	man					orlando
https://personography.1890s.ca/persons/symonds-john-addington/	http://viaf.org/viaf/39500310	http://www.wikidata.org/entity/Q538549	"Symonds, John Addington"	John Addington Symonds	"Symonds, John Addington"						orlando
https://personography.1890s.ca/persons/syrett-mabel/			"Syrett, Mabel"	Mabel Syrett	"Syrett, Mabel"	woman	1871	Ramsgate	1961	Storrington	orlando
https://personography.1890s.ca/persons/szold-aline/			"Szold, Aline"	Aline Szold	"Szold, Aline"	woman	1870	Peoria	1895	Peoria	orlando
https://personography.1890s.ca/persons/thicknesse-lily/			"Thicknesse, Lily"	Lily Thicknesse	"Thicknesse, Lily"	woman			1952	Alton	orlando
https://personography.1890s.ca/persons/thierry-cecil-de/			"Thierry, Cecil de"	Cecil de Thierry	"Campbell, Mrs. J Weston; Thierry, Cecil de"						orlando
https://personography.1890s.ca/persons/thomas-edward/	http://viaf.org/viaf/19686045	http://www.wikidata.org/entity/Q1293865	"Thomas, Edward"	Edward Thomas	"Thomas, Edward"	man	1878	London Borough of Lambeth	1917	Arras	orlando
https://personography.1890s.ca/persons/thomas-george-grosvenor/			"Thomas, George Grosvenor"	George Grosvenor Thomas	"Thomas, George Grosvenor"	man	1860	Towie	1939	Boulogne-sur-Mer	orlando
https://personography.1890s.ca/persons/thompson-charles-miner/	http://viaf.org/viaf/25829917	http://www.wikidata.org/entity/Q105046512	"Thompson, Charles Miner"	Charles Miner Thompson	"Thompson, Charles Miner"	man	1864	United States of America	1941	Cambridge	orlando
https://personography.1890s.ca/persons/thompson-elizabeth/			"Thompson, Elizabeth"	Elizabeth Thompson	"Thompson, Elizabeth"						orlando
https://personography.1890s.ca/persons/thomson-george/			"Thomson, George"	George Thomson	"Thomson, George"	man					orlando
https://personography.1890s.ca/persons/thomson-j-arthur/	http://viaf.org/viaf/22150466	http://www.wikidata.org/entity/Q2741203	"Thomson, J. Arthur"	J. Arthur Thomson	"The Authors of ""The Evolution of Sex'; Thomson, J. Arthur; Thomson, John Arthur"	man	1861	Salton	1933	Limpsfield	orlando
https://personography.1890s.ca/persons/thomson-margaret/			"Thomson, Margaret R."	Margaret R. Thomson	"Thomson, Margaret R."	woman					orlando
https://personography.1890s.ca/persons/thornton-alfred-henry-robinson/	http://viaf.org/viaf/95708345	http://www.wikidata.org/entity/Q15856365	"Thornton, Alfred Henry Robinson"	Alfred Henry Robinson Thornton	"Thornton, Alfred Henry Robinson"	man	1863	Delhi	1939	Painswick	orlando
https://personography.1890s.ca/persons/thorp-sidney-benson/			"Thorp, Sidney Benson"	Sidney Benson Thorp	"Thorp, Sidney Benson"	man	1865	Essex			orlando
https://personography.1890s.ca/persons/toft-charles/	http://viaf.org/viaf/309814120	http://www.wikidata.org/entity/Q21463713	"Toft, Charles"	Charles Toft	"Toft, Charles"						orlando
https://personography.1890s.ca/persons/tollemache-aethel/			"Tollemache, Aethel"	Aethel Tollemache	"Tollemache, Aethel"						orlando
https://personography.1890s.ca/persons/tollemache-clement-reginald/			"Tollemache, Clement Reginald"	Clement Reginald Tollemache	"Tollemache, Clement Reginald"						orlando
https://personography.1890s.ca/persons/tollemache-frances-josephine/			"Tollemache, Frances Josephine"	Frances Josephine Tollemache	"Tollemache, Frances Josephine"						orlando
https://personography.1890s.ca/persons/tollemache-mary/			"Tollemache, Mary"	Mary Tollemache	"Tollemache, Mary"						orlando
https://personography.1890s.ca/persons/tomson-arthur-graham/			"Tomson, Arthur Graham"	Arthur Graham Tomson	"Tomson, Arthur Graham"						orlando
https://personography.1890s.ca/persons/toulouse-lautrec-henri/	http://viaf.org/viaf/32003649	http://www.wikidata.org/entity/Q82445	"Toulouse-Lautrec, Henri"	Henri Toulouse-Lautrec	"Toulouse-Lautrec, Henri"						orlando
https://personography.1890s.ca/persons/traill-h-d/	http://viaf.org/viaf/15140186	http://www.wikidata.org/entity/Q5720507	"Traill, H. D."	H. D. Traill	"Traill, H. D.; Traill, Henry Duff"	man	1842	Blackheath	1900	Paddington	orlando
https://personography.1890s.ca/persons/treglown-e-g/			"Treglown, E. G."	E. G. Treglown	"Treglown, Ernest George; Treglown, E. G."	man	1864	Cornwall	1922	Meriden	orlando
https://personography.1890s.ca/persons/trevelyan-r-c/	http://viaf.org/viaf/55066267	http://www.wikidata.org/entity/Q1743249	"Trevelyan, R. C."	R. C. Trevelyan	"Trevelyan, R. C."						orlando
https://personography.1890s.ca/persons/tuke-henry-scott/	http://viaf.org/viaf/40217163	http://www.wikidata.org/entity/Q463962	"Tuke, Henry Scott"	Henry Scott Tuke	"Tuke, Henry Scott"						orlando
https://personography.1890s.ca/persons/vallance-aymer/	http://viaf.org/viaf/34828402	http://www.wikidata.org/entity/Q16943924	"Vallance, Aymer"	Aymer Vallance	"Vallance, William Howard Aymer; Vallance, Aymer"	man	1862	Sittingbourne	1943	England; Limerick	orlando
https://personography.1890s.ca/persons/vanlerberghe-charles/	http://viaf.org/viaf/64018563	http://www.wikidata.org/entity/Q93871	"VanLerberghe, Charles"	Charles VanLerberghe	"VanLerberghe, Charles"	man					orlando
https://personography.1890s.ca/persons/verhaeren-emile/	http://viaf.org/viaf/27072663	http://www.wikidata.org/entity/Q193680	"Verhaeren, Emile"	Emile Verhaeren	"Verhaeren, Emile"	man	1855	Saint-Amand	1916	Rouen	orlando
https://personography.1890s.ca/persons/villon-francois/	http://viaf.org/viaf/7398349	http://www.wikidata.org/entity/Q849	"Villon, Fran√ßois"	Fran√ßois Villon	"Villon, Fran√ßois"	man					orlando
https://personography.1890s.ca/persons/vita/			Vita	Vita 	Vita						orlando
https://personography.1890s.ca/persons/vivien-renee/	http://viaf.org/viaf/122002241	http://www.wikidata.org/entity/Q275628	"Vivien, Renee"	Renee Vivien	"Vivien, Renee"						orlando
https://personography.1890s.ca/persons/waite-arthur-edward/			"Waite, Arthur Edward"	Arthur Edward Waite	"Waite, Arthur Edward"						orlando
https://personography.1890s.ca/persons/waller-max/			"Waller, Max"	Max Waller	"Waller, Max"						orlando
https://personography.1890s.ca/persons/walls-w/			"Walls, W."	W. Walls	"Walls, William; Walls, W."	man	1860	Dunfermline			orlando
https://personography.1890s.ca/persons/ward-eleanor-vicocq/			"Ward, Eleanor Vicocq"	Eleanor Vicocq Ward	"Ward, Eleanor Vicocq; Frances Eleanor ‚ÄúNora‚Äù Veacock Ward Elstree"	woman	1889	Chislehurst	1976	Richmond	orlando
https://personography.1890s.ca/persons/watkins-s-cornish/			"Watkins, S. Cornish"	S. Cornish Watkins	"Watkins, S. Cornish"						orlando
https://personography.1890s.ca/persons/watson-william/	http://viaf.org/viaf/36926713	http://www.wikidata.org/entity/Q8020076	"Watson, William"	William Watson	"Watson, John William; Watson, William"	man	1858	Yorkshire	1935	Ditchling Common	orlando
https://personography.1890s.ca/persons/watt-francis/	http://viaf.org/viaf/66536648	http://www.wikidata.org/entity/Q19357014	"Watt, Francis"	Francis Watt	"Watt, Francis"	man	1849	Haddington	1927	Herne Hill	orlando
https://personography.1890s.ca/persons/waugh-f-t/	http://viaf.org/viaf/10727443	http://www.wikidata.org/entity/Q5498174	"Waugh, Frederick J."	Frederick J. Waugh	"Waugh, Frederick J."	man	1861	Bordentown	1940	Provincetown	orlando
https://personography.1890s.ca/persons/way-t-r/	http://viaf.org/viaf/50602312	http://www.wikidata.org/entity/Q7793581	"Way, T.R."	T.R. Way	"Way, T.R.; Way, Thomas Robert"	man	1861	Strand	1913	Regent's Park	orlando
https://personography.1890s.ca/persons/wedmore-frederick/	http://viaf.org/viaf/6319143	http://www.wikidata.org/entity/Q5499013	"Wedmore, Frederick"	Frederick Wedmore	"Wedmore, Frederick"	man	1844	Clifton	1921	Sevenoaks	orlando
https://personography.1890s.ca/persons/welch-sissie/			"Welch, Sissie"	Sissie Welch	"Welch, Sissie"						orlando
https://personography.1890s.ca/persons/wentworth-ernest/			"Wentworth, Ernest"	Ernest Wentworth	"Wentworth, Ernest"	man					orlando
https://personography.1890s.ca/persons/white-j-w-gleeson/	http://viaf.org/viaf/72676219	http://www.wikidata.org/entity/Q5567501	"White, J. W. Gleeson"	J. W. Gleeson White	"White, J. W. Gleeson"	man	1851	Christchurch			orlando
https://personography.1890s.ca/persons/white-terence-de-vere/	http://viaf.org/viaf/32014566	http://www.wikidata.org/entity/Q7702037	"White, Terence de Vere"	Terence de Vere White	"White, Terence de Vere"						orlando
https://personography.1890s.ca/persons/whiteley-arthur-sale/			"Whiteley, Arthur Sale"	Arthur Sale Whiteley	"Whiteley, Arthur Sale"						orlando
https://personography.1890s.ca/persons/williams-e-harcourt/	http://viaf.org/viaf/98305187	http://www.wikidata.org/entity/Q1237675	"Williams, E. Harcourt"	E. Harcourt Williams	"Williams, E. Harcourt; Williams, Ernest George Harcourt"	man	1880	London Borough of Croydon; Croydon	1957	London	orlando
https://personography.1890s.ca/persons/williams-ralph-vaughan/	http://viaf.org/viaf/89801735	http://www.wikidata.org/entity/Q207947	"Williams, Ralph Vaughan"	Ralph Vaughan Williams	"Williams, Ralph Vaughan"						orlando
https://personography.1890s.ca/persons/williams-sarah-jane/			"Williams, Sarah Jane"	Sarah Jane Williams	"Williams, Sarah Jane"						orlando
https://personography.1890s.ca/persons/wilson-patten/	http://viaf.org/viaf/96099805	http://www.wikidata.org/entity/Q7148348	"Wilson, Patten"	Patten Wilson	"Wilson, Patten"	man	1869	Shropshire	1934	Chelsea; Royal Borough of Kensington and Chelsea	orlando
https://personography.1890s.ca/persons/windover-wm/			"Windover, Wm."	Wm. Windover	"Windover, Wm."						orlando
https://personography.1890s.ca/persons/wingrave-lionel/			"Wingrave, Lionel"	Lionel Wingrave	"Wingrave, Lionel"						orlando
https://personography.1890s.ca/persons/womrath-andrew-kay/	http://viaf.org/viaf/24871500	http://www.wikidata.org/entity/Q4757582	"Womrath, Andrew Kay"	Andrew Kay Womrath	"Womrath, Andrew Kay"	man	1869	Philadelphia			orlando
https://personography.1890s.ca/persons/woods-margaret-l/	http://viaf.org/viaf/57798517	http://www.wikidata.org/entity/Q3846897	"Woods, Margaret L."	Margaret L. Woods	"Margaret Louisa Bradley; Woods, Margaret L.; Daisy"	woman	1855	Rugby			orlando
https://personography.1890s.ca/persons/woodville-william-passenham-caton/			"Woodville, William Passenham Caton"	William Passenham Caton Woodville	"Woodville, William Passenham Caton"						orlando
https://personography.1890s.ca/persons/wyllarde-dolf/	http://viaf.org/viaf/61461413	http://www.wikidata.org/entity/Q56574426	"Wyllarde, Dolf"	Dolf Wyllarde	"Lowndes, Dorothy Margarette Selby; Wyllarde, Dolf"	woman					orlando
https://personography.1890s.ca/persons/wynne-ellis-j/			"Wynne, Ellis J."	Ellis J. Wynne	"Wynne, Ellis J."	man					orlando
https://personography.1890s.ca/persons/yeast-john-butler/	http://viaf.org/viaf/17394443	http://www.wikidata.org/entity/Q2356757	"Yeats, John Butler"	John Butler Yeats	"Yeats, John Butler"	man	1839	Tullylish	1922	New York City	orlando
https://personography.1890s.ca/persons/yeats-jack-butler/	http://viaf.org/viaf/49340985	http://www.wikidata.org/entity/Q560488	"Yeats, Jack B."	Jack B. Yeats	"Yeats, Jack B."	man	1871	Primrose Hill	1957	Dublin	orlando
https://personography.1890s.ca/persons/yeats-w-b/	http://viaf.org/viaf/89854554	http://www.wikidata.org/entity/Q4800629	"Yeats, W. B."	W. B. Yeats	"Yeats, W. B.; Yeats, William Butler"	man	1865	Dublin			orlando
https://personography.1890s.ca/persons/york-william-macgregor/			"York, William Macgregor"	William Macgregor York	"York, William Macgregor"						orlando
https://personography.1890s.ca/persons/zola-emile/			"Zola, √âmile"	√âmile Zola	"Zola, √âmile"						orlando