{
	"info": {
		"_postman_id": "8aa61ddd-8638-4e83-aff5-24057aace27d",
		"name": "LINCS Authority Service - Reconciliation Requests",
		"schema": "https://schema.getpostman.com/json/collection/v2.1.0/collection.json",
		"_exporter_id": "12729484"
	},
	"item": [
		{
			"name": "GET single query",
			"protocolProfileBehavior": {
				"disableBodyPruning": true
			},
			"request": {
				"method": "GET",
				"header": [],
				"body": {
					"mode": "raw",
					"raw": ""
				},
				"url": {
					"raw": "https://authority.lincsproject.ca/reconcile?queries={\n    \"query\": \"Tom\",\n    \"type\": \"http://www.cidoc-crm.org/cidoc-crm/E39_Actor\",\n    \"limit\": 5\n}",
					"protocol": "https",
					"host": [
						"authority",
						"lincsproject",
						"ca"
					],
					"path": [
						"reconcile"
					],
					"query": [
						{
							"key": "queries",
							"value": "{\n    \"query\": \"Tom\",\n    \"type\": \"http://www.cidoc-crm.org/cidoc-crm/E39_Actor\",\n    \"limit\": 5\n}"
						}
					]
				}
			},
			"response": []
		},
		{
			"name": "GET queries",
			"protocolProfileBehavior": {
				"disableBodyPruning": true
			},
			"request": {
				"method": "GET",
				"header": [],
				"body": {
					"mode": "urlencoded",
					"urlencoded": []
				},
				"url": {
					"raw": "https://authority.lincsproject.ca/reconcile?queries={\n    \"q1\": {\n        \"query\": \"Tom\",\n        \"type\": \"http://www.cidoc-crm.org/cidoc-crm/E39_Actor\"\n    },\n    \"q2\": {\n        \"query\": \"Annie\",\n        \"limit\": 3\n    }\n}",
					"protocol": "https",
					"host": [
						"authority",
						"lincsproject",
						"ca"
					],
					"path": [
						"reconcile"
					],
					"query": [
						{
							"key": "queries",
							"value": "{\n    \"q1\": {\n        \"query\": \"Tom\",\n        \"type\": \"http://www.cidoc-crm.org/cidoc-crm/E39_Actor\"\n    },\n    \"q2\": {\n        \"query\": \"Annie\",\n        \"limit\": 3\n    }\n}"
						}
					]
				}
			},
			"response": []
		},
		{
			"name": "POST queries",
			"request": {
				"method": "POST",
				"header": [],
				"body": {
					"mode": "urlencoded",
					"urlencoded": [
						{
							"key": "queries",
							"value": "{\n    \"q1\": {\n        \"query\": \"Tom\",\n        \"type\": \"http://www.cidoc-crm.org/cidoc-crm/E39_Actor\"\n    },\n    \"q2\": {\n        \"query\": \"Annie\",\n        \"limit\": 3\n    }\n}",
							"type": "text"
						}
					]
				},
				"url": {
					"raw": "https://authority.lincsproject.ca/reconcile",
					"protocol": "https",
					"host": [
						"authority",
						"lincsproject",
						"ca"
					],
					"path": [
						"reconcile"
					]
				}
			},
			"response": []
		},
		{
			"name": "POST single query",
			"request": {
				"method": "POST",
				"header": [],
				"body": {
					"mode": "urlencoded",
					"urlencoded": [
						{
							"key": "queries",
							"value": "{\n    \"query\": \"tom\",\n    \"limit\": 15\n}",
							"type": "text"
						}
					]
				},
				"url": {
					"raw": "https://authority.lincsproject.ca/reconcile",
					"protocol": "https",
					"host": [
						"authority",
						"lincsproject",
						"ca"
					],
					"path": [
						"reconcile"
					]
				}
			},
			"response": []
		},
		{
			"name": "POST single query - named graph filter",
			"request": {
				"method": "POST",
				"header": [],
				"body": {
					"mode": "urlencoded",
					"urlencoded": [
						{
							"key": "queries",
							"value": "{\n  \"query\": \"diary\",\n  \"type\": \"http://www.cidoc-crm.org/cidoc-crm/E55_Type\",\n  \"properties\": [\n    {\n      \"pid\": \"http://graph.lincsproject.ca/\",\n      \"v\": \"http://graph.lincsproject.ca/orlando\"\n    }\n  ],\n  \"type_strict\": \"should\"\n}",
							"type": "text"
						}
					]
				},
				"url": {
					"raw": "https://authority.lincsproject.ca/reconcile",
					"protocol": "https",
					"host": [
						"authority",
						"lincsproject",
						"ca"
					],
					"path": [
						"reconcile"
					]
				}
			},
			"response": []
		},
		{
			"name": "manifest service",
			"request": {
				"method": "GET",
				"header": [],
				"url": {
					"raw": "https://authority.lincsproject.ca/reconcile",
					"protocol": "https",
					"host": [
						"authority",
						"lincsproject",
						"ca"
					],
					"path": [
						"reconcile"
					]
				}
			},
			"response": []
		}
	]
}