{
  "$schema": "https://turbo.build/schema.json",
  "globalEnv": [
    "NEXTAUTH_URL",
    "NEXTAUTH_SECRET",
    "KEYCLOAK_ID",
    "KEYCLOAK_SECRET",
    "KEYCLOAK_ISSUER",
    "LINCS_AUTH_API_URL"
  ],
  "pipeline": {
    "build": {
      "outputs": [".next/**", "!.next/cache/**"]
    },
    "clean": {
      "cache": false
    },
    "lint": {},
    "dev": {
      "cache": false,
      "persistent": true
    }
  }
}
