<svg width="56" height="53" viewBox="0 0 56 53" fill="none" xmlns="http://www.w3.org/2000/svg">
<mask id="path-1-inside-1_1114_413" fill="white">
<path d="M0 0H56V53H0V0Z"/>
</mask>
<path d="M0 0H56V53H0V0Z" fill="white"/>
<path d="M20.4931 26.0171L29.4319 17.3266C29.8116 16.9574 30.3267 16.75 30.8638 16.75H39.475C40.5934 16.75 41.5 17.6314 41.5 18.7187V27.0908C41.5 27.6129 41.2866 28.1137 40.9069 28.4829L31.9681 37.1734C31.1773 37.9422 29.8952 37.9422 29.1043 37.1734L20.4931 28.8013C19.7023 28.0325 19.7023 26.7859 20.4931 26.0171ZM36.775 23.3125C37.8934 23.3125 38.8 22.4311 38.8 21.3437C38.8 20.2564 37.8934 19.375 36.775 19.375C35.6566 19.375 34.75 20.2564 34.75 21.3437C34.75 22.4311 35.6566 23.3125 36.775 23.3125ZM15.0931 28.8013L23.7043 37.1734C24.4951 37.9422 25.7773 37.9422 26.5681 37.1734L26.5833 37.1586L19.2402 30.0195C18.523 29.3222 18.1281 28.3952 18.1281 27.4092C18.1281 26.4232 18.5231 25.4962 19.2402 24.799L27.5192 16.75H25.4638C24.9267 16.75 24.4116 16.9574 24.0319 17.3266L15.0931 26.0171C14.3023 26.7859 14.3023 28.0325 15.0931 28.8013Z" fill="#29313A"/>
<path d="M1 53V0H-1V53H1Z" fill="#AAAAAA" mask="url(#path-1-inside-1_1114_413)"/>
</svg>
