<svg width="56" height="53" viewBox="0 0 56 53" fill="none" xmlns="http://www.w3.org/2000/svg">
<mask id="path-1-inside-1_1042_127" fill="white">
<path d="M0 0H56V53H0V0Z"/>
</mask>
<path d="M0 0H56V53H0V0Z" fill="white"/>
<path d="M29 19.4917V22.5867C29 22.9386 29.1378 23.276 29.3847 23.5245L33.0057 27.1681C33.5201 27.6856 34.3533 27.6856 34.8676 27.1681L37.6142 24.4043C38.1286 23.8868 38.1286 23.0483 37.6142 22.5308L33.9933 18.8871C33.7464 18.6387 33.411 18.5 33.0613 18.5H29.9875C29.4423 18.4979 29 18.943 29 19.4917ZM31.3043 20.1541C31.4789 20.1541 31.6463 20.2239 31.7698 20.3482C31.8933 20.4724 31.9626 20.6409 31.9626 20.8166C31.9626 20.9923 31.8933 21.1608 31.7698 21.285C31.6463 21.4093 31.4789 21.4791 31.3043 21.4791C31.1297 21.4791 30.9622 21.4093 30.8387 21.285C30.7153 21.1608 30.6459 20.9923 30.6459 20.8166C30.6459 20.6409 30.7153 20.4724 30.8387 20.3482C30.9622 20.2239 31.1297 20.1541 31.3043 20.1541Z" fill="#29313A"/>
<g clip-path="url(#clip0_1042_127)">
<path d="M28.392 24.8199L23.9962 25.2408C24.0332 25.3672 24.0607 25.4969 24.0737 25.6331L24.1116 26.0291L24.9037 25.9532L28.4679 25.6119C28.6857 25.5911 28.8468 25.3958 28.826 25.178C28.8051 24.9602 28.6098 24.799 28.392 24.8199ZM22.8856 25.7468C22.8437 25.3087 22.4558 24.9887 22.0177 25.0306L21.4237 25.0875C19.7827 25.2447 18.5808 26.7011 18.7379 28.3421L18.8517 29.5302C18.9762 30.8297 19.916 31.8537 21.118 32.1458C21.0982 32.0702 21.0859 31.994 21.0783 31.9148C21.0309 31.4197 21.2162 30.9549 21.5447 30.6287C21.4021 30.4175 21.3106 30.1665 21.2848 29.8967C21.249 29.523 21.3472 29.1664 21.5365 28.8735C21.2926 28.6221 21.1309 28.2903 21.0951 27.9166L21.0003 26.9265C20.9688 26.5973 21.2083 26.3071 21.5375 26.2756C21.8667 26.2441 22.1569 26.4836 22.1884 26.8128L22.2832 27.8028C22.3041 28.0206 22.4993 28.1818 22.7171 28.1609C22.935 28.1401 23.0961 27.9448 23.0752 27.727L22.9804 26.7369L22.8856 25.7468ZM21.904 23.8426C22.3495 23.7999 22.7746 23.9091 23.13 24.1248L28.2783 23.6318C29.152 23.5481 29.9304 24.1905 30.0141 25.0642C30.0977 25.9379 29.4554 26.7163 28.5817 26.8L26.552 26.9944C26.5963 27.1175 26.6264 27.2495 26.6395 27.3856C26.6994 28.0119 26.3875 28.5888 25.8849 28.8967C25.9659 29.0638 26.0183 29.2461 26.037 29.4416C26.0844 29.9366 25.8992 30.4015 25.5707 30.7277C25.7133 30.9389 25.8048 31.1899 25.8306 31.4597C25.9143 32.3334 25.272 33.1118 24.3982 33.1955L22.8141 33.3471L22.2201 33.404C19.9232 33.624 17.8836 31.9409 17.6637 29.644L17.5499 28.4559C17.3299 26.159 19.013 24.1194 21.3099 23.8995L21.904 23.8426ZM24.2845 32.0074C24.5023 31.9865 24.6634 31.7912 24.6426 31.5734C24.6217 31.3556 24.4264 31.1945 24.2086 31.2153L23.0205 31.3291L22.6245 31.367C22.4067 31.3879 22.2456 31.5832 22.2664 31.801C22.2873 32.0188 22.4826 32.1799 22.7004 32.1591L24.2845 32.0074ZM24.2633 27.6132C24.2764 27.7493 24.2718 27.8846 24.2517 28.014L24.3012 28.0092L25.0933 27.9334C25.3111 27.9125 25.4722 27.7172 25.4514 27.4994C25.4305 27.2816 25.2353 27.1205 25.0174 27.1413L24.2254 27.2172L24.2633 27.6132ZM23.821 29.2542L22.8309 29.349C22.6131 29.3698 22.452 29.5651 22.4728 29.7829C22.4937 30.0007 22.689 30.1619 22.9068 30.141L24.0948 30.0273L24.4909 29.9893C24.7087 29.9685 24.8698 29.7732 24.849 29.5554C24.8281 29.3376 24.6328 29.1764 24.415 29.1973L23.821 29.2542Z" fill="#29313A"/>
</g>
<path d="M1 53V0H-1V53H1Z" fill="#AAAAAA" mask="url(#path-1-inside-1_1042_127)"/>
<defs>
<clipPath id="clip0_1042_127">
<rect width="12.7307" height="12.7307" fill="white" transform="translate(17 22.7136) rotate(-5.47012)"/>
</clipPath>
</defs>
</svg>
