<svg width="56" height="53" viewBox="0 0 56 53" fill="none" xmlns="http://www.w3.org/2000/svg">
<mask id="path-1-inside-1_1114_384" fill="white">
<path d="M0 0H56V53H0V0Z"/>
</mask>
<path d="M0 0H56V53H0V0Z" fill="white"/>
<g clip-path="url(#clip0_1114_384)">
<path d="M43.2578 26.4711C43.2734 34.8777 36.4176 41.7518 28.0111 41.7578C24.3803 41.7603 21.0452 40.4947 18.4244 38.3794C17.7429 37.8294 17.6919 36.8081 18.3112 36.1888L19.0044 35.4956C19.5341 34.9659 20.3796 34.908 20.9665 35.3735C22.8974 36.9058 25.341 37.8203 28 37.8203C34.2572 37.8203 39.3203 32.7563 39.3203 26.5C39.3203 20.2428 34.2563 15.1797 28 15.1797C24.9968 15.1797 22.2692 16.3467 20.2439 18.2517L23.3664 21.3742C23.9866 21.9944 23.5474 23.0547 22.6704 23.0547H13.7266C13.1829 23.0547 12.7422 22.614 12.7422 22.0703V13.1265C12.7422 12.2495 13.8025 11.8103 14.4226 12.4304L17.4602 15.4679C20.1994 12.8502 23.9119 11.2422 28 11.2422C36.417 11.2422 43.2422 18.0578 43.2578 26.4711ZM32.1275 31.3182L32.7318 30.5412C33.2325 29.8974 33.1165 28.9697 32.4728 28.4691L29.9688 26.5215V20.1016C29.9688 19.2861 29.3077 18.625 28.4922 18.625H27.5078C26.6923 18.625 26.0312 19.2861 26.0312 20.1016V28.4473L30.0554 31.5772C30.6992 32.0778 31.6268 31.9619 32.1275 31.3182Z" fill="#29313A"/>
</g>
<path d="M1 53V0H-1V53H1Z" fill="#AAAAAA" mask="url(#path-1-inside-1_1114_384)"/>
<defs>
<clipPath id="clip0_1114_384">
<rect width="31.5" height="31.5" fill="white" transform="translate(12.25 10.75)"/>
</clipPath>
</defs>
</svg>
