<svg width="19" height="19" viewBox="0 0 19 19" fill="none" xmlns="http://www.w3.org/2000/svg">
<path d="M6.33333 3.16667H16.625V4.75H6.33333V3.16667ZM6.33333 8.70833H16.625V10.2917H6.33333V8.70833ZM6.33333 14.25H16.625V15.8333H6.33333V14.25Z" fill="#7C8283"/>
<path d="M2.90521 5.36939H2.47808L3.71346 2.47808H4.13401L5.36939 5.36939H4.94226L3.93688 2.9355H3.91059L2.90521 5.36939ZM3.06291 4.23997H4.78455V4.55056H3.06291V4.23997Z" fill="#7C8283"/>
<path d="M2.89041 11.0146V8.26096H3.92882C4.13573 8.26096 4.30638 8.29412 4.44077 8.36046C4.57517 8.42589 4.67524 8.51418 4.74098 8.62533C4.80673 8.73558 4.8396 8.85794 4.8396 8.99239C4.8396 9.11071 4.81688 9.20841 4.77144 9.2855C4.72696 9.36259 4.66798 9.42354 4.5945 9.46836C4.52199 9.51318 4.44319 9.54634 4.3581 9.56785V9.59475C4.44899 9.60012 4.54036 9.6297 4.63221 9.68349C4.72406 9.73727 4.80093 9.81435 4.86281 9.91475C4.92469 10.0151 4.95563 10.1379 4.95563 10.2832C4.95563 10.4212 4.92179 10.5453 4.8541 10.6556C4.78642 10.7658 4.67959 10.8532 4.53359 10.9178C4.38759 10.9823 4.19761 11.0146 3.96362 11.0146H2.89041ZM3.25008 10.7188H3.96362C4.19857 10.7188 4.36536 10.6767 4.46398 10.5924C4.56356 10.5072 4.61336 10.4042 4.61336 10.2832C4.61336 10.1899 4.58773 10.1039 4.53649 10.025C4.48525 9.94522 4.41225 9.88158 4.3175 9.83407C4.22274 9.78567 4.11059 9.76147 3.98103 9.76147H3.25008V10.7188ZM3.25008 9.47105H3.91722C4.0255 9.47105 4.12316 9.45133 4.21017 9.41189C4.29816 9.37245 4.36777 9.31687 4.41902 9.24516C4.47123 9.17346 4.49733 9.0892 4.49733 8.99239C4.49733 8.87138 4.45189 8.76875 4.36101 8.68449C4.27012 8.59934 4.12606 8.55676 3.92882 8.55676H3.25008V9.47105Z" fill="#7C8283"/>
<path d="M4.95634 14.1356H4.60067C4.57963 14.0376 4.54282 13.9515 4.49023 13.8773C4.4386 13.803 4.3755 13.7407 4.30092 13.6904C4.2273 13.6391 4.14555 13.6006 4.05568 13.5749C3.9658 13.5493 3.8721 13.5365 3.77458 13.5365C3.59674 13.5365 3.43563 13.5795 3.29126 13.6656C3.14784 13.7517 3.03359 13.8786 2.94849 14.0463C2.86435 14.2139 2.82228 14.4196 2.82228 14.6633C2.82228 14.907 2.86435 15.1127 2.94849 15.2803C3.03359 15.448 3.14784 15.5748 3.29126 15.661C3.43563 15.7471 3.59674 15.7901 3.77458 15.7901C3.8721 15.7901 3.9658 15.7773 4.05568 15.7517C4.14555 15.726 4.2273 15.688 4.30092 15.6376C4.3755 15.5863 4.4386 15.5235 4.49023 15.4493C4.54282 15.3742 4.57963 15.2881 4.60067 15.191H4.95634C4.92957 15.3348 4.88081 15.4635 4.81006 15.5771C4.7393 15.6907 4.65134 15.7874 4.54617 15.8671C4.44099 15.9459 4.32291 16.0059 4.19193 16.0471C4.06189 16.0883 3.92278 16.1089 3.77458 16.1089C3.52408 16.1089 3.3013 16.0503 3.10625 15.933C2.9112 15.8158 2.75775 15.649 2.64588 15.4328C2.53401 15.2166 2.47808 14.9601 2.47808 14.6633C2.47808 14.3665 2.53401 14.1099 2.64588 13.8937C2.75775 13.6775 2.9112 13.5108 3.10625 13.3935C3.3013 13.2763 3.52408 13.2176 3.77458 13.2176C3.92278 13.2176 4.06189 13.2383 4.19193 13.2795C4.32291 13.3207 4.44099 13.3812 4.54617 13.4609C4.65134 13.5397 4.7393 13.6359 4.81006 13.7495C4.88081 13.8621 4.92957 13.9909 4.95634 14.1356Z" fill="#7C8283"/>
</svg>
