<svg width="56" height="53" viewBox="0 0 56 53" fill="none" xmlns="http://www.w3.org/2000/svg">
<mask id="path-1-inside-1_1114_445" fill="white">
<path d="M0 0H56V53H0V0Z"/>
</mask>
<path d="M0 0H56V53H0V0Z" fill="white"/>
<path fill-rule="evenodd" clip-rule="evenodd" d="M38.0833 16.5H17.9167V31.625H17V32.0833H39V31.625H38.0833V16.5ZM18.8333 25.2083C19.1744 25.3789 19.5684 25.5286 19.997 25.6351L20.1404 25.7498C20.1581 25.7278 20.1761 25.7047 20.1946 25.6805C20.6645 25.78 21.1708 25.8259 21.6909 25.7908L21.9108 26.0445C22.0199 25.95 22.1375 25.8412 22.2612 25.7191C24.502 25.3041 26.8426 23.2425 27.5417 17.4167H28.4583C28.5745 20.0887 29.7331 24.5011 33.1837 25.5752C33.4222 25.8004 33.6869 25.9883 33.9806 26.1219L34.1376 25.7764C35.0175 25.8801 36.0223 25.7872 37.1667 25.4375V26.125C36.8346 26.1004 36.4478 26.1004 36.0318 26.136L35.8964 26.0006C35.8505 26.0465 35.8057 26.1011 35.7624 26.1637C35.2775 26.2219 34.7619 26.3291 34.2529 26.5015L33.9695 26.3597C33.9274 26.4438 33.8799 26.5452 33.8291 26.6614C32.2592 27.3176 30.8547 28.6545 30.75 31.1667H25.25C25.1413 29.9713 24.3525 27.8794 22.1907 26.6391C22.126 26.5166 22.0639 26.4088 22.0073 26.3183L21.8143 26.439C21.0034 26.0403 20.0196 25.7579 18.8333 25.6667V25.2083ZM21.8143 26.439L21.1593 26.8483C21.3275 27.1173 21.5845 27.6282 21.7762 28.2443C21.9685 28.8624 22.0836 29.5504 22.0039 30.188L22.9961 30.312C23.0998 29.4829 22.9475 28.6432 22.7311 27.9473C22.5715 27.4342 22.3708 26.9797 22.1907 26.6391C22.0696 26.5696 21.9442 26.5028 21.8143 26.439ZM33.8291 26.6614C33.4892 27.4384 33 28.8796 33 30.25H34C34 28.8921 34.5757 27.3833 34.8639 26.8069L34.2529 26.5015C34.1109 26.5496 33.9693 26.6028 33.8291 26.6614ZM35.7624 26.1637C35.6063 26.3893 35.4705 26.7202 35.3782 27.1331C35.2559 27.6802 35.1981 28.4222 35.2941 29.3831L36.2892 29.2836C36.2019 28.4111 36.2587 27.7781 36.3541 27.3513C36.4019 27.1376 36.4586 26.9788 36.5096 26.8688C36.5351 26.8138 36.5581 26.7732 36.5763 26.7451C36.5924 26.7204 36.6021 26.7093 36.6036 26.7077L36.6036 26.7077L36.0318 26.136C35.9432 26.1436 35.8533 26.1528 35.7624 26.1637ZM34.1376 25.7764L34.3944 25.2115C34.0121 25.0377 33.6487 24.6814 33.3147 24.1559C32.9831 23.6343 32.7037 22.9823 32.4746 22.2755C32.0162 20.8614 31.7812 19.2983 31.707 18.2964L30.7097 18.3703C30.7883 19.4309 31.0345 21.0761 31.5233 22.5839C31.7678 23.338 32.0785 24.0753 32.4707 24.6924C32.6776 25.0179 32.9139 25.3204 33.1837 25.5752C33.484 25.6687 33.8017 25.7369 34.1376 25.7764ZM22.2612 25.7191C22.834 25.1541 23.5364 24.3053 24.1211 23.2717C24.8322 22.0149 25.39 20.4478 25.2908 18.7623L24.2925 18.821C24.3767 20.2522 23.9032 21.6261 23.2508 22.7793C22.5982 23.9326 21.7874 24.8282 21.2559 25.2888L21.6909 25.7908C21.8795 25.778 22.07 25.7546 22.2612 25.7191ZM20.1946 25.6805C20.128 25.6664 20.0621 25.6512 19.997 25.6351L19.3596 25.1252C19.9082 24.4394 21.0833 22.2862 21.0833 19.4792H22.0833C22.0833 22.4586 20.8797 24.7832 20.1946 25.6805ZM34.4929 22.8997C34.1827 21.6513 33.9962 20.2252 33.9184 19.2915L34.9149 19.2085C34.9899 20.1081 35.1701 21.4779 35.4634 22.6586C35.6105 23.251 35.7809 23.7739 35.9701 24.1608C36.1755 24.5807 36.3412 24.7117 36.4081 24.734L36.0919 25.6827C35.6088 25.5217 35.2895 25.0453 35.0718 24.6001C34.838 24.122 34.6474 23.5219 34.4929 22.8997ZM19.7391 27.9203C19.6235 27.2739 19.4275 26.665 19.2858 26.3107L20.2142 25.9393C20.3781 26.3489 20.5946 27.0233 20.7234 27.7443C20.8495 28.4493 20.9068 29.2774 20.6827 29.9498L19.734 29.6336C19.8765 29.2059 19.8575 28.5827 19.7391 27.9203Z" fill="#29313A"/>
<path d="M17.8148 35.6481C17.8148 34.0731 19.0916 32.7963 20.6667 32.7963C22.2417 32.7963 23.5185 34.0731 23.5185 35.6481V36.0555H17.8148V35.6481Z" fill="#29313A"/>
<path d="M25.1481 35.6481C25.1481 34.0731 26.4249 32.7963 28 32.7963C29.575 32.7963 30.8518 34.0731 30.8518 35.6481V36.0555H25.1481V35.6481Z" fill="#29313A"/>
<path d="M32.4815 35.6481C32.4815 34.0731 33.7583 32.7963 35.3334 32.7963C36.9084 32.7963 38.1852 34.0731 38.1852 35.6481V36.0555H32.4815V35.6481Z" fill="#29313A"/>
<path d="M1 53V0H-1V53H1Z" fill="#AAAAAA" mask="url(#path-1-inside-1_1114_445)"/>
</svg>
