<svg width="56" height="53" viewBox="0 0 56 53" fill="none" xmlns="http://www.w3.org/2000/svg">
<mask id="path-1-inside-1_1114_473" fill="white">
<path d="M0 0H56V53H0V0Z"/>
</mask>
<path d="M0 0H56V53H0V0Z" fill="white"/>
<path d="M18 21.5H23.3194L25.75 24V24.5123C25.6678 24.5042 25.5844 24.5 25.5 24.5C24.1193 24.5 23 25.6193 23 27C23 28.3807 24.1193 29.5 25.5 29.5C25.5844 29.5 25.6678 29.4958 25.75 29.4877V30.5C25.75 31.0523 25.3023 31.5 24.75 31.5H18C17.4477 31.5 17 31.0523 17 30.5V22.5C17 21.9477 17.4477 21.5 18 21.5Z" fill="#29313A"/>
<path fill-rule="evenodd" clip-rule="evenodd" d="M27.8824 28.5L30 27L27.8824 25.5V26.567H24.3529C24.158 26.567 24 26.7609 24 27C24 27.2391 24.158 27.433 24.3529 27.433H27.8824V28.5Z" fill="#29313A"/>
<path d="M31 25C31 24.4484 31.4484 24 32 24H35H35.75H36H40C40.5516 24 41 24.4484 41 25V29C41 29.5516 40.5516 30 40 30H36H35.75H35H32C31.4484 30 31 29.5516 31 29V25ZM36 25V29H40V25H36ZM33.7859 25.7484C33.7359 25.6359 33.6234 25.5625 33.5 25.5625C33.3766 25.5625 33.2641 25.6359 33.2141 25.7484L32.2141 27.9984C32.1437 28.1562 32.2156 28.3406 32.3734 28.4109C32.5312 28.4812 32.7156 28.4094 32.7859 28.2516L32.925 27.9375H34.075L34.2141 28.2516C34.2844 28.4094 34.4688 28.4797 34.6266 28.4109C34.7844 28.3422 34.8547 28.1562 34.7859 27.9984L33.7859 25.7484ZM33.5 26.6437L33.7969 27.3125H33.2031L33.5 26.6437ZM38 25.5625C38.1719 25.5625 38.3125 25.7031 38.3125 25.875V25.9375H39H39.25C39.4219 25.9375 39.5625 26.0781 39.5625 26.25C39.5625 26.4219 39.4219 26.5625 39.25 26.5625H39.2188L39.1938 26.6328C39.0547 27.0141 38.8438 27.3609 38.575 27.6547C38.5891 27.6641 38.6031 27.6719 38.6172 27.6797L38.9125 27.8562C39.0609 27.9453 39.1078 28.1375 39.0203 28.2844C38.9328 28.4313 38.7391 28.4797 38.5922 28.3922L38.2969 28.2156C38.2266 28.1734 38.1594 28.1297 38.0922 28.0828C37.9266 28.2 37.75 28.3016 37.5609 28.3859L37.5047 28.4109C37.3469 28.4812 37.1625 28.4094 37.0922 28.2516C37.0219 28.0938 37.0938 27.9094 37.2516 27.8391L37.3078 27.8141C37.4078 27.7688 37.5047 27.7187 37.5969 27.6609L37.4062 27.4703C37.2844 27.3484 37.2844 27.15 37.4062 27.0281C37.5281 26.9062 37.7266 26.9062 37.8484 27.0281L38.0766 27.2562L38.0844 27.2641C38.2781 27.0594 38.4359 26.8219 38.55 26.5609H38H36.875C36.7031 26.5609 36.5625 26.4203 36.5625 26.2484C36.5625 26.0766 36.7031 25.9359 36.875 25.9359H37.6875V25.8734C37.6875 25.7016 37.8281 25.5609 38 25.5609V25.5625Z" fill="#29313A"/>
<path d="M1 53V0H-1V53H1Z" fill="#AAAAAA" mask="url(#path-1-inside-1_1114_473)"/>
</svg>
