<svg width="56" height="53" viewBox="0 0 56 53" fill="none" xmlns="http://www.w3.org/2000/svg">
<mask id="path-1-inside-1_1114_350" fill="white">
<path d="M0 0H56V53H0V0Z"/>
</mask>
<path d="M0 0H56V53H0V0Z" fill="white"/>
<path d="M17.2837 30.4505V16.0462C14.9211 15.7072 13.543 17.3171 13.1492 18.1645V32.1451C13.543 31.4861 14.9211 30.2246 17.2837 30.4505Z" fill="#29313A"/>
<path fill-rule="evenodd" clip-rule="evenodd" d="M29.0566 31.7667C28.997 31.2475 28.7201 30.819 28.2703 30.3507C28.2529 30.3326 28.2024 30.2821 28.1423 30.2218C28.0289 30.1082 27.881 29.9602 27.8556 29.93C27.5368 29.5487 27.3371 29.089 27.2794 28.604C27.2217 28.1189 27.3085 27.6281 27.5297 27.1881C27.751 26.7481 28.0976 26.3768 28.5298 26.117C28.962 25.8571 29.4621 25.7193 29.9726 25.7194C30.4831 25.7195 30.9832 25.8575 31.4152 26.1175C31.8473 26.3775 32.1938 26.749 32.4148 27.1891C32.6359 27.6291 32.7224 28.12 32.6646 28.6051C32.6067 29.0901 32.4067 29.5497 32.0877 29.9308C32.0615 29.9621 31.9019 30.122 31.7869 30.2371C31.7335 30.2906 31.6897 30.3344 31.6735 30.3511C31.2241 30.819 30.9473 31.2475 30.8877 31.7667H29.0566ZM29.6768 30.4708C29.6768 30.3148 29.809 30.1884 29.9721 30.1884H29.9761C30.1392 30.1884 30.2714 30.3148 30.2714 30.4708C30.2714 30.6268 30.1392 30.7532 29.9761 30.7532H29.9721C29.809 30.7532 29.6768 30.6268 29.6768 30.4708ZM30.2675 27.0151C30.2675 26.8591 30.1352 26.7327 29.9721 26.7327C29.809 26.7327 29.6768 26.8591 29.6768 27.0151V28.7429C29.6768 28.8989 29.809 29.0254 29.9721 29.0254C30.1352 29.0254 30.2675 28.8989 30.2675 28.7429V27.0151Z" fill="#29313A"/>
<path d="M29.0688 33.0626V32.6306H30.8755V33.0626H29.0688Z" fill="#29313A"/>
<path fill-rule="evenodd" clip-rule="evenodd" d="M41.5 19.0118H18.1698V31.5803C13.9172 31.4673 12.9525 33.6044 13.0018 34.6871C13.3561 37.7374 16.5948 38.3117 18.1698 38.2176L41.5 38.5V19.0118ZM22.033 33.7932L22.0329 33.2699L21.4336 33.27L21.4319 22.4547L22.0312 22.4545L22.0311 21.9312L20.383 21.9316L20.383 22.4549L20.8325 22.4548L20.8343 33.2702L20.3848 33.2703L20.3849 33.7936L22.033 33.7932ZM20.797 36.2189L20.3833 36.219L20.383 34.6427L20.7968 34.6426L20.7968 35.0725L38.8694 35.069L38.8693 34.641L39.2831 34.6409L39.2833 36.2172L38.8696 36.2172L38.8695 35.6422L20.7969 35.6457L20.797 36.2189ZM27.952 20.64C28.8055 20.5569 29.6675 20.6689 30.4669 20.967C31.2663 21.265 31.9802 21.7404 32.5497 22.3541C33.0683 22.9129 33.4537 23.5717 33.6804 24.2849H34.2633C35.0654 24.2858 35.8428 24.5505 36.4649 25.0347C37.0871 25.5189 37.5161 26.1931 37.68 26.944C37.8439 27.695 37.7328 28.477 37.3651 29.1588C36.9975 29.8406 36.3959 30.3807 35.6611 30.6885C35.5117 30.7511 35.3376 30.686 35.2721 30.5431C35.2067 30.4002 35.2748 30.2336 35.4242 30.1711C36.0347 29.9153 36.5347 29.4665 36.8402 28.8999C37.1457 28.3333 37.2381 27.6835 37.1018 27.0595C36.9656 26.4354 36.6091 25.8752 36.0921 25.4729C35.5751 25.0705 34.9291 24.8505 34.2626 24.8497H33.4567C33.3221 24.8497 33.2044 24.7626 33.1708 24.6379C32.9797 23.9301 32.6154 23.2758 32.108 22.7291C31.6006 22.1824 30.9646 21.7588 30.2524 21.4933C29.5402 21.2277 28.7723 21.1279 28.0118 21.2019C27.2514 21.276 26.5202 21.5218 25.8786 21.9192C25.237 22.3166 24.7033 22.8541 24.3216 23.4874C23.9398 24.1207 23.7209 24.8318 23.6829 25.5619C23.6449 26.292 23.7888 27.0204 24.1029 27.6868C24.417 28.3533 24.8922 28.9389 25.4893 29.3952C25.6167 29.4926 25.6375 29.6703 25.5356 29.7922C25.4338 29.914 25.248 29.9339 25.1206 29.8365C24.4503 29.3243 23.9169 28.667 23.5644 27.9189C23.2119 27.1708 23.0503 26.3533 23.093 25.5338C23.1357 24.7143 23.3814 23.9162 23.8099 23.2053C24.2384 22.4944 24.8374 21.8911 25.5576 21.4451C26.2777 20.999 27.0984 20.7231 27.952 20.64ZM26.382 28.7028C26.4591 29.3496 26.7257 29.9625 27.151 30.4708C27.2156 30.5477 27.3042 30.635 27.4023 30.7317C27.7305 31.0552 28.1655 31.4839 28.1655 31.9827V33.0626C28.1655 33.2917 28.2606 33.5115 28.4301 33.6735C28.5995 33.8355 28.8292 33.9265 29.0688 33.9265H30.8755C31.115 33.9265 31.3448 33.8355 31.5142 33.6735C31.6836 33.5115 31.7788 33.2917 31.7788 33.0626V31.9827C31.7788 31.4835 32.2141 31.0546 32.5421 30.7315C32.6398 30.6351 32.728 30.5482 32.7923 30.4717C33.2179 29.9635 33.4847 29.3507 33.562 28.7039C33.6393 28.057 33.524 27.4024 33.2293 26.8155C32.9346 26.2286 32.4726 25.7333 31.8964 25.3866C31.3202 25.0398 30.6534 24.8558 29.9726 24.8557C29.2919 24.8556 28.6249 25.0394 28.0487 25.386C27.4724 25.7325 27.0102 26.2277 26.7153 26.8145C26.4204 27.4014 26.3049 28.0559 26.382 28.7028Z" fill="#29313A"/>
<path d="M1 53V0H-1V53H1Z" fill="#AAAAAA" mask="url(#path-1-inside-1_1114_350)"/>
</svg>
