<svg width="46" height="45" viewBox="0 0 46 45" fill="none" xmlns="http://www.w3.org/2000/svg">
<g id="Transfer of Custody">
<g id="Subtract">
<path fill-rule="evenodd" clip-rule="evenodd" d="M23 20.4375V14.8125H29V20.4375H23ZM26.4688 16.043C26.4688 15.8013 26.2578 15.6035 26 15.6035V15.6013C25.7422 15.6013 25.5312 15.7991 25.5312 16.0408V16.1287H24.3125C24.0547 16.1287 23.8438 16.3264 23.8438 16.5681C23.8438 16.8098 24.0547 17.0076 24.3125 17.0076H26.825C26.6539 17.3745 26.4172 17.7085 26.1266 17.9963L25.7727 17.6646C25.5898 17.4932 25.2922 17.4932 25.1094 17.6646C24.9266 17.8359 24.9266 18.115 25.1094 18.2864L25.3953 18.5544C25.257 18.6357 25.1117 18.7061 24.9617 18.7698L24.8773 18.8049C24.6406 18.9038 24.5328 19.1631 24.6383 19.385C24.7438 19.6069 25.0203 19.708 25.257 19.6091L25.3414 19.574C25.625 19.4553 25.8898 19.3125 26.1383 19.1477C26.2391 19.2136 26.3398 19.2751 26.4453 19.3345L26.8883 19.5828C27.1086 19.7058 27.3992 19.6377 27.5305 19.4312C27.6617 19.2246 27.5914 18.9543 27.3688 18.8291L26.9258 18.5808C26.9047 18.5698 26.8836 18.5588 26.8625 18.5457C27.2656 18.1326 27.582 17.6448 27.7906 17.1086L27.8281 17.0098H27.875C28.1328 17.0098 28.3438 16.812 28.3438 16.5703C28.3438 16.3286 28.1328 16.1309 27.875 16.1309H26.4688V16.043Z" fill="#29313A"/>
<path fill-rule="evenodd" clip-rule="evenodd" d="M19.25 15.6035C19.4352 15.6035 19.6039 15.7068 19.6789 15.865L21.1789 19.0291C21.282 19.251 21.1766 19.5125 20.9398 19.6091C20.7031 19.7058 20.4266 19.6069 20.3211 19.385L20.1125 18.9434H18.3875L18.1789 19.385C18.0734 19.6069 17.7969 19.708 17.5602 19.6091C17.3234 19.5103 17.2156 19.251 17.3211 19.0291L18.8211 15.865C18.8961 15.7068 19.0648 15.6035 19.25 15.6035ZM19.6953 18.0645L19.25 17.124L18.8047 18.0645H19.6953Z" fill="#29313A"/>
<path fill-rule="evenodd" clip-rule="evenodd" d="M39.5 12C39.5 11.1716 38.8284 10.5 38 10.5H8C7.17157 10.5 6.5 11.1716 6.5 12V24C6.5 24.8284 7.17157 25.5 8 25.5H21.5V37.5H24.5V25.5H38C38.8284 25.5 39.5 24.8284 39.5 24V12ZM17 13.4062C16.1727 13.4062 15.5 14.0369 15.5 14.8125V20.4375C15.5 21.2131 16.1727 21.8438 17 21.8438H29C29.8273 21.8438 30.5 21.2131 30.5 20.4375V14.8125C30.5 14.0369 29.8273 13.4062 29 13.4062H17Z" fill="#29313A"/>
</g>
</g>
</svg>
