<svg width="24" height="12" viewBox="0 0 24 12" fill="none" xmlns="http://www.w3.org/2000/svg">
<path fill-rule="evenodd" clip-rule="evenodd" d="M0 0H24V2H0V0ZM0 5H24V7H0V5ZM24 10H0V12H24V10Z" fill="#353a42"/>
</svg>
