<svg width="12" height="10" viewBox="0 0 12 10" fill="none" xmlns="http://www.w3.org/2000/svg">
<path d="M12 9.5C11 4.0001 9.5 3.49984 8 3C6.5 2.50016 4 2.18311 4 2.18311V7.72309C7 7.00019 10 7.99994 12 9.5Z" fill="#353A42"/>
<path d="M-2.18557e-07 5L6 0.669872L6 9.33013L-2.18557e-07 5Z" fill="#353A42"/>
</svg>
