-- Merging decision tree log ---
manifest
ADDED from /Volumes/Work/Source/Projects/VNPost/MyVNpost_Mapbox/react-native-vmaps/android/src/main/AndroidManifest.xml:1:1-4:12
INJECTED from /Volumes/Work/Source/Projects/VNPost/MyVNpost_Mapbox/react-native-vmaps/android/src/main/AndroidManifest.xml:1:1-4:12
INJECTED from /Volumes/Work/Source/Projects/VNPost/MyVNpost_Mapbox/react-native-vmaps/android/src/main/AndroidManifest.xml:1:1-4:12
INJECTED from /Volumes/Work/Source/Projects/VNPost/MyVNpost_Mapbox/react-native-vmaps/android/src/main/AndroidManifest.xml:1:1-4:12
INJECTED from /Volumes/Work/Source/Projects/VNPost/MyVNpost_Mapbox/react-native-vmaps/android/src/main/AndroidManifest.xml:1:1-4:12
INJECTED from /Volumes/Work/Source/Projects/VNPost/MyVNpost_Mapbox/react-native-vmaps/android/src/main/AndroidManifest.xml:1:1-4:12
INJECTED from /Volumes/Work/Source/Projects/VNPost/MyVNpost_Mapbox/react-native-vmaps/android/src/main/AndroidManifest.xml:1:1-4:12
	package
		ADDED from /Volumes/Work/Source/Projects/VNPost/MyVNpost_Mapbox/react-native-vmaps/android/src/main/AndroidManifest.xml:1:70-94
		INJECTED from /Volumes/Work/Source/Projects/VNPost/MyVNpost_Mapbox/react-native-vmaps/android/src/main/AndroidManifest.xml
		INJECTED from /Volumes/Work/Source/Projects/VNPost/MyVNpost_Mapbox/react-native-vmaps/android/src/main/AndroidManifest.xml
	android:versionName
		INJECTED from /Volumes/Work/Source/Projects/VNPost/MyVNpost_Mapbox/react-native-vmaps/android/src/main/AndroidManifest.xml
		ADDED from /Volumes/Work/Source/Projects/VNPost/MyVNpost_Mapbox/react-native-vmaps/android/src/main/AndroidManifest.xml:1:1-4:12
		INJECTED from /Volumes/Work/Source/Projects/VNPost/MyVNpost_Mapbox/react-native-vmaps/android/src/main/AndroidManifest.xml
	android:versionCode
		INJECTED from /Volumes/Work/Source/Projects/VNPost/MyVNpost_Mapbox/react-native-vmaps/android/src/main/AndroidManifest.xml
		ADDED from /Volumes/Work/Source/Projects/VNPost/MyVNpost_Mapbox/react-native-vmaps/android/src/main/AndroidManifest.xml:1:1-4:12
		INJECTED from /Volumes/Work/Source/Projects/VNPost/MyVNpost_Mapbox/react-native-vmaps/android/src/main/AndroidManifest.xml
	xmlns:android
		ADDED from /Volumes/Work/Source/Projects/VNPost/MyVNpost_Mapbox/react-native-vmaps/android/src/main/AndroidManifest.xml:1:11-69
uses-permission#android.permission.INTERNET
ADDED from /Volumes/Work/Source/Projects/VNPost/MyVNpost_Mapbox/react-native-vmaps/android/src/main/AndroidManifest.xml:2:5-67
	android:name
		ADDED from /Volumes/Work/Source/Projects/VNPost/MyVNpost_Mapbox/react-native-vmaps/android/src/main/AndroidManifest.xml:2:22-64
uses-permission#android.permission.ACCESS_FINE_LOCATION
ADDED from /Volumes/Work/Source/Projects/VNPost/MyVNpost_Mapbox/react-native-vmaps/android/src/main/AndroidManifest.xml:3:5-78
	android:name
		ADDED from /Volumes/Work/Source/Projects/VNPost/MyVNpost_Mapbox/react-native-vmaps/android/src/main/AndroidManifest.xml:3:22-76
uses-sdk
INJECTED from /Volumes/Work/Source/Projects/VNPost/MyVNpost_Mapbox/react-native-vmaps/android/src/main/AndroidManifest.xml reason: use-sdk injection requested
INJECTED from /Volumes/Work/Source/Projects/VNPost/MyVNpost_Mapbox/react-native-vmaps/android/src/main/AndroidManifest.xml
INJECTED from /Volumes/Work/Source/Projects/VNPost/MyVNpost_Mapbox/react-native-vmaps/android/src/main/AndroidManifest.xml
INJECTED from /Volumes/Work/Source/Projects/VNPost/MyVNpost_Mapbox/react-native-vmaps/android/src/main/AndroidManifest.xml
INJECTED from /Volumes/Work/Source/Projects/VNPost/MyVNpost_Mapbox/react-native-vmaps/android/src/main/AndroidManifest.xml
	android:targetSdkVersion
		INJECTED from /Volumes/Work/Source/Projects/VNPost/MyVNpost_Mapbox/react-native-vmaps/android/src/main/AndroidManifest.xml
		ADDED from /Volumes/Work/Source/Projects/VNPost/MyVNpost_Mapbox/react-native-vmaps/android/src/main/AndroidManifest.xml
		INJECTED from /Volumes/Work/Source/Projects/VNPost/MyVNpost_Mapbox/react-native-vmaps/android/src/main/AndroidManifest.xml
	android:minSdkVersion
		INJECTED from /Volumes/Work/Source/Projects/VNPost/MyVNpost_Mapbox/react-native-vmaps/android/src/main/AndroidManifest.xml
		ADDED from /Volumes/Work/Source/Projects/VNPost/MyVNpost_Mapbox/react-native-vmaps/android/src/main/AndroidManifest.xml
		INJECTED from /Volumes/Work/Source/Projects/VNPost/MyVNpost_Mapbox/react-native-vmaps/android/src/main/AndroidManifest.xml
