{
  "name": "NoUseFrameworks-MapboxMobileEvents",
  "version": "0.10.2",
  "summary": "Mapbox Mobile Events",
  "description": "This is a workaround that allows consumption of Mapbox-iOS-SDK without use_frameworks!. Mapbox Mobile Events collects usage information to help Mapbox improve its products.",
  "homepage": "https://gitlab.com/caka.ict/react-native-vmaps",
  "license": {
    "type": "ISC",
    "file": "LICENSE.md"
  },
  "authors": {
    "Mapbox": "mobile@mapbox.com"
  },
  "screenshots": "https://docs.mapbox.com/ios/api/maps/5.7.0/img/screenshot.png",
  "social_media_url": "https://twitter.com/mapbox",
  "source": {
    "http": "https://mapbox.s3.amazonaws.com/mapbox-gl-native/ios/builds/mapbox-ios-sdk-5.7.0-dynamic-with-events.zip",
    "flatten": true
  },
  "platforms": {
    "ios": "9.0"
  },
  "requires_arc": true,
  "vendored_frameworks":  "dynamic/MapboxMobileEvents.framework",
  "module_name": "MapboxMobileEvents",
  "preserve_paths": "**/*.bcsymbolmap"
}
