{
     "pageFormat": {
         "pageLength": 33,
         "pageWidth": 85,
         "usePageLengthFromPrinter": false
     },
     "template": {
         "header": [ 
             "${namaToko:65}HAL: %{PAGE_NO}",
             "${alamatToko1:65}",
             "${alamatToko2:65}"
         ],
         "detail": [
             " Nomor Faktur: ${nomorFaktur:20}",
             {
                "table": "listItem",
                "border": true,
                "columns": [
                    { "caption": "NO", "source": "row", "width": 4},
                    { "caption": "Nama Barang", "source": "namaBarang", "width": 30, "wrap": false },
                    { "caption": "Qty", "source": "qty::right", "width": 5 },
                    { "caption": "SATUAN", "source": "", "width": 4 },
                    { "caption": "Harga", "source": "harga::right", "width": 10},
                    { "caption": "Biaya", "source": "0::right", "width": 12},
                    { "caption": "Sub Total", "source": "harga::right", "width": 10}
                ]
             }
         ]
     }
 }